Test results for amd64, saber214, crypto_aead/omdsha256k256n248tau256v1

[Page version: 20250326 01:21:01]

Measurements for amd64, saber214, crypto_aead Test results for amd64, saber214, crypto_aead Test results for crypto_aead/omdsha256k256n248tau256v1
Computer: saber214
Microarchitecture: amd64; Bulldozer (600f20)
Architecture: amd64
CPU ID: AuthenticAMD-00600f20-1789c3f5
SUPERCOP version: 20250307
Operation: crypto_aead
Primitive: omdsha256k256n248tau256v1
TimeObject sizeTest sizeImplementationCompilerBenchmark dateSUPERCOP version
28107715966 0 038733 784 928T:refgcc -march=native -mtune=native -O3 -fwrapv -fPIC -fPIE -gdwarf-4 -Wall2025031120250307
31748010611 0 031220 816 856T:refclang -march=native -O2 -fwrapv -Qunused-arguments -fPIC -fPIE -gdwarf-4 -Wall2025031120250307
31822011906 0 033748 816 856T:refclang -mcpu=native -O3 -fwrapv -Qunused-arguments -fPIC -fPIE -gdwarf-4 -Wall2025031120250307
31885710008 0 032996 816 872T:refclang -march=native -O3 -fwrapv -Qunused-arguments -fPIC -fPIE -gdwarf-4 -Wall2025031120250307
3457624403 0 023526 808 856T:refclang -march=native -Os -fwrapv -Qunused-arguments -fPIC -fPIE -gdwarf-4 -Wall2025031120250307
3557866731 0 028029 784 928T:refgcc -march=native -mtune=native -O2 -fwrapv -fPIC -fPIE -gdwarf-4 -Wall2025031120250307
3593516242 0 027004 776 928T:refgcc -march=native -mtune=native -O -fwrapv -fPIC -fPIE -gdwarf-4 -Wall2025031120250307
3697595633 0 025060 816 856T:refclang -march=native -O -fwrapv -Qunused-arguments -fPIC -fPIE -gdwarf-4 -Wall2025031120250307
4109474604 0 023632 760 896T:refgcc -march=native -mtune=native -Os -fwrapv -fPIC -fPIE -gdwarf-4 -Wall2025031120250307

Compiler output


try.c: /usr/bin/ld: libcrypto_aead_omdsha256k256n248tau256v1.a(omdsha256.o):.../supercop-data/saber214/amd64/try/c/clang_-march=native_-O2_-fwrapv_-Qunused-arguments_-fPIC_-fPIE_-gdwarf-4_-Wall/timingleaks/crypto_aead/omdsha256k256n248tau256v1/avx1/work/./omdsha256.h:137: multiple definition of `Hash'; libcrypto_aead_omdsha256k256n248tau256v1.a(encrypt.o):.../supercop-data/saber214/amd64/try/c/clang_-march=native_-O2_-fwrapv_-Qunused-arguments_-fPIC_-fPIE_-gdwarf-4_-Wall/timingleaks/crypto_aead/omdsha256k256n248tau256v1/avx1/work/./omdsha256.h:137: first defined here
try.c: clang: error: linker command failed with exit code 1 (use -v to see invocation)

Number of similar (implementation,compiler) pairs: 1, namely:
ImplementationCompiler
T:avx1clang -march=native -O2 -fwrapv -Qunused-arguments -fPIC -fPIE -gdwarf-4 -Wall (Ubuntu_Clang_14.0.0)

Compiler output


try.c: /usr/bin/ld: libcrypto_aead_omdsha256k256n248tau256v1.a(omdsha256.o):.../supercop-data/saber214/amd64/try/c/clang_-march=native_-O3_-fwrapv_-Qunused-arguments_-fPIC_-fPIE_-gdwarf-4_-Wall/timingleaks/crypto_aead/omdsha256k256n248tau256v1/avx1/work/./omdsha256.h:137: multiple definition of `Hash'; libcrypto_aead_omdsha256k256n248tau256v1.a(encrypt.o):.../supercop-data/saber214/amd64/try/c/clang_-march=native_-O3_-fwrapv_-Qunused-arguments_-fPIC_-fPIE_-gdwarf-4_-Wall/timingleaks/crypto_aead/omdsha256k256n248tau256v1/avx1/work/./omdsha256.h:137: first defined here
try.c: clang: error: linker command failed with exit code 1 (use -v to see invocation)

Number of similar (implementation,compiler) pairs: 1, namely:
ImplementationCompiler
T:avx1clang -march=native -O3 -fwrapv -Qunused-arguments -fPIC -fPIE -gdwarf-4 -Wall (Ubuntu_Clang_14.0.0)

Compiler output


try.c: /usr/bin/ld: libcrypto_aead_omdsha256k256n248tau256v1.a(omdsha256.o):.../supercop-data/saber214/amd64/try/c/clang_-march=native_-O_-fwrapv_-Qunused-arguments_-fPIC_-fPIE_-gdwarf-4_-Wall/timingleaks/crypto_aead/omdsha256k256n248tau256v1/avx1/work/./omdsha256.h:137: multiple definition of `Hash'; libcrypto_aead_omdsha256k256n248tau256v1.a(encrypt.o):.../supercop-data/saber214/amd64/try/c/clang_-march=native_-O_-fwrapv_-Qunused-arguments_-fPIC_-fPIE_-gdwarf-4_-Wall/timingleaks/crypto_aead/omdsha256k256n248tau256v1/avx1/work/./omdsha256.h:137: first defined here
try.c: clang: error: linker command failed with exit code 1 (use -v to see invocation)

Number of similar (implementation,compiler) pairs: 1, namely:
ImplementationCompiler
T:avx1clang -march=native -O -fwrapv -Qunused-arguments -fPIC -fPIE -gdwarf-4 -Wall (Ubuntu_Clang_14.0.0)

Compiler output


try.c: /usr/bin/ld: libcrypto_aead_omdsha256k256n248tau256v1.a(omdsha256.o):.../supercop-data/saber214/amd64/try/c/clang_-march=native_-Os_-fwrapv_-Qunused-arguments_-fPIC_-fPIE_-gdwarf-4_-Wall/timingleaks/crypto_aead/omdsha256k256n248tau256v1/avx1/work/./omdsha256.h:137: multiple definition of `Hash'; libcrypto_aead_omdsha256k256n248tau256v1.a(encrypt.o):.../supercop-data/saber214/amd64/try/c/clang_-march=native_-Os_-fwrapv_-Qunused-arguments_-fPIC_-fPIE_-gdwarf-4_-Wall/timingleaks/crypto_aead/omdsha256k256n248tau256v1/avx1/work/./omdsha256.h:137: first defined here
try.c: clang: error: linker command failed with exit code 1 (use -v to see invocation)

Number of similar (implementation,compiler) pairs: 1, namely:
ImplementationCompiler
T:avx1clang -march=native -Os -fwrapv -Qunused-arguments -fPIC -fPIE -gdwarf-4 -Wall (Ubuntu_Clang_14.0.0)

Compiler output


try.c: /usr/bin/ld: libcrypto_aead_omdsha256k256n248tau256v1.a(omdsha256.o):.../supercop-data/saber214/amd64/try/c/clang_-mcpu=native_-O3_-fwrapv_-Qunused-arguments_-fPIC_-fPIE_-gdwarf-4_-Wall/timingleaks/crypto_aead/omdsha256k256n248tau256v1/avx1/work/./omdsha256.h:137: multiple definition of `Hash'; libcrypto_aead_omdsha256k256n248tau256v1.a(encrypt.o):.../supercop-data/saber214/amd64/try/c/clang_-mcpu=native_-O3_-fwrapv_-Qunused-arguments_-fPIC_-fPIE_-gdwarf-4_-Wall/timingleaks/crypto_aead/omdsha256k256n248tau256v1/avx1/work/./omdsha256.h:137: first defined here
try.c: clang: error: linker command failed with exit code 1 (use -v to see invocation)

Number of similar (implementation,compiler) pairs: 1, namely:
ImplementationCompiler
T:avx1clang -mcpu=native -O3 -fwrapv -Qunused-arguments -fPIC -fPIE -gdwarf-4 -Wall (Ubuntu_Clang_14.0.0)

Compiler output


encrypt.c: /tmp/ccJhaKyd.s: Assembler messages:
encrypt.c: /tmp/ccJhaKyd.s:923: Warning: dwarf line number information for .data ignored
encrypt.c: /tmp/ccJhaKyd.s:925: Warning: dwarf line number information for .data ignored
encrypt.c: /tmp/ccJhaKyd.s:927: Warning: dwarf line number information for .data ignored
encrypt.c: /tmp/ccJhaKyd.s:928: Warning: dwarf line number information for .data ignored
encrypt.c: /tmp/ccJhaKyd.s:929: Warning: dwarf line number information for .data ignored
encrypt.c: /tmp/ccJhaKyd.s:939: Warning: dwarf line number information for .data ignored
encrypt.c: /tmp/ccJhaKyd.s:941: Warning: dwarf line number information for .data ignored
encrypt.c: /tmp/ccJhaKyd.s:948: Warning: dwarf line number information for .data ignored
encrypt.c: /tmp/ccJhaKyd.s:951: Warning: dwarf line number information for .data ignored
encrypt.c: /tmp/ccJhaKyd.s:952: Warning: dwarf line number information for .data ignored
encrypt.c: /tmp/ccJhaKyd.s:959: Warning: dwarf line number information for .data ignored
encrypt.c: /tmp/ccJhaKyd.s:960: Warning: dwarf line number information for .data ignored
encrypt.c: /tmp/ccJhaKyd.s:963: Warning: dwarf line number information for .data ignored
encrypt.c: /tmp/ccJhaKyd.s:965: Warning: dwarf line number information for .data ignored
encrypt.c: /tmp/ccJhaKyd.s:968: Warning: dwarf line number information for .data ignored
encrypt.c: /tmp/ccJhaKyd.s:976: Warning: dwarf line number information for .data ignored
encrypt.c: /tmp/ccJhaKyd.s:988: Warning: dwarf line number information for .data ignored
encrypt.c: /tmp/ccJhaKyd.s:990: Warning: dwarf line number information for .data ignored
encrypt.c: /tmp/ccJhaKyd.s:992: Warning: dwarf line number information for .data ignored
encrypt.c: /tmp/ccJhaKyd.s:993: Warning: dwarf line number information for .data ignored
encrypt.c: /tmp/ccJhaKyd.s:994: Warning: dwarf line number information for .data ignored
encrypt.c: /tmp/ccJhaKyd.s:1004: Warning: dwarf line number information for .data ignored
encrypt.c: /tmp/ccJhaKyd.s:1006: Warning: dwarf line number information for .data ignored
encrypt.c: /tmp/ccJhaKyd.s:1009: Warning: dwarf line number information for .data ignored
encrypt.c: ...

Number of similar (implementation,compiler) pairs: 1, namely:
ImplementationCompiler
T:avx1gcc -march=native -mtune=native -O2 -fwrapv -fPIC -fPIE -gdwarf-4 -Wall (11.4.0)

Compiler output


encrypt.c: /tmp/ccg8lsjO.s: Assembler messages:
encrypt.c: /tmp/ccg8lsjO.s:923: Warning: dwarf line number information for .data ignored
encrypt.c: /tmp/ccg8lsjO.s:925: Warning: dwarf line number information for .data ignored
encrypt.c: /tmp/ccg8lsjO.s:927: Warning: dwarf line number information for .data ignored
encrypt.c: /tmp/ccg8lsjO.s:928: Warning: dwarf line number information for .data ignored
encrypt.c: /tmp/ccg8lsjO.s:929: Warning: dwarf line number information for .data ignored
encrypt.c: /tmp/ccg8lsjO.s:939: Warning: dwarf line number information for .data ignored
encrypt.c: /tmp/ccg8lsjO.s:941: Warning: dwarf line number information for .data ignored
encrypt.c: /tmp/ccg8lsjO.s:948: Warning: dwarf line number information for .data ignored
encrypt.c: /tmp/ccg8lsjO.s:951: Warning: dwarf line number information for .data ignored
encrypt.c: /tmp/ccg8lsjO.s:952: Warning: dwarf line number information for .data ignored
encrypt.c: /tmp/ccg8lsjO.s:959: Warning: dwarf line number information for .data ignored
encrypt.c: /tmp/ccg8lsjO.s:960: Warning: dwarf line number information for .data ignored
encrypt.c: /tmp/ccg8lsjO.s:963: Warning: dwarf line number information for .data ignored
encrypt.c: /tmp/ccg8lsjO.s:965: Warning: dwarf line number information for .data ignored
encrypt.c: /tmp/ccg8lsjO.s:968: Warning: dwarf line number information for .data ignored
encrypt.c: /tmp/ccg8lsjO.s:976: Warning: dwarf line number information for .data ignored
encrypt.c: /tmp/ccg8lsjO.s:988: Warning: dwarf line number information for .data ignored
encrypt.c: /tmp/ccg8lsjO.s:990: Warning: dwarf line number information for .data ignored
encrypt.c: /tmp/ccg8lsjO.s:992: Warning: dwarf line number information for .data ignored
encrypt.c: /tmp/ccg8lsjO.s:993: Warning: dwarf line number information for .data ignored
encrypt.c: /tmp/ccg8lsjO.s:994: Warning: dwarf line number information for .data ignored
encrypt.c: /tmp/ccg8lsjO.s:1004: Warning: dwarf line number information for .data ignored
encrypt.c: /tmp/ccg8lsjO.s:1006: Warning: dwarf line number information for .data ignored
encrypt.c: /tmp/ccg8lsjO.s:1009: Warning: dwarf line number information for .data ignored
encrypt.c: ...

Number of similar (implementation,compiler) pairs: 1, namely:
ImplementationCompiler
T:avx1gcc -march=native -mtune=native -O3 -fwrapv -fPIC -fPIE -gdwarf-4 -Wall (11.4.0)

Compiler output


encrypt.c: /tmp/ccMglHUU.s: Assembler messages:
encrypt.c: /tmp/ccMglHUU.s:921: Warning: dwarf line number information for .data ignored
encrypt.c: /tmp/ccMglHUU.s:923: Warning: dwarf line number information for .data ignored
encrypt.c: /tmp/ccMglHUU.s:935: Warning: dwarf line number information for .data ignored
encrypt.c: /tmp/ccMglHUU.s:936: Warning: dwarf line number information for .data ignored
encrypt.c: /tmp/ccMglHUU.s:937: Warning: dwarf line number information for .data ignored
encrypt.c: /tmp/ccMglHUU.s:944: Warning: dwarf line number information for .data ignored
encrypt.c: /tmp/ccMglHUU.s:947: Warning: dwarf line number information for .data ignored
encrypt.c: /tmp/ccMglHUU.s:948: Warning: dwarf line number information for .data ignored
encrypt.c: /tmp/ccMglHUU.s:953: Warning: dwarf line number information for .data ignored
encrypt.c: /tmp/ccMglHUU.s:954: Warning: dwarf line number information for .data ignored
encrypt.c: /tmp/ccMglHUU.s:957: Warning: dwarf line number information for .data ignored
encrypt.c: /tmp/ccMglHUU.s:959: Warning: dwarf line number information for .data ignored
encrypt.c: /tmp/ccMglHUU.s:962: Warning: dwarf line number information for .data ignored
encrypt.c: /tmp/ccMglHUU.s:970: Warning: dwarf line number information for .data ignored
encrypt.c: /tmp/ccMglHUU.s:980: Warning: dwarf line number information for .data ignored
encrypt.c: /tmp/ccMglHUU.s:982: Warning: dwarf line number information for .data ignored
encrypt.c: /tmp/ccMglHUU.s:995: Warning: dwarf line number information for .data ignored
encrypt.c: /tmp/ccMglHUU.s:999: Warning: dwarf line number information for .data ignored
encrypt.c: /tmp/ccMglHUU.s:1000: Warning: dwarf line number information for .data ignored
encrypt.c: /tmp/ccMglHUU.s:1001: Warning: dwarf line number information for .data ignored
encrypt.c: /tmp/ccMglHUU.s:1008: Warning: dwarf line number information for .data ignored
encrypt.c: /tmp/ccMglHUU.s:1011: Warning: dwarf line number information for .data ignored
encrypt.c: /tmp/ccMglHUU.s:1014: Warning: dwarf line number information for .data ignored
encrypt.c: /tmp/ccMglHUU.s:1017: Warning: dwarf line number information for .data ignored
encrypt.c: ...

Number of similar (implementation,compiler) pairs: 1, namely:
ImplementationCompiler
T:avx1gcc -march=native -mtune=native -O -fwrapv -fPIC -fPIE -gdwarf-4 -Wall (11.4.0)

Compiler output


encrypt.c: /tmp/ccCKtJgz.s: Assembler messages:
encrypt.c: /tmp/ccCKtJgz.s:921: Warning: dwarf line number information for .data ignored
encrypt.c: /tmp/ccCKtJgz.s:923: Warning: dwarf line number information for .data ignored
encrypt.c: /tmp/ccCKtJgz.s:925: Warning: dwarf line number information for .data ignored
encrypt.c: /tmp/ccCKtJgz.s:926: Warning: dwarf line number information for .data ignored
encrypt.c: /tmp/ccCKtJgz.s:927: Warning: dwarf line number information for .data ignored
encrypt.c: /tmp/ccCKtJgz.s:937: Warning: dwarf line number information for .data ignored
encrypt.c: /tmp/ccCKtJgz.s:940: Warning: dwarf line number information for .data ignored
encrypt.c: /tmp/ccCKtJgz.s:942: Warning: dwarf line number information for .data ignored
encrypt.c: /tmp/ccCKtJgz.s:947: Warning: dwarf line number information for .data ignored
encrypt.c: /tmp/ccCKtJgz.s:950: Warning: dwarf line number information for .data ignored
encrypt.c: /tmp/ccCKtJgz.s:951: Warning: dwarf line number information for .data ignored
encrypt.c: /tmp/ccCKtJgz.s:958: Warning: dwarf line number information for .data ignored
encrypt.c: /tmp/ccCKtJgz.s:959: Warning: dwarf line number information for .data ignored
encrypt.c: /tmp/ccCKtJgz.s:962: Warning: dwarf line number information for .data ignored
encrypt.c: /tmp/ccCKtJgz.s:964: Warning: dwarf line number information for .data ignored
encrypt.c: /tmp/ccCKtJgz.s:967: Warning: dwarf line number information for .data ignored
encrypt.c: /tmp/ccCKtJgz.s:975: Warning: dwarf line number information for .data ignored
encrypt.c: /tmp/ccCKtJgz.s:985: Warning: dwarf line number information for .data ignored
encrypt.c: /tmp/ccCKtJgz.s:987: Warning: dwarf line number information for .data ignored
encrypt.c: /tmp/ccCKtJgz.s:989: Warning: dwarf line number information for .data ignored
encrypt.c: /tmp/ccCKtJgz.s:990: Warning: dwarf line number information for .data ignored
encrypt.c: /tmp/ccCKtJgz.s:991: Warning: dwarf line number information for .data ignored
encrypt.c: /tmp/ccCKtJgz.s:1001: Warning: dwarf line number information for .data ignored
encrypt.c: /tmp/ccCKtJgz.s:1003: Warning: dwarf line number information for .data ignored
encrypt.c: ...

Number of similar (implementation,compiler) pairs: 1, namely:
ImplementationCompiler
T:avx1gcc -march=native -mtune=native -Os -fwrapv -fPIC -fPIE -gdwarf-4 -Wall (11.4.0)

Compiler output


try.c: /usr/bin/ld: libcrypto_aead_omdsha256k256n248tau256v1.a(omdsha256.o):.../supercop-data/saber214/amd64/try/c/clang_-march=native_-O2_-fwrapv_-Qunused-arguments_-fPIC_-fPIE_-gdwarf-4_-Wall/timingleaks/crypto_aead/omdsha256k256n248tau256v1/sse4/work/./omdsha256.h:137: multiple definition of `Hash'; libcrypto_aead_omdsha256k256n248tau256v1.a(encrypt.o):.../supercop-data/saber214/amd64/try/c/clang_-march=native_-O2_-fwrapv_-Qunused-arguments_-fPIC_-fPIE_-gdwarf-4_-Wall/timingleaks/crypto_aead/omdsha256k256n248tau256v1/sse4/work/./omdsha256.h:137: first defined here
try.c: clang: error: linker command failed with exit code 1 (use -v to see invocation)

Number of similar (implementation,compiler) pairs: 1, namely:
ImplementationCompiler
T:sse4clang -march=native -O2 -fwrapv -Qunused-arguments -fPIC -fPIE -gdwarf-4 -Wall (Ubuntu_Clang_14.0.0)

Compiler output


try.c: /usr/bin/ld: libcrypto_aead_omdsha256k256n248tau256v1.a(omdsha256.o):.../supercop-data/saber214/amd64/try/c/clang_-march=native_-O3_-fwrapv_-Qunused-arguments_-fPIC_-fPIE_-gdwarf-4_-Wall/timingleaks/crypto_aead/omdsha256k256n248tau256v1/sse4/work/./omdsha256.h:137: multiple definition of `Hash'; libcrypto_aead_omdsha256k256n248tau256v1.a(encrypt.o):.../supercop-data/saber214/amd64/try/c/clang_-march=native_-O3_-fwrapv_-Qunused-arguments_-fPIC_-fPIE_-gdwarf-4_-Wall/timingleaks/crypto_aead/omdsha256k256n248tau256v1/sse4/work/./omdsha256.h:137: first defined here
try.c: clang: error: linker command failed with exit code 1 (use -v to see invocation)

Number of similar (implementation,compiler) pairs: 1, namely:
ImplementationCompiler
T:sse4clang -march=native -O3 -fwrapv -Qunused-arguments -fPIC -fPIE -gdwarf-4 -Wall (Ubuntu_Clang_14.0.0)

Compiler output


try.c: /usr/bin/ld: libcrypto_aead_omdsha256k256n248tau256v1.a(omdsha256.o):.../supercop-data/saber214/amd64/try/c/clang_-march=native_-O_-fwrapv_-Qunused-arguments_-fPIC_-fPIE_-gdwarf-4_-Wall/timingleaks/crypto_aead/omdsha256k256n248tau256v1/sse4/work/./omdsha256.h:137: multiple definition of `Hash'; libcrypto_aead_omdsha256k256n248tau256v1.a(encrypt.o):.../supercop-data/saber214/amd64/try/c/clang_-march=native_-O_-fwrapv_-Qunused-arguments_-fPIC_-fPIE_-gdwarf-4_-Wall/timingleaks/crypto_aead/omdsha256k256n248tau256v1/sse4/work/./omdsha256.h:137: first defined here
try.c: clang: error: linker command failed with exit code 1 (use -v to see invocation)

Number of similar (implementation,compiler) pairs: 1, namely:
ImplementationCompiler
T:sse4clang -march=native -O -fwrapv -Qunused-arguments -fPIC -fPIE -gdwarf-4 -Wall (Ubuntu_Clang_14.0.0)

Compiler output


try.c: /usr/bin/ld: libcrypto_aead_omdsha256k256n248tau256v1.a(omdsha256.o):.../supercop-data/saber214/amd64/try/c/clang_-march=native_-Os_-fwrapv_-Qunused-arguments_-fPIC_-fPIE_-gdwarf-4_-Wall/timingleaks/crypto_aead/omdsha256k256n248tau256v1/sse4/work/./omdsha256.h:137: multiple definition of `Hash'; libcrypto_aead_omdsha256k256n248tau256v1.a(encrypt.o):.../supercop-data/saber214/amd64/try/c/clang_-march=native_-Os_-fwrapv_-Qunused-arguments_-fPIC_-fPIE_-gdwarf-4_-Wall/timingleaks/crypto_aead/omdsha256k256n248tau256v1/sse4/work/./omdsha256.h:137: first defined here
try.c: clang: error: linker command failed with exit code 1 (use -v to see invocation)

Number of similar (implementation,compiler) pairs: 1, namely:
ImplementationCompiler
T:sse4clang -march=native -Os -fwrapv -Qunused-arguments -fPIC -fPIE -gdwarf-4 -Wall (Ubuntu_Clang_14.0.0)

Compiler output


try.c: /usr/bin/ld: libcrypto_aead_omdsha256k256n248tau256v1.a(omdsha256.o):.../supercop-data/saber214/amd64/try/c/clang_-mcpu=native_-O3_-fwrapv_-Qunused-arguments_-fPIC_-fPIE_-gdwarf-4_-Wall/timingleaks/crypto_aead/omdsha256k256n248tau256v1/sse4/work/./omdsha256.h:137: multiple definition of `Hash'; libcrypto_aead_omdsha256k256n248tau256v1.a(encrypt.o):.../supercop-data/saber214/amd64/try/c/clang_-mcpu=native_-O3_-fwrapv_-Qunused-arguments_-fPIC_-fPIE_-gdwarf-4_-Wall/timingleaks/crypto_aead/omdsha256k256n248tau256v1/sse4/work/./omdsha256.h:137: first defined here
try.c: clang: error: linker command failed with exit code 1 (use -v to see invocation)

Number of similar (implementation,compiler) pairs: 1, namely:
ImplementationCompiler
T:sse4clang -mcpu=native -O3 -fwrapv -Qunused-arguments -fPIC -fPIE -gdwarf-4 -Wall (Ubuntu_Clang_14.0.0)

Compiler output


encrypt.c: /tmp/cc5wVKBh.s: Assembler messages:
encrypt.c: /tmp/cc5wVKBh.s:962: Warning: dwarf line number information for .data ignored
encrypt.c: /tmp/cc5wVKBh.s:964: Warning: dwarf line number information for .data ignored
encrypt.c: /tmp/cc5wVKBh.s:966: Warning: dwarf line number information for .data ignored
encrypt.c: /tmp/cc5wVKBh.s:967: Warning: dwarf line number information for .data ignored
encrypt.c: /tmp/cc5wVKBh.s:968: Warning: dwarf line number information for .data ignored
encrypt.c: /tmp/cc5wVKBh.s:978: Warning: dwarf line number information for .data ignored
encrypt.c: /tmp/cc5wVKBh.s:980: Warning: dwarf line number information for .data ignored
encrypt.c: /tmp/cc5wVKBh.s:987: Warning: dwarf line number information for .data ignored
encrypt.c: /tmp/cc5wVKBh.s:990: Warning: dwarf line number information for .data ignored
encrypt.c: /tmp/cc5wVKBh.s:991: Warning: dwarf line number information for .data ignored
encrypt.c: /tmp/cc5wVKBh.s:998: Warning: dwarf line number information for .data ignored
encrypt.c: /tmp/cc5wVKBh.s:999: Warning: dwarf line number information for .data ignored
encrypt.c: /tmp/cc5wVKBh.s:1002: Warning: dwarf line number information for .data ignored
encrypt.c: /tmp/cc5wVKBh.s:1004: Warning: dwarf line number information for .data ignored
encrypt.c: /tmp/cc5wVKBh.s:1007: Warning: dwarf line number information for .data ignored
encrypt.c: /tmp/cc5wVKBh.s:1015: Warning: dwarf line number information for .data ignored
encrypt.c: /tmp/cc5wVKBh.s:1027: Warning: dwarf line number information for .data ignored
encrypt.c: /tmp/cc5wVKBh.s:1029: Warning: dwarf line number information for .data ignored
encrypt.c: /tmp/cc5wVKBh.s:1031: Warning: dwarf line number information for .data ignored
encrypt.c: /tmp/cc5wVKBh.s:1032: Warning: dwarf line number information for .data ignored
encrypt.c: /tmp/cc5wVKBh.s:1033: Warning: dwarf line number information for .data ignored
encrypt.c: /tmp/cc5wVKBh.s:1043: Warning: dwarf line number information for .data ignored
encrypt.c: /tmp/cc5wVKBh.s:1045: Warning: dwarf line number information for .data ignored
encrypt.c: /tmp/cc5wVKBh.s:1048: Warning: dwarf line number information for .data ignored
encrypt.c: ...

Number of similar (implementation,compiler) pairs: 1, namely:
ImplementationCompiler
T:sse4gcc -march=native -mtune=native -O2 -fwrapv -fPIC -fPIE -gdwarf-4 -Wall (11.4.0)

Compiler output


encrypt.c: /tmp/ccOb6038.s: Assembler messages:
encrypt.c: /tmp/ccOb6038.s:962: Warning: dwarf line number information for .data ignored
encrypt.c: /tmp/ccOb6038.s:964: Warning: dwarf line number information for .data ignored
encrypt.c: /tmp/ccOb6038.s:966: Warning: dwarf line number information for .data ignored
encrypt.c: /tmp/ccOb6038.s:967: Warning: dwarf line number information for .data ignored
encrypt.c: /tmp/ccOb6038.s:968: Warning: dwarf line number information for .data ignored
encrypt.c: /tmp/ccOb6038.s:978: Warning: dwarf line number information for .data ignored
encrypt.c: /tmp/ccOb6038.s:980: Warning: dwarf line number information for .data ignored
encrypt.c: /tmp/ccOb6038.s:987: Warning: dwarf line number information for .data ignored
encrypt.c: /tmp/ccOb6038.s:990: Warning: dwarf line number information for .data ignored
encrypt.c: /tmp/ccOb6038.s:991: Warning: dwarf line number information for .data ignored
encrypt.c: /tmp/ccOb6038.s:998: Warning: dwarf line number information for .data ignored
encrypt.c: /tmp/ccOb6038.s:999: Warning: dwarf line number information for .data ignored
encrypt.c: /tmp/ccOb6038.s:1002: Warning: dwarf line number information for .data ignored
encrypt.c: /tmp/ccOb6038.s:1004: Warning: dwarf line number information for .data ignored
encrypt.c: /tmp/ccOb6038.s:1007: Warning: dwarf line number information for .data ignored
encrypt.c: /tmp/ccOb6038.s:1015: Warning: dwarf line number information for .data ignored
encrypt.c: /tmp/ccOb6038.s:1027: Warning: dwarf line number information for .data ignored
encrypt.c: /tmp/ccOb6038.s:1029: Warning: dwarf line number information for .data ignored
encrypt.c: /tmp/ccOb6038.s:1031: Warning: dwarf line number information for .data ignored
encrypt.c: /tmp/ccOb6038.s:1032: Warning: dwarf line number information for .data ignored
encrypt.c: /tmp/ccOb6038.s:1033: Warning: dwarf line number information for .data ignored
encrypt.c: /tmp/ccOb6038.s:1043: Warning: dwarf line number information for .data ignored
encrypt.c: /tmp/ccOb6038.s:1045: Warning: dwarf line number information for .data ignored
encrypt.c: /tmp/ccOb6038.s:1048: Warning: dwarf line number information for .data ignored
encrypt.c: ...

Number of similar (implementation,compiler) pairs: 1, namely:
ImplementationCompiler
T:sse4gcc -march=native -mtune=native -O3 -fwrapv -fPIC -fPIE -gdwarf-4 -Wall (11.4.0)

Compiler output


encrypt.c: /tmp/ccZYIUkK.s: Assembler messages:
encrypt.c: /tmp/ccZYIUkK.s:960: Warning: dwarf line number information for .data ignored
encrypt.c: /tmp/ccZYIUkK.s:962: Warning: dwarf line number information for .data ignored
encrypt.c: /tmp/ccZYIUkK.s:974: Warning: dwarf line number information for .data ignored
encrypt.c: /tmp/ccZYIUkK.s:975: Warning: dwarf line number information for .data ignored
encrypt.c: /tmp/ccZYIUkK.s:976: Warning: dwarf line number information for .data ignored
encrypt.c: /tmp/ccZYIUkK.s:983: Warning: dwarf line number information for .data ignored
encrypt.c: /tmp/ccZYIUkK.s:986: Warning: dwarf line number information for .data ignored
encrypt.c: /tmp/ccZYIUkK.s:987: Warning: dwarf line number information for .data ignored
encrypt.c: /tmp/ccZYIUkK.s:992: Warning: dwarf line number information for .data ignored
encrypt.c: /tmp/ccZYIUkK.s:993: Warning: dwarf line number information for .data ignored
encrypt.c: /tmp/ccZYIUkK.s:996: Warning: dwarf line number information for .data ignored
encrypt.c: /tmp/ccZYIUkK.s:998: Warning: dwarf line number information for .data ignored
encrypt.c: /tmp/ccZYIUkK.s:1001: Warning: dwarf line number information for .data ignored
encrypt.c: /tmp/ccZYIUkK.s:1009: Warning: dwarf line number information for .data ignored
encrypt.c: /tmp/ccZYIUkK.s:1019: Warning: dwarf line number information for .data ignored
encrypt.c: /tmp/ccZYIUkK.s:1021: Warning: dwarf line number information for .data ignored
encrypt.c: /tmp/ccZYIUkK.s:1034: Warning: dwarf line number information for .data ignored
encrypt.c: /tmp/ccZYIUkK.s:1038: Warning: dwarf line number information for .data ignored
encrypt.c: /tmp/ccZYIUkK.s:1039: Warning: dwarf line number information for .data ignored
encrypt.c: /tmp/ccZYIUkK.s:1040: Warning: dwarf line number information for .data ignored
encrypt.c: /tmp/ccZYIUkK.s:1047: Warning: dwarf line number information for .data ignored
encrypt.c: /tmp/ccZYIUkK.s:1050: Warning: dwarf line number information for .data ignored
encrypt.c: /tmp/ccZYIUkK.s:1053: Warning: dwarf line number information for .data ignored
encrypt.c: /tmp/ccZYIUkK.s:1056: Warning: dwarf line number information for .data ignored
encrypt.c: ...

Number of similar (implementation,compiler) pairs: 1, namely:
ImplementationCompiler
T:sse4gcc -march=native -mtune=native -O -fwrapv -fPIC -fPIE -gdwarf-4 -Wall (11.4.0)

Compiler output


encrypt.c: /tmp/cc4lSV6w.s: Assembler messages:
encrypt.c: /tmp/cc4lSV6w.s:960: Warning: dwarf line number information for .data ignored
encrypt.c: /tmp/cc4lSV6w.s:962: Warning: dwarf line number information for .data ignored
encrypt.c: /tmp/cc4lSV6w.s:964: Warning: dwarf line number information for .data ignored
encrypt.c: /tmp/cc4lSV6w.s:965: Warning: dwarf line number information for .data ignored
encrypt.c: /tmp/cc4lSV6w.s:966: Warning: dwarf line number information for .data ignored
encrypt.c: /tmp/cc4lSV6w.s:976: Warning: dwarf line number information for .data ignored
encrypt.c: /tmp/cc4lSV6w.s:979: Warning: dwarf line number information for .data ignored
encrypt.c: /tmp/cc4lSV6w.s:981: Warning: dwarf line number information for .data ignored
encrypt.c: /tmp/cc4lSV6w.s:986: Warning: dwarf line number information for .data ignored
encrypt.c: /tmp/cc4lSV6w.s:989: Warning: dwarf line number information for .data ignored
encrypt.c: /tmp/cc4lSV6w.s:990: Warning: dwarf line number information for .data ignored
encrypt.c: /tmp/cc4lSV6w.s:997: Warning: dwarf line number information for .data ignored
encrypt.c: /tmp/cc4lSV6w.s:998: Warning: dwarf line number information for .data ignored
encrypt.c: /tmp/cc4lSV6w.s:1001: Warning: dwarf line number information for .data ignored
encrypt.c: /tmp/cc4lSV6w.s:1003: Warning: dwarf line number information for .data ignored
encrypt.c: /tmp/cc4lSV6w.s:1006: Warning: dwarf line number information for .data ignored
encrypt.c: /tmp/cc4lSV6w.s:1014: Warning: dwarf line number information for .data ignored
encrypt.c: /tmp/cc4lSV6w.s:1024: Warning: dwarf line number information for .data ignored
encrypt.c: /tmp/cc4lSV6w.s:1026: Warning: dwarf line number information for .data ignored
encrypt.c: /tmp/cc4lSV6w.s:1028: Warning: dwarf line number information for .data ignored
encrypt.c: /tmp/cc4lSV6w.s:1029: Warning: dwarf line number information for .data ignored
encrypt.c: /tmp/cc4lSV6w.s:1030: Warning: dwarf line number information for .data ignored
encrypt.c: /tmp/cc4lSV6w.s:1040: Warning: dwarf line number information for .data ignored
encrypt.c: /tmp/cc4lSV6w.s:1042: Warning: dwarf line number information for .data ignored
encrypt.c: ...

Number of similar (implementation,compiler) pairs: 1, namely:
ImplementationCompiler
T:sse4gcc -march=native -mtune=native -Os -fwrapv -fPIC -fPIE -gdwarf-4 -Wall (11.4.0)

Namespace violations


omdsha256.o calc_L_i T
omdsha256.o double_block T
omdsha256.o final_masking_associated_data T
omdsha256.o final_masking_message T
omdsha256.o hash T
omdsha256.o increment_masking_associated_data T
omdsha256.o increment_masking_message T
omdsha256.o key_func T
omdsha256.o l2b T
omdsha256.o ntz T
omdsha256.o omdsha256_process T
omdsha256.o triple_block T
omdsha256.o xor_block T
sha256.o sha256_comp T

Number of similar (implementation,compiler) pairs: 9, namely:
ImplementationCompiler
T:refclang -march=native -O2 -fwrapv -Qunused-arguments -fPIC -fPIE -gdwarf-4 -Wall (Ubuntu_Clang_14.0.0)
T:refclang -march=native -O3 -fwrapv -Qunused-arguments -fPIC -fPIE -gdwarf-4 -Wall (Ubuntu_Clang_14.0.0)
T:refclang -march=native -O -fwrapv -Qunused-arguments -fPIC -fPIE -gdwarf-4 -Wall (Ubuntu_Clang_14.0.0)
T:refclang -march=native -Os -fwrapv -Qunused-arguments -fPIC -fPIE -gdwarf-4 -Wall (Ubuntu_Clang_14.0.0)
T:refclang -mcpu=native -O3 -fwrapv -Qunused-arguments -fPIC -fPIE -gdwarf-4 -Wall (Ubuntu_Clang_14.0.0)
T:refgcc -march=native -mtune=native -O2 -fwrapv -fPIC -fPIE -gdwarf-4 -Wall (11.4.0)
T:refgcc -march=native -mtune=native -O3 -fwrapv -fPIC -fPIE -gdwarf-4 -Wall (11.4.0)
T:refgcc -march=native -mtune=native -O -fwrapv -fPIC -fPIE -gdwarf-4 -Wall (11.4.0)
T:refgcc -march=native -mtune=native -Os -fwrapv -fPIC -fPIE -gdwarf-4 -Wall (11.4.0)