Test results for amd64, saber214, crypto_aead/omdsha256k128n96tau128v1
[Page version: 20250326 01:21:01]
Measurements for amd64, saber214, crypto_aead
Test results for amd64, saber214, crypto_aead
Test results for crypto_aead/omdsha256k128n96tau128v1
Computer: saber214
Microarchitecture: amd64; Bulldozer (600f20)
Architecture: amd64
CPU ID: AuthenticAMD-00600f20-1789c3f5
SUPERCOP version: 20250307
Operation: crypto_aead
Primitive: omdsha256k128n96tau128v1
Time | Object size | Test size | Implementation | Compiler | Benchmark date | SUPERCOP version |
277552 | 15854 0 0 | 38493 784 928 | T:ref | gcc -march=native -mtune=native -O3 -fwrapv -fPIC -fPIE -gdwarf-4 -Wall | 20250311 | 20250307 |
316695 | 10627 0 0 | 31204 816 856 | T:ref | clang -march=native -O2 -fwrapv -Qunused-arguments -fPIC -fPIE -gdwarf-4 -Wall | 20250311 | 20250307 |
319310 | 12159 0 0 | 33940 816 856 | T:ref | clang -mcpu=native -O3 -fwrapv -Qunused-arguments -fPIC -fPIE -gdwarf-4 -Wall | 20250311 | 20250307 |
319759 | 10321 0 0 | 33284 816 872 | T:ref | clang -march=native -O3 -fwrapv -Qunused-arguments -fPIC -fPIE -gdwarf-4 -Wall | 20250311 | 20250307 |
343722 | 4417 0 0 | 23494 808 856 | T:ref | clang -march=native -Os -fwrapv -Qunused-arguments -fPIC -fPIE -gdwarf-4 -Wall | 20250311 | 20250307 |
355216 | 6651 0 0 | 27821 784 928 | T:ref | gcc -march=native -mtune=native -O2 -fwrapv -fPIC -fPIE -gdwarf-4 -Wall | 20250311 | 20250307 |
369272 | 6210 0 0 | 26828 776 928 | T:ref | gcc -march=native -mtune=native -O -fwrapv -fPIC -fPIE -gdwarf-4 -Wall | 20250311 | 20250307 |
372020 | 5665 0 0 | 25060 816 856 | T:ref | clang -march=native -O -fwrapv -Qunused-arguments -fPIC -fPIE -gdwarf-4 -Wall | 20250311 | 20250307 |
412498 | 4586 0 0 | 23584 760 896 | T:ref | gcc -march=native -mtune=native -Os -fwrapv -fPIC -fPIE -gdwarf-4 -Wall | 20250311 | 20250307 |
Compiler output
try.c: /usr/bin/ld: libcrypto_aead_omdsha256k128n96tau128v1.a(omdsha256.o):.../supercop-data/saber214/amd64/try/c/clang_-march=native_-O2_-fwrapv_-Qunused-arguments_-fPIC_-fPIE_-gdwarf-4_-Wall/timingleaks/crypto_aead/omdsha256k128n96tau128v1/avx1/work/./omdsha256.h:137: multiple definition of `Hash'; libcrypto_aead_omdsha256k128n96tau128v1.a(encrypt.o):.../supercop-data/saber214/amd64/try/c/clang_-march=native_-O2_-fwrapv_-Qunused-arguments_-fPIC_-fPIE_-gdwarf-4_-Wall/timingleaks/crypto_aead/omdsha256k128n96tau128v1/avx1/work/./omdsha256.h:137: first defined here
try.c: clang: error: linker command failed with exit code 1 (use -v to see invocation)
Number of similar (implementation,compiler) pairs: 1, namely:
Implementation | Compiler |
T:avx1 | clang -march=native -O2 -fwrapv -Qunused-arguments -fPIC -fPIE -gdwarf-4 -Wall (Ubuntu_Clang_14.0.0) |
Compiler output
try.c: /usr/bin/ld: libcrypto_aead_omdsha256k128n96tau128v1.a(omdsha256.o):.../supercop-data/saber214/amd64/try/c/clang_-march=native_-O3_-fwrapv_-Qunused-arguments_-fPIC_-fPIE_-gdwarf-4_-Wall/timingleaks/crypto_aead/omdsha256k128n96tau128v1/avx1/work/./omdsha256.h:137: multiple definition of `Hash'; libcrypto_aead_omdsha256k128n96tau128v1.a(encrypt.o):.../supercop-data/saber214/amd64/try/c/clang_-march=native_-O3_-fwrapv_-Qunused-arguments_-fPIC_-fPIE_-gdwarf-4_-Wall/timingleaks/crypto_aead/omdsha256k128n96tau128v1/avx1/work/./omdsha256.h:137: first defined here
try.c: clang: error: linker command failed with exit code 1 (use -v to see invocation)
Number of similar (implementation,compiler) pairs: 1, namely:
Implementation | Compiler |
T:avx1 | clang -march=native -O3 -fwrapv -Qunused-arguments -fPIC -fPIE -gdwarf-4 -Wall (Ubuntu_Clang_14.0.0) |
Compiler output
try.c: /usr/bin/ld: libcrypto_aead_omdsha256k128n96tau128v1.a(omdsha256.o):.../supercop-data/saber214/amd64/try/c/clang_-march=native_-O_-fwrapv_-Qunused-arguments_-fPIC_-fPIE_-gdwarf-4_-Wall/timingleaks/crypto_aead/omdsha256k128n96tau128v1/avx1/work/./omdsha256.h:137: multiple definition of `Hash'; libcrypto_aead_omdsha256k128n96tau128v1.a(encrypt.o):.../supercop-data/saber214/amd64/try/c/clang_-march=native_-O_-fwrapv_-Qunused-arguments_-fPIC_-fPIE_-gdwarf-4_-Wall/timingleaks/crypto_aead/omdsha256k128n96tau128v1/avx1/work/./omdsha256.h:137: first defined here
try.c: clang: error: linker command failed with exit code 1 (use -v to see invocation)
Number of similar (implementation,compiler) pairs: 1, namely:
Implementation | Compiler |
T:avx1 | clang -march=native -O -fwrapv -Qunused-arguments -fPIC -fPIE -gdwarf-4 -Wall (Ubuntu_Clang_14.0.0) |
Compiler output
try.c: /usr/bin/ld: libcrypto_aead_omdsha256k128n96tau128v1.a(omdsha256.o):.../supercop-data/saber214/amd64/try/c/clang_-march=native_-Os_-fwrapv_-Qunused-arguments_-fPIC_-fPIE_-gdwarf-4_-Wall/timingleaks/crypto_aead/omdsha256k128n96tau128v1/avx1/work/./omdsha256.h:137: multiple definition of `Hash'; libcrypto_aead_omdsha256k128n96tau128v1.a(encrypt.o):.../supercop-data/saber214/amd64/try/c/clang_-march=native_-Os_-fwrapv_-Qunused-arguments_-fPIC_-fPIE_-gdwarf-4_-Wall/timingleaks/crypto_aead/omdsha256k128n96tau128v1/avx1/work/./omdsha256.h:137: first defined here
try.c: clang: error: linker command failed with exit code 1 (use -v to see invocation)
Number of similar (implementation,compiler) pairs: 1, namely:
Implementation | Compiler |
T:avx1 | clang -march=native -Os -fwrapv -Qunused-arguments -fPIC -fPIE -gdwarf-4 -Wall (Ubuntu_Clang_14.0.0) |
Compiler output
try.c: /usr/bin/ld: libcrypto_aead_omdsha256k128n96tau128v1.a(omdsha256.o):.../supercop-data/saber214/amd64/try/c/clang_-mcpu=native_-O3_-fwrapv_-Qunused-arguments_-fPIC_-fPIE_-gdwarf-4_-Wall/timingleaks/crypto_aead/omdsha256k128n96tau128v1/avx1/work/./omdsha256.h:137: multiple definition of `Hash'; libcrypto_aead_omdsha256k128n96tau128v1.a(encrypt.o):.../supercop-data/saber214/amd64/try/c/clang_-mcpu=native_-O3_-fwrapv_-Qunused-arguments_-fPIC_-fPIE_-gdwarf-4_-Wall/timingleaks/crypto_aead/omdsha256k128n96tau128v1/avx1/work/./omdsha256.h:137: first defined here
try.c: clang: error: linker command failed with exit code 1 (use -v to see invocation)
Number of similar (implementation,compiler) pairs: 1, namely:
Implementation | Compiler |
T:avx1 | clang -mcpu=native -O3 -fwrapv -Qunused-arguments -fPIC -fPIE -gdwarf-4 -Wall (Ubuntu_Clang_14.0.0) |
Compiler output
encrypt.c: /tmp/ccpHzYQk.s: Assembler messages:
encrypt.c: /tmp/ccpHzYQk.s:923: Warning: dwarf line number information for .data ignored
encrypt.c: /tmp/ccpHzYQk.s:925: Warning: dwarf line number information for .data ignored
encrypt.c: /tmp/ccpHzYQk.s:927: Warning: dwarf line number information for .data ignored
encrypt.c: /tmp/ccpHzYQk.s:928: Warning: dwarf line number information for .data ignored
encrypt.c: /tmp/ccpHzYQk.s:929: Warning: dwarf line number information for .data ignored
encrypt.c: /tmp/ccpHzYQk.s:939: Warning: dwarf line number information for .data ignored
encrypt.c: /tmp/ccpHzYQk.s:941: Warning: dwarf line number information for .data ignored
encrypt.c: /tmp/ccpHzYQk.s:948: Warning: dwarf line number information for .data ignored
encrypt.c: /tmp/ccpHzYQk.s:951: Warning: dwarf line number information for .data ignored
encrypt.c: /tmp/ccpHzYQk.s:952: Warning: dwarf line number information for .data ignored
encrypt.c: /tmp/ccpHzYQk.s:959: Warning: dwarf line number information for .data ignored
encrypt.c: /tmp/ccpHzYQk.s:960: Warning: dwarf line number information for .data ignored
encrypt.c: /tmp/ccpHzYQk.s:963: Warning: dwarf line number information for .data ignored
encrypt.c: /tmp/ccpHzYQk.s:965: Warning: dwarf line number information for .data ignored
encrypt.c: /tmp/ccpHzYQk.s:968: Warning: dwarf line number information for .data ignored
encrypt.c: /tmp/ccpHzYQk.s:976: Warning: dwarf line number information for .data ignored
encrypt.c: /tmp/ccpHzYQk.s:988: Warning: dwarf line number information for .data ignored
encrypt.c: /tmp/ccpHzYQk.s:990: Warning: dwarf line number information for .data ignored
encrypt.c: /tmp/ccpHzYQk.s:992: Warning: dwarf line number information for .data ignored
encrypt.c: /tmp/ccpHzYQk.s:993: Warning: dwarf line number information for .data ignored
encrypt.c: /tmp/ccpHzYQk.s:994: Warning: dwarf line number information for .data ignored
encrypt.c: /tmp/ccpHzYQk.s:1004: Warning: dwarf line number information for .data ignored
encrypt.c: /tmp/ccpHzYQk.s:1006: Warning: dwarf line number information for .data ignored
encrypt.c: /tmp/ccpHzYQk.s:1009: Warning: dwarf line number information for .data ignored
encrypt.c: ...
Number of similar (implementation,compiler) pairs: 1, namely:
Implementation | Compiler |
T:avx1 | gcc -march=native -mtune=native -O2 -fwrapv -fPIC -fPIE -gdwarf-4 -Wall (11.4.0) |
Compiler output
encrypt.c: /tmp/ccc1nXae.s: Assembler messages:
encrypt.c: /tmp/ccc1nXae.s:923: Warning: dwarf line number information for .data ignored
encrypt.c: /tmp/ccc1nXae.s:925: Warning: dwarf line number information for .data ignored
encrypt.c: /tmp/ccc1nXae.s:927: Warning: dwarf line number information for .data ignored
encrypt.c: /tmp/ccc1nXae.s:928: Warning: dwarf line number information for .data ignored
encrypt.c: /tmp/ccc1nXae.s:929: Warning: dwarf line number information for .data ignored
encrypt.c: /tmp/ccc1nXae.s:939: Warning: dwarf line number information for .data ignored
encrypt.c: /tmp/ccc1nXae.s:941: Warning: dwarf line number information for .data ignored
encrypt.c: /tmp/ccc1nXae.s:948: Warning: dwarf line number information for .data ignored
encrypt.c: /tmp/ccc1nXae.s:951: Warning: dwarf line number information for .data ignored
encrypt.c: /tmp/ccc1nXae.s:952: Warning: dwarf line number information for .data ignored
encrypt.c: /tmp/ccc1nXae.s:959: Warning: dwarf line number information for .data ignored
encrypt.c: /tmp/ccc1nXae.s:960: Warning: dwarf line number information for .data ignored
encrypt.c: /tmp/ccc1nXae.s:963: Warning: dwarf line number information for .data ignored
encrypt.c: /tmp/ccc1nXae.s:965: Warning: dwarf line number information for .data ignored
encrypt.c: /tmp/ccc1nXae.s:968: Warning: dwarf line number information for .data ignored
encrypt.c: /tmp/ccc1nXae.s:976: Warning: dwarf line number information for .data ignored
encrypt.c: /tmp/ccc1nXae.s:988: Warning: dwarf line number information for .data ignored
encrypt.c: /tmp/ccc1nXae.s:990: Warning: dwarf line number information for .data ignored
encrypt.c: /tmp/ccc1nXae.s:992: Warning: dwarf line number information for .data ignored
encrypt.c: /tmp/ccc1nXae.s:993: Warning: dwarf line number information for .data ignored
encrypt.c: /tmp/ccc1nXae.s:994: Warning: dwarf line number information for .data ignored
encrypt.c: /tmp/ccc1nXae.s:1004: Warning: dwarf line number information for .data ignored
encrypt.c: /tmp/ccc1nXae.s:1006: Warning: dwarf line number information for .data ignored
encrypt.c: /tmp/ccc1nXae.s:1009: Warning: dwarf line number information for .data ignored
encrypt.c: ...
Number of similar (implementation,compiler) pairs: 1, namely:
Implementation | Compiler |
T:avx1 | gcc -march=native -mtune=native -O3 -fwrapv -fPIC -fPIE -gdwarf-4 -Wall (11.4.0) |
Compiler output
encrypt.c: /tmp/cc72EtCA.s: Assembler messages:
encrypt.c: /tmp/cc72EtCA.s:921: Warning: dwarf line number information for .data ignored
encrypt.c: /tmp/cc72EtCA.s:923: Warning: dwarf line number information for .data ignored
encrypt.c: /tmp/cc72EtCA.s:935: Warning: dwarf line number information for .data ignored
encrypt.c: /tmp/cc72EtCA.s:936: Warning: dwarf line number information for .data ignored
encrypt.c: /tmp/cc72EtCA.s:937: Warning: dwarf line number information for .data ignored
encrypt.c: /tmp/cc72EtCA.s:944: Warning: dwarf line number information for .data ignored
encrypt.c: /tmp/cc72EtCA.s:947: Warning: dwarf line number information for .data ignored
encrypt.c: /tmp/cc72EtCA.s:948: Warning: dwarf line number information for .data ignored
encrypt.c: /tmp/cc72EtCA.s:953: Warning: dwarf line number information for .data ignored
encrypt.c: /tmp/cc72EtCA.s:954: Warning: dwarf line number information for .data ignored
encrypt.c: /tmp/cc72EtCA.s:957: Warning: dwarf line number information for .data ignored
encrypt.c: /tmp/cc72EtCA.s:959: Warning: dwarf line number information for .data ignored
encrypt.c: /tmp/cc72EtCA.s:962: Warning: dwarf line number information for .data ignored
encrypt.c: /tmp/cc72EtCA.s:970: Warning: dwarf line number information for .data ignored
encrypt.c: /tmp/cc72EtCA.s:980: Warning: dwarf line number information for .data ignored
encrypt.c: /tmp/cc72EtCA.s:982: Warning: dwarf line number information for .data ignored
encrypt.c: /tmp/cc72EtCA.s:995: Warning: dwarf line number information for .data ignored
encrypt.c: /tmp/cc72EtCA.s:999: Warning: dwarf line number information for .data ignored
encrypt.c: /tmp/cc72EtCA.s:1000: Warning: dwarf line number information for .data ignored
encrypt.c: /tmp/cc72EtCA.s:1001: Warning: dwarf line number information for .data ignored
encrypt.c: /tmp/cc72EtCA.s:1008: Warning: dwarf line number information for .data ignored
encrypt.c: /tmp/cc72EtCA.s:1011: Warning: dwarf line number information for .data ignored
encrypt.c: /tmp/cc72EtCA.s:1014: Warning: dwarf line number information for .data ignored
encrypt.c: /tmp/cc72EtCA.s:1017: Warning: dwarf line number information for .data ignored
encrypt.c: ...
Number of similar (implementation,compiler) pairs: 1, namely:
Implementation | Compiler |
T:avx1 | gcc -march=native -mtune=native -O -fwrapv -fPIC -fPIE -gdwarf-4 -Wall (11.4.0) |
Compiler output
encrypt.c: /tmp/cc0C1LZN.s: Assembler messages:
encrypt.c: /tmp/cc0C1LZN.s:921: Warning: dwarf line number information for .data ignored
encrypt.c: /tmp/cc0C1LZN.s:923: Warning: dwarf line number information for .data ignored
encrypt.c: /tmp/cc0C1LZN.s:925: Warning: dwarf line number information for .data ignored
encrypt.c: /tmp/cc0C1LZN.s:926: Warning: dwarf line number information for .data ignored
encrypt.c: /tmp/cc0C1LZN.s:927: Warning: dwarf line number information for .data ignored
encrypt.c: /tmp/cc0C1LZN.s:937: Warning: dwarf line number information for .data ignored
encrypt.c: /tmp/cc0C1LZN.s:940: Warning: dwarf line number information for .data ignored
encrypt.c: /tmp/cc0C1LZN.s:942: Warning: dwarf line number information for .data ignored
encrypt.c: /tmp/cc0C1LZN.s:947: Warning: dwarf line number information for .data ignored
encrypt.c: /tmp/cc0C1LZN.s:950: Warning: dwarf line number information for .data ignored
encrypt.c: /tmp/cc0C1LZN.s:951: Warning: dwarf line number information for .data ignored
encrypt.c: /tmp/cc0C1LZN.s:958: Warning: dwarf line number information for .data ignored
encrypt.c: /tmp/cc0C1LZN.s:959: Warning: dwarf line number information for .data ignored
encrypt.c: /tmp/cc0C1LZN.s:962: Warning: dwarf line number information for .data ignored
encrypt.c: /tmp/cc0C1LZN.s:964: Warning: dwarf line number information for .data ignored
encrypt.c: /tmp/cc0C1LZN.s:967: Warning: dwarf line number information for .data ignored
encrypt.c: /tmp/cc0C1LZN.s:975: Warning: dwarf line number information for .data ignored
encrypt.c: /tmp/cc0C1LZN.s:985: Warning: dwarf line number information for .data ignored
encrypt.c: /tmp/cc0C1LZN.s:987: Warning: dwarf line number information for .data ignored
encrypt.c: /tmp/cc0C1LZN.s:989: Warning: dwarf line number information for .data ignored
encrypt.c: /tmp/cc0C1LZN.s:990: Warning: dwarf line number information for .data ignored
encrypt.c: /tmp/cc0C1LZN.s:991: Warning: dwarf line number information for .data ignored
encrypt.c: /tmp/cc0C1LZN.s:1001: Warning: dwarf line number information for .data ignored
encrypt.c: /tmp/cc0C1LZN.s:1003: Warning: dwarf line number information for .data ignored
encrypt.c: ...
Number of similar (implementation,compiler) pairs: 1, namely:
Implementation | Compiler |
T:avx1 | gcc -march=native -mtune=native -Os -fwrapv -fPIC -fPIE -gdwarf-4 -Wall (11.4.0) |
Compiler output
try.c: /usr/bin/ld: libcrypto_aead_omdsha256k128n96tau128v1.a(omdsha256.o):.../supercop-data/saber214/amd64/try/c/clang_-march=native_-O2_-fwrapv_-Qunused-arguments_-fPIC_-fPIE_-gdwarf-4_-Wall/timingleaks/crypto_aead/omdsha256k128n96tau128v1/sse4/work/./omdsha256.h:137: multiple definition of `Hash'; libcrypto_aead_omdsha256k128n96tau128v1.a(encrypt.o):.../supercop-data/saber214/amd64/try/c/clang_-march=native_-O2_-fwrapv_-Qunused-arguments_-fPIC_-fPIE_-gdwarf-4_-Wall/timingleaks/crypto_aead/omdsha256k128n96tau128v1/sse4/work/./omdsha256.h:137: first defined here
try.c: clang: error: linker command failed with exit code 1 (use -v to see invocation)
Number of similar (implementation,compiler) pairs: 1, namely:
Implementation | Compiler |
T:sse4 | clang -march=native -O2 -fwrapv -Qunused-arguments -fPIC -fPIE -gdwarf-4 -Wall (Ubuntu_Clang_14.0.0) |
Compiler output
try.c: /usr/bin/ld: libcrypto_aead_omdsha256k128n96tau128v1.a(omdsha256.o):.../supercop-data/saber214/amd64/try/c/clang_-march=native_-O3_-fwrapv_-Qunused-arguments_-fPIC_-fPIE_-gdwarf-4_-Wall/timingleaks/crypto_aead/omdsha256k128n96tau128v1/sse4/work/./omdsha256.h:137: multiple definition of `Hash'; libcrypto_aead_omdsha256k128n96tau128v1.a(encrypt.o):.../supercop-data/saber214/amd64/try/c/clang_-march=native_-O3_-fwrapv_-Qunused-arguments_-fPIC_-fPIE_-gdwarf-4_-Wall/timingleaks/crypto_aead/omdsha256k128n96tau128v1/sse4/work/./omdsha256.h:137: first defined here
try.c: clang: error: linker command failed with exit code 1 (use -v to see invocation)
Number of similar (implementation,compiler) pairs: 1, namely:
Implementation | Compiler |
T:sse4 | clang -march=native -O3 -fwrapv -Qunused-arguments -fPIC -fPIE -gdwarf-4 -Wall (Ubuntu_Clang_14.0.0) |
Compiler output
try.c: /usr/bin/ld: libcrypto_aead_omdsha256k128n96tau128v1.a(omdsha256.o):.../supercop-data/saber214/amd64/try/c/clang_-march=native_-O_-fwrapv_-Qunused-arguments_-fPIC_-fPIE_-gdwarf-4_-Wall/timingleaks/crypto_aead/omdsha256k128n96tau128v1/sse4/work/./omdsha256.h:137: multiple definition of `Hash'; libcrypto_aead_omdsha256k128n96tau128v1.a(encrypt.o):.../supercop-data/saber214/amd64/try/c/clang_-march=native_-O_-fwrapv_-Qunused-arguments_-fPIC_-fPIE_-gdwarf-4_-Wall/timingleaks/crypto_aead/omdsha256k128n96tau128v1/sse4/work/./omdsha256.h:137: first defined here
try.c: clang: error: linker command failed with exit code 1 (use -v to see invocation)
Number of similar (implementation,compiler) pairs: 1, namely:
Implementation | Compiler |
T:sse4 | clang -march=native -O -fwrapv -Qunused-arguments -fPIC -fPIE -gdwarf-4 -Wall (Ubuntu_Clang_14.0.0) |
Compiler output
try.c: /usr/bin/ld: libcrypto_aead_omdsha256k128n96tau128v1.a(omdsha256.o):.../supercop-data/saber214/amd64/try/c/clang_-march=native_-Os_-fwrapv_-Qunused-arguments_-fPIC_-fPIE_-gdwarf-4_-Wall/timingleaks/crypto_aead/omdsha256k128n96tau128v1/sse4/work/./omdsha256.h:137: multiple definition of `Hash'; libcrypto_aead_omdsha256k128n96tau128v1.a(encrypt.o):.../supercop-data/saber214/amd64/try/c/clang_-march=native_-Os_-fwrapv_-Qunused-arguments_-fPIC_-fPIE_-gdwarf-4_-Wall/timingleaks/crypto_aead/omdsha256k128n96tau128v1/sse4/work/./omdsha256.h:137: first defined here
try.c: clang: error: linker command failed with exit code 1 (use -v to see invocation)
Number of similar (implementation,compiler) pairs: 1, namely:
Implementation | Compiler |
T:sse4 | clang -march=native -Os -fwrapv -Qunused-arguments -fPIC -fPIE -gdwarf-4 -Wall (Ubuntu_Clang_14.0.0) |
Compiler output
try.c: /usr/bin/ld: libcrypto_aead_omdsha256k128n96tau128v1.a(omdsha256.o):.../supercop-data/saber214/amd64/try/c/clang_-mcpu=native_-O3_-fwrapv_-Qunused-arguments_-fPIC_-fPIE_-gdwarf-4_-Wall/timingleaks/crypto_aead/omdsha256k128n96tau128v1/sse4/work/./omdsha256.h:137: multiple definition of `Hash'; libcrypto_aead_omdsha256k128n96tau128v1.a(encrypt.o):.../supercop-data/saber214/amd64/try/c/clang_-mcpu=native_-O3_-fwrapv_-Qunused-arguments_-fPIC_-fPIE_-gdwarf-4_-Wall/timingleaks/crypto_aead/omdsha256k128n96tau128v1/sse4/work/./omdsha256.h:137: first defined here
try.c: clang: error: linker command failed with exit code 1 (use -v to see invocation)
Number of similar (implementation,compiler) pairs: 1, namely:
Implementation | Compiler |
T:sse4 | clang -mcpu=native -O3 -fwrapv -Qunused-arguments -fPIC -fPIE -gdwarf-4 -Wall (Ubuntu_Clang_14.0.0) |
Compiler output
encrypt.c: /tmp/cc0blPU9.s: Assembler messages:
encrypt.c: /tmp/cc0blPU9.s:962: Warning: dwarf line number information for .data ignored
encrypt.c: /tmp/cc0blPU9.s:964: Warning: dwarf line number information for .data ignored
encrypt.c: /tmp/cc0blPU9.s:966: Warning: dwarf line number information for .data ignored
encrypt.c: /tmp/cc0blPU9.s:967: Warning: dwarf line number information for .data ignored
encrypt.c: /tmp/cc0blPU9.s:968: Warning: dwarf line number information for .data ignored
encrypt.c: /tmp/cc0blPU9.s:978: Warning: dwarf line number information for .data ignored
encrypt.c: /tmp/cc0blPU9.s:980: Warning: dwarf line number information for .data ignored
encrypt.c: /tmp/cc0blPU9.s:987: Warning: dwarf line number information for .data ignored
encrypt.c: /tmp/cc0blPU9.s:990: Warning: dwarf line number information for .data ignored
encrypt.c: /tmp/cc0blPU9.s:991: Warning: dwarf line number information for .data ignored
encrypt.c: /tmp/cc0blPU9.s:998: Warning: dwarf line number information for .data ignored
encrypt.c: /tmp/cc0blPU9.s:999: Warning: dwarf line number information for .data ignored
encrypt.c: /tmp/cc0blPU9.s:1002: Warning: dwarf line number information for .data ignored
encrypt.c: /tmp/cc0blPU9.s:1004: Warning: dwarf line number information for .data ignored
encrypt.c: /tmp/cc0blPU9.s:1007: Warning: dwarf line number information for .data ignored
encrypt.c: /tmp/cc0blPU9.s:1015: Warning: dwarf line number information for .data ignored
encrypt.c: /tmp/cc0blPU9.s:1027: Warning: dwarf line number information for .data ignored
encrypt.c: /tmp/cc0blPU9.s:1029: Warning: dwarf line number information for .data ignored
encrypt.c: /tmp/cc0blPU9.s:1031: Warning: dwarf line number information for .data ignored
encrypt.c: /tmp/cc0blPU9.s:1032: Warning: dwarf line number information for .data ignored
encrypt.c: /tmp/cc0blPU9.s:1033: Warning: dwarf line number information for .data ignored
encrypt.c: /tmp/cc0blPU9.s:1043: Warning: dwarf line number information for .data ignored
encrypt.c: /tmp/cc0blPU9.s:1045: Warning: dwarf line number information for .data ignored
encrypt.c: /tmp/cc0blPU9.s:1048: Warning: dwarf line number information for .data ignored
encrypt.c: ...
Number of similar (implementation,compiler) pairs: 1, namely:
Implementation | Compiler |
T:sse4 | gcc -march=native -mtune=native -O2 -fwrapv -fPIC -fPIE -gdwarf-4 -Wall (11.4.0) |
Compiler output
encrypt.c: /tmp/ccYrEEUi.s: Assembler messages:
encrypt.c: /tmp/ccYrEEUi.s:962: Warning: dwarf line number information for .data ignored
encrypt.c: /tmp/ccYrEEUi.s:964: Warning: dwarf line number information for .data ignored
encrypt.c: /tmp/ccYrEEUi.s:966: Warning: dwarf line number information for .data ignored
encrypt.c: /tmp/ccYrEEUi.s:967: Warning: dwarf line number information for .data ignored
encrypt.c: /tmp/ccYrEEUi.s:968: Warning: dwarf line number information for .data ignored
encrypt.c: /tmp/ccYrEEUi.s:978: Warning: dwarf line number information for .data ignored
encrypt.c: /tmp/ccYrEEUi.s:980: Warning: dwarf line number information for .data ignored
encrypt.c: /tmp/ccYrEEUi.s:987: Warning: dwarf line number information for .data ignored
encrypt.c: /tmp/ccYrEEUi.s:990: Warning: dwarf line number information for .data ignored
encrypt.c: /tmp/ccYrEEUi.s:991: Warning: dwarf line number information for .data ignored
encrypt.c: /tmp/ccYrEEUi.s:998: Warning: dwarf line number information for .data ignored
encrypt.c: /tmp/ccYrEEUi.s:999: Warning: dwarf line number information for .data ignored
encrypt.c: /tmp/ccYrEEUi.s:1002: Warning: dwarf line number information for .data ignored
encrypt.c: /tmp/ccYrEEUi.s:1004: Warning: dwarf line number information for .data ignored
encrypt.c: /tmp/ccYrEEUi.s:1007: Warning: dwarf line number information for .data ignored
encrypt.c: /tmp/ccYrEEUi.s:1015: Warning: dwarf line number information for .data ignored
encrypt.c: /tmp/ccYrEEUi.s:1027: Warning: dwarf line number information for .data ignored
encrypt.c: /tmp/ccYrEEUi.s:1029: Warning: dwarf line number information for .data ignored
encrypt.c: /tmp/ccYrEEUi.s:1031: Warning: dwarf line number information for .data ignored
encrypt.c: /tmp/ccYrEEUi.s:1032: Warning: dwarf line number information for .data ignored
encrypt.c: /tmp/ccYrEEUi.s:1033: Warning: dwarf line number information for .data ignored
encrypt.c: /tmp/ccYrEEUi.s:1043: Warning: dwarf line number information for .data ignored
encrypt.c: /tmp/ccYrEEUi.s:1045: Warning: dwarf line number information for .data ignored
encrypt.c: /tmp/ccYrEEUi.s:1048: Warning: dwarf line number information for .data ignored
encrypt.c: ...
Number of similar (implementation,compiler) pairs: 1, namely:
Implementation | Compiler |
T:sse4 | gcc -march=native -mtune=native -O3 -fwrapv -fPIC -fPIE -gdwarf-4 -Wall (11.4.0) |
Compiler output
encrypt.c: /tmp/ccqzRHhO.s: Assembler messages:
encrypt.c: /tmp/ccqzRHhO.s:960: Warning: dwarf line number information for .data ignored
encrypt.c: /tmp/ccqzRHhO.s:962: Warning: dwarf line number information for .data ignored
encrypt.c: /tmp/ccqzRHhO.s:974: Warning: dwarf line number information for .data ignored
encrypt.c: /tmp/ccqzRHhO.s:975: Warning: dwarf line number information for .data ignored
encrypt.c: /tmp/ccqzRHhO.s:976: Warning: dwarf line number information for .data ignored
encrypt.c: /tmp/ccqzRHhO.s:983: Warning: dwarf line number information for .data ignored
encrypt.c: /tmp/ccqzRHhO.s:986: Warning: dwarf line number information for .data ignored
encrypt.c: /tmp/ccqzRHhO.s:987: Warning: dwarf line number information for .data ignored
encrypt.c: /tmp/ccqzRHhO.s:992: Warning: dwarf line number information for .data ignored
encrypt.c: /tmp/ccqzRHhO.s:993: Warning: dwarf line number information for .data ignored
encrypt.c: /tmp/ccqzRHhO.s:996: Warning: dwarf line number information for .data ignored
encrypt.c: /tmp/ccqzRHhO.s:998: Warning: dwarf line number information for .data ignored
encrypt.c: /tmp/ccqzRHhO.s:1001: Warning: dwarf line number information for .data ignored
encrypt.c: /tmp/ccqzRHhO.s:1009: Warning: dwarf line number information for .data ignored
encrypt.c: /tmp/ccqzRHhO.s:1019: Warning: dwarf line number information for .data ignored
encrypt.c: /tmp/ccqzRHhO.s:1021: Warning: dwarf line number information for .data ignored
encrypt.c: /tmp/ccqzRHhO.s:1034: Warning: dwarf line number information for .data ignored
encrypt.c: /tmp/ccqzRHhO.s:1038: Warning: dwarf line number information for .data ignored
encrypt.c: /tmp/ccqzRHhO.s:1039: Warning: dwarf line number information for .data ignored
encrypt.c: /tmp/ccqzRHhO.s:1040: Warning: dwarf line number information for .data ignored
encrypt.c: /tmp/ccqzRHhO.s:1047: Warning: dwarf line number information for .data ignored
encrypt.c: /tmp/ccqzRHhO.s:1050: Warning: dwarf line number information for .data ignored
encrypt.c: /tmp/ccqzRHhO.s:1053: Warning: dwarf line number information for .data ignored
encrypt.c: /tmp/ccqzRHhO.s:1056: Warning: dwarf line number information for .data ignored
encrypt.c: ...
Number of similar (implementation,compiler) pairs: 1, namely:
Implementation | Compiler |
T:sse4 | gcc -march=native -mtune=native -O -fwrapv -fPIC -fPIE -gdwarf-4 -Wall (11.4.0) |
Compiler output
encrypt.c: /tmp/cc3GMfh3.s: Assembler messages:
encrypt.c: /tmp/cc3GMfh3.s:960: Warning: dwarf line number information for .data ignored
encrypt.c: /tmp/cc3GMfh3.s:962: Warning: dwarf line number information for .data ignored
encrypt.c: /tmp/cc3GMfh3.s:964: Warning: dwarf line number information for .data ignored
encrypt.c: /tmp/cc3GMfh3.s:965: Warning: dwarf line number information for .data ignored
encrypt.c: /tmp/cc3GMfh3.s:966: Warning: dwarf line number information for .data ignored
encrypt.c: /tmp/cc3GMfh3.s:976: Warning: dwarf line number information for .data ignored
encrypt.c: /tmp/cc3GMfh3.s:979: Warning: dwarf line number information for .data ignored
encrypt.c: /tmp/cc3GMfh3.s:981: Warning: dwarf line number information for .data ignored
encrypt.c: /tmp/cc3GMfh3.s:986: Warning: dwarf line number information for .data ignored
encrypt.c: /tmp/cc3GMfh3.s:989: Warning: dwarf line number information for .data ignored
encrypt.c: /tmp/cc3GMfh3.s:990: Warning: dwarf line number information for .data ignored
encrypt.c: /tmp/cc3GMfh3.s:997: Warning: dwarf line number information for .data ignored
encrypt.c: /tmp/cc3GMfh3.s:998: Warning: dwarf line number information for .data ignored
encrypt.c: /tmp/cc3GMfh3.s:1001: Warning: dwarf line number information for .data ignored
encrypt.c: /tmp/cc3GMfh3.s:1003: Warning: dwarf line number information for .data ignored
encrypt.c: /tmp/cc3GMfh3.s:1006: Warning: dwarf line number information for .data ignored
encrypt.c: /tmp/cc3GMfh3.s:1014: Warning: dwarf line number information for .data ignored
encrypt.c: /tmp/cc3GMfh3.s:1024: Warning: dwarf line number information for .data ignored
encrypt.c: /tmp/cc3GMfh3.s:1026: Warning: dwarf line number information for .data ignored
encrypt.c: /tmp/cc3GMfh3.s:1028: Warning: dwarf line number information for .data ignored
encrypt.c: /tmp/cc3GMfh3.s:1029: Warning: dwarf line number information for .data ignored
encrypt.c: /tmp/cc3GMfh3.s:1030: Warning: dwarf line number information for .data ignored
encrypt.c: /tmp/cc3GMfh3.s:1040: Warning: dwarf line number information for .data ignored
encrypt.c: /tmp/cc3GMfh3.s:1042: Warning: dwarf line number information for .data ignored
encrypt.c: ...
Number of similar (implementation,compiler) pairs: 1, namely:
Implementation | Compiler |
T:sse4 | gcc -march=native -mtune=native -Os -fwrapv -fPIC -fPIE -gdwarf-4 -Wall (11.4.0) |
Namespace violations
omdsha256.o calc_L_i T
omdsha256.o double_block T
omdsha256.o final_masking_associated_data T
omdsha256.o final_masking_message T
omdsha256.o hash T
omdsha256.o increment_masking_associated_data T
omdsha256.o increment_masking_message T
omdsha256.o key_func T
omdsha256.o l2b T
omdsha256.o ntz T
omdsha256.o omdsha256_process T
omdsha256.o triple_block T
omdsha256.o xor_block T
sha256.o sha256_comp T
Number of similar (implementation,compiler) pairs: 9, namely:
Implementation | Compiler |
T:ref | clang -march=native -O2 -fwrapv -Qunused-arguments -fPIC -fPIE -gdwarf-4 -Wall (Ubuntu_Clang_14.0.0) |
T:ref | clang -march=native -O3 -fwrapv -Qunused-arguments -fPIC -fPIE -gdwarf-4 -Wall (Ubuntu_Clang_14.0.0) |
T:ref | clang -march=native -O -fwrapv -Qunused-arguments -fPIC -fPIE -gdwarf-4 -Wall (Ubuntu_Clang_14.0.0) |
T:ref | clang -march=native -Os -fwrapv -Qunused-arguments -fPIC -fPIE -gdwarf-4 -Wall (Ubuntu_Clang_14.0.0) |
T:ref | clang -mcpu=native -O3 -fwrapv -Qunused-arguments -fPIC -fPIE -gdwarf-4 -Wall (Ubuntu_Clang_14.0.0) |
T:ref | gcc -march=native -mtune=native -O2 -fwrapv -fPIC -fPIE -gdwarf-4 -Wall (11.4.0) |
T:ref | gcc -march=native -mtune=native -O3 -fwrapv -fPIC -fPIE -gdwarf-4 -Wall (11.4.0) |
T:ref | gcc -march=native -mtune=native -O -fwrapv -fPIC -fPIE -gdwarf-4 -Wall (11.4.0) |
T:ref | gcc -march=native -mtune=native -Os -fwrapv -fPIC -fPIE -gdwarf-4 -Wall (11.4.0) |