Implementation notes: amd64, saber214, crypto_aead/morus1280256v2

Computer: saber214
Architecture: amd64
CPU ID: AuthenticAMD-00600f20-178bfbff
SUPERCOP version: 20211108
Operation: crypto_aead
Primitive: morus1280256v2
TimeObject sizeTest sizeImplementationCompilerBenchmark dateSUPERCOP version
66279207 0 024489 776 872T:sse2clang_-march=native_-O2_-fomit-frame-pointer_-fwrapv_-Qunused-arguments_-fPIC_-fPIE2021053120210529
66659223 0 026073 776 872T:sse2clang_-march=native_-O3_-fomit-frame-pointer_-fwrapv_-Qunused-arguments_-fPIC_-fPIE2021053120210529
66889207 0 024489 776 872T:sse2clang_-march=native_-O_-fomit-frame-pointer_-fwrapv_-Qunused-arguments_-fPIC_-fPIE2021053120210529
856513259 0 029049 776 856T:sse2clang_-mcpu=native_-O3_-fomit-frame-pointer_-fwrapv_-Qunused-arguments_-fPIC_-fPIE2021053120210529
128713432 0 016135 768 856T:sse2clang_-march=native_-Os_-fomit-frame-pointer_-fwrapv_-Qunused-arguments_-fPIC_-fPIE2021053120210529
132269171 0 025653 784 928T:sse2gcc_-march=native_-mtune=native_-O3_-fomit-frame-pointer_-fwrapv_-fPIC_-fPIE2021053120210529
141893532 0 017749 784 928T:sse2gcc_-march=native_-mtune=native_-O2_-fomit-frame-pointer_-fwrapv_-fPIC_-fPIE2021053120210529
142233754 0 018013 784 928T:sse2gcc_-march=native_-mtune=native_-O_-fomit-frame-pointer_-fwrapv_-fPIC_-fPIE2021053120210529
1814911700 0 025820 776 928T:refgcc_-march=native_-mtune=native_-O2_-fomit-frame-pointer_-fwrapv_-fPIC_-fPIE2021053120210529
1848211876 0 026044 776 928T:refgcc_-march=native_-mtune=native_-O_-fomit-frame-pointer_-fwrapv_-fPIC_-fPIE2021053120210529
1851817091 0 033581 784 928T:ref64gcc_-march=native_-mtune=native_-O3_-fomit-frame-pointer_-fwrapv_-fPIC_-fPIE2021053120210529
1863914054 0 030517 784 928T:refgcc_-march=native_-mtune=native_-O3_-fomit-frame-pointer_-fwrapv_-fPIC_-fPIE2021053120210529
267386803 0 022681 776 856T:ref64clang_-mcpu=native_-O3_-fomit-frame-pointer_-fwrapv_-Qunused-arguments_-fPIC_-fPIE2021053120210529
273385740 0 019892 776 928T:ref64gcc_-march=native_-mtune=native_-O2_-fomit-frame-pointer_-fwrapv_-fPIC_-fPIE2021053120210529
276785836 0 020020 776 928T:ref64gcc_-march=native_-mtune=native_-O_-fomit-frame-pointer_-fwrapv_-fPIC_-fPIE2021053120210529
285115383 0 018560 760 896T:ref64gcc_-march=native_-mtune=native_-Os_-fomit-frame-pointer_-fwrapv_-fPIC_-fPIE2021053120210529
549505940 0 021297 776 872T:ref64clang_-march=native_-O2_-fomit-frame-pointer_-fwrapv_-Qunused-arguments_-fPIC_-fPIE2021053120210529
551956004 0 022929 776 872T:ref64clang_-march=native_-O3_-fomit-frame-pointer_-fwrapv_-Qunused-arguments_-fPIC_-fPIE2021053120210529
553774717 0 017447 768 856T:ref64clang_-march=native_-Os_-fomit-frame-pointer_-fwrapv_-Qunused-arguments_-fPIC_-fPIE2021053120210529
554215940 0 021297 776 872T:ref64clang_-march=native_-O_-fomit-frame-pointer_-fwrapv_-Qunused-arguments_-fPIC_-fPIE2021053120210529

Compiler output

Implementation: T:avx2
Security model: timingleaks
Compiler: clang -march=native -O2 -fomit-frame-pointer -fwrapv -Qunused-arguments -fPIC -fPIE
encrypt.c: encrypt.c:70:13: error: always_inline function '_mm256_xor_si256' requires target feature 'avx2', but would be inlined into function 'morus_stateupdate' that is compiled without support for 'avx2'
encrypt.c: state[0] = XOR256(state[0], state[3]);
encrypt.c: ^
encrypt.c: encrypt.c:25:27: note: expanded from macro 'XOR256'
encrypt.c: #define XOR256(x,y) _mm256_xor_si256((x),(y)) /*XOR256(x,y) = x ^ y, where x and y are two 256-bit word*/
encrypt.c: ^
encrypt.c: encrypt.c:71:13: error: always_inline function '_mm256_xor_si256' requires target feature 'avx2', but would be inlined into function 'morus_stateupdate' that is compiled without support for 'avx2'
encrypt.c: state[0] = XOR256(state[0], AND256(state[1], state[2]));
encrypt.c: ^
encrypt.c: encrypt.c:25:27: note: expanded from macro 'XOR256'
encrypt.c: #define XOR256(x,y) _mm256_xor_si256((x),(y)) /*XOR256(x,y) = x ^ y, where x and y are two 256-bit word*/
encrypt.c: ^
encrypt.c: encrypt.c:71:30: error: always_inline function '_mm256_and_si256' requires target feature 'avx2', but would be inlined into function 'morus_stateupdate' that is compiled without support for 'avx2'
encrypt.c: state[0] = XOR256(state[0], AND256(state[1], state[2]));
encrypt.c: ^
encrypt.c: encrypt.c:26:27: note: expanded from macro 'AND256'
encrypt.c: #define AND256(x,y) _mm256_and_si256((x),(y)) /*AND(x,y) = x & y, where x and y are two 256-bit word*/
encrypt.c: ^
encrypt.c: encrypt.c:72:13: error: always_inline function '_mm256_or_si256' requires target feature 'avx2', but would be inlined into function 'morus_stateupdate' that is compiled without support for 'avx2'
encrypt.c: state[0] = ROTL256(state[0], n1);
encrypt.c: ^
encrypt.c: encrypt.c:39:27: note: expanded from macro 'ROTL256'
encrypt.c: #define ROTL256(x,n) OR256( _mm256_slli_epi64((x), (n)), _mm256_srli_epi64((x),(64-n)) ) /*Rotate 4 64-bit unsigned integers in x to the left by n-bit positions*/
encrypt.c: ^
encrypt.c: encrypt.c:28:27: note: expanded from macro 'OR256'
encrypt.c: ...

Number of similar (compiler,implementation) pairs: 5, namely:
CompilerImplementations
clang -march=native -O2 -fomit-frame-pointer -fwrapv -Qunused-arguments -fPIC -fPIE T:avx2
clang -march=native -O3 -fomit-frame-pointer -fwrapv -Qunused-arguments -fPIC -fPIE T:avx2
clang -march=native -O -fomit-frame-pointer -fwrapv -Qunused-arguments -fPIC -fPIE T:avx2
clang -march=native -Os -fomit-frame-pointer -fwrapv -Qunused-arguments -fPIC -fPIE T:avx2
clang -mcpu=native -O3 -fomit-frame-pointer -fwrapv -Qunused-arguments -fPIC -fPIE T:avx2

Compiler output

Implementation: T:avx2
Security model: timingleaks
Compiler: gcc -march=native -mtune=native -O2 -fomit-frame-pointer -fwrapv -fPIC -fPIE
encrypt.c: In file included from /usr/lib/gcc/x86_64-linux-gnu/7/include/immintrin.h:43:0,
encrypt.c: from encrypt.c:2:
encrypt.c: encrypt.c: In function 'morus_enc_aut_step':
encrypt.c: /usr/lib/gcc/x86_64-linux-gnu/7/include/avx2intrin.h:1068:1: error: inlining failed in call to always_inline '_mm256_permute4x64_epi64': target specific option mismatch
encrypt.c: _mm256_permute4x64_epi64 (__m256i __X, const int __M)
encrypt.c: ^~~~~~~~~~~~~~~~~~~~~~~~
encrypt.c: encrypt.c:41:27: note: called from here
encrypt.c: #define ROTL256_64(x) _mm256_permute4x64_epi64((x), _MM_SHUFFLE(2,1,0,3)) /*Rotate x by 64-bit positions to the left*/
encrypt.c: ^~~~~~~~~~~~~~~~~~~~~~~~~~~~~~~~~~~~~~~~~~~~~~~~~~~
encrypt.c: encrypt.c:220:13: note: in expansion of macro 'ROTL256_64'
encrypt.c: state[2] = ROTL256_64(state[2]);
encrypt.c: ^~~~~~~~~~
encrypt.c: In file included from /usr/lib/gcc/x86_64-linux-gnu/7/include/immintrin.h:43:0,
encrypt.c: from encrypt.c:2:
encrypt.c: /usr/lib/gcc/x86_64-linux-gnu/7/include/avx2intrin.h:574:1: error: inlining failed in call to always_inline '_mm256_or_si256': target specific option mismatch
encrypt.c: _mm256_or_si256 (__m256i __A, __m256i __B)
encrypt.c: ^~~~~~~~~~~~~~~
encrypt.c: encrypt.c:28:27: note: called from here
encrypt.c: #define OR256(x,y) _mm256_or_si256((x),(y)) /*OR(x,y) = x | y, where x and y are two 256-bit word*/
encrypt.c: ^~~~~~~~~~~~~~~~~~~~~~~~
encrypt.c: encrypt.c:39:27: note: in expansion of macro 'OR256'
encrypt.c: #define ROTL256(x,n) OR256( _mm256_slli_epi64((x), (n)), _mm256_srli_epi64((x),(64-n)) ) /*Rotate 4 64-bit unsigned integers in x to the left by n-bit positions*/
encrypt.c: ^~~~~
encrypt.c: encrypt.c:219:13: note: in expansion of macro 'ROTL256'
encrypt.c: state[4] = ROTL256(state[4], n5);
encrypt.c: ...

Number of similar (compiler,implementation) pairs: 4, namely:
CompilerImplementations
gcc -march=native -mtune=native -O2 -fomit-frame-pointer -fwrapv -fPIC -fPIE T:avx2
gcc -march=native -mtune=native -O3 -fomit-frame-pointer -fwrapv -fPIC -fPIE T:avx2
gcc -march=native -mtune=native -O -fomit-frame-pointer -fwrapv -fPIC -fPIE T:avx2
gcc -march=native -mtune=native -Os -fomit-frame-pointer -fwrapv -fPIC -fPIE T:avx2

Compiler output

Implementation: T:ref
Security model: timingleaks
Compiler: clang -march=native -O2 -fomit-frame-pointer -fwrapv -Qunused-arguments -fPIC -fPIE
try.c: libcrypto_aead_morus1280256v2.a(encrypt.o): In function `morus_initialization':
try.c: encrypt.c:(.text+0x...): undefined reference to `morus_stateupdate'
try.c: encrypt.c:(.text+0x...): undefined reference to `morus_stateupdate'
try.c: encrypt.c:(.text+0x...): undefined reference to `morus_stateupdate'
try.c: encrypt.c:(.text+0x...): undefined reference to `morus_stateupdate'
try.c: encrypt.c:(.text+0x...): undefined reference to `morus_stateupdate'
try.c: libcrypto_aead_morus1280256v2.a(encrypt.o):encrypt.c:(.text+0x...): more undefined references to `morus_stateupdate' follow
try.c: clang: error: linker command failed with exit code 1 (use -v to see invocation)

Number of similar (compiler,implementation) pairs: 4, namely:
CompilerImplementations
clang -march=native -O2 -fomit-frame-pointer -fwrapv -Qunused-arguments -fPIC -fPIE T:ref
clang -march=native -O3 -fomit-frame-pointer -fwrapv -Qunused-arguments -fPIC -fPIE T:ref
clang -march=native -O -fomit-frame-pointer -fwrapv -Qunused-arguments -fPIC -fPIE T:ref
clang -mcpu=native -O3 -fomit-frame-pointer -fwrapv -Qunused-arguments -fPIC -fPIE T:ref

Compiler output

Implementation: T:ref
Security model: timingleaks
Compiler: clang -march=native -Os -fomit-frame-pointer -fwrapv -Qunused-arguments -fPIC -fPIE
try.c: libcrypto_aead_morus1280256v2.a(encrypt.o): In function `morus_initialization':
try.c: encrypt.c:(.text+0x...): undefined reference to `morus_stateupdate'
try.c: libcrypto_aead_morus1280256v2.a(encrypt.o): In function `morus_tag_generation':
try.c: encrypt.c:(.text+0x...): undefined reference to `morus_stateupdate'
try.c: libcrypto_aead_morus1280256v2.a(encrypt.o): In function `morus_tag_verification':
try.c: encrypt.c:(.text+0x...): undefined reference to `morus_stateupdate'
try.c: libcrypto_aead_morus1280256v2.a(encrypt.o): In function `morus_enc_aut_partialblock':
try.c: encrypt.c:(.text+0x...): undefined reference to `morus_stateupdate'
try.c: libcrypto_aead_morus1280256v2.a(encrypt.o): In function `morus_dec_aut_partialblock':
try.c: encrypt.c:(.text+0x...): undefined reference to `morus_stateupdate'
try.c: libcrypto_aead_morus1280256v2.a(encrypt.o):encrypt.c:(.text+0x...): more undefined references to `morus_stateupdate' follow
try.c: clang: error: linker command failed with exit code 1 (use -v to see invocation)

Number of similar (compiler,implementation) pairs: 1, namely:
CompilerImplementations
clang -march=native -Os -fomit-frame-pointer -fwrapv -Qunused-arguments -fPIC -fPIE T:ref

Compiler output

Implementation: T:ref
Security model: timingleaks
Compiler: gcc -march=native -mtune=native -Os -fomit-frame-pointer -fwrapv -fPIC -fPIE
try.c: libcrypto_aead_morus1280256v2.a(encrypt.o): In function `morus_initialization':
try.c: encrypt.c:(.text+0x...): undefined reference to `morus_stateupdate'
try.c: libcrypto_aead_morus1280256v2.a(encrypt.o): In function `morus_tag_generation':
try.c: encrypt.c:(.text+0x...): undefined reference to `morus_stateupdate'
try.c: libcrypto_aead_morus1280256v2.a(encrypt.o): In function `morus_tag_verification':
try.c: encrypt.c:(.text+0x...): undefined reference to `morus_stateupdate'
try.c: libcrypto_aead_morus1280256v2.a(encrypt.o): In function `morus_enc_aut_partialblock':
try.c: encrypt.c:(.text+0x...): undefined reference to `morus_stateupdate'
try.c: libcrypto_aead_morus1280256v2.a(encrypt.o): In function `morus_dec_aut_partialblock':
try.c: encrypt.c:(.text+0x...): undefined reference to `morus_stateupdate'
try.c: libcrypto_aead_morus1280256v2.a(encrypt.o): In function `crypto_aead_morus1280256v2_ref_timingleaks_encrypt':
try.c: encrypt.c:(.text+0x...): undefined reference to `morus_enc_aut_step'
try.c: encrypt.c:(.text+0x...): undefined reference to `morus_enc_aut_step'
try.c: libcrypto_aead_morus1280256v2.a(encrypt.o): In function `crypto_aead_morus1280256v2_ref_timingleaks_decrypt':
try.c: encrypt.c:(.text+0x...): undefined reference to `morus_enc_aut_step'
try.c: encrypt.c:(.text+0x...): undefined reference to `morus_dec_aut_step'
try.c: collect2: error: ld returned 1 exit status

Number of similar (compiler,implementation) pairs: 1, namely:
CompilerImplementations
gcc -march=native -mtune=native -Os -fomit-frame-pointer -fwrapv -fPIC -fPIE T:ref

Compiler output

Implementation: T:sse2
Security model: timingleaks
Compiler: gcc -march=native -mtune=native -Os -fomit-frame-pointer -fwrapv -fPIC -fPIE
try.c: libcrypto_aead_morus1280256v2.a(encrypt.o): In function `crypto_aead_morus1280256v2_sse2_timingleaks_encrypt':
try.c: encrypt.c:(.text+0x...): undefined reference to `morus_enc_aut_step'
try.c: encrypt.c:(.text+0x...): undefined reference to `morus_enc_aut_step'
try.c: libcrypto_aead_morus1280256v2.a(encrypt.o): In function `crypto_aead_morus1280256v2_sse2_timingleaks_decrypt':
try.c: encrypt.c:(.text+0x...): undefined reference to `morus_enc_aut_step'
try.c: encrypt.c:(.text+0x...): undefined reference to `morus_dec_aut_step'
try.c: collect2: error: ld returned 1 exit status

Number of similar (compiler,implementation) pairs: 1, namely:
CompilerImplementations
gcc -march=native -mtune=native -Os -fomit-frame-pointer -fwrapv -fPIC -fPIE T:sse2

Namespace violations

Implementation: T:ref
Security model: timingleaks
Compiler: gcc -march=native -mtune=native -O2 -fomit-frame-pointer -fwrapv -fPIC -fPIE
encrypt.o morus_dec_aut_partialblock T
encrypt.o morus_enc_aut_partialblock T
encrypt.o morus_initialization T
encrypt.o morus_tag_generation T
encrypt.o morus_tag_verification T

Number of similar (compiler,implementation) pairs: 3, namely:
CompilerImplementations
gcc -march=native -mtune=native -O2 -fomit-frame-pointer -fwrapv -fPIC -fPIE T:ref
gcc -march=native -mtune=native -O3 -fomit-frame-pointer -fwrapv -fPIC -fPIE T:ref
gcc -march=native -mtune=native -O -fomit-frame-pointer -fwrapv -fPIC -fPIE T:ref

Namespace violations

Implementation: T:ref64
Security model: timingleaks
Compiler: clang -march=native -O2 -fomit-frame-pointer -fwrapv -Qunused-arguments -fPIC -fPIE
encrypt.o morus_dec_aut_partialblock T
encrypt.o morus_dec_aut_step T
encrypt.o morus_enc_aut_partialblock T
encrypt.o morus_enc_aut_step T
encrypt.o morus_initialization T
encrypt.o morus_stateupdate T
encrypt.o morus_tag_generation T
encrypt.o morus_tag_verification T

Number of similar (compiler,implementation) pairs: 9, namely:
CompilerImplementations
clang -march=native -O2 -fomit-frame-pointer -fwrapv -Qunused-arguments -fPIC -fPIE T:ref64
clang -march=native -O3 -fomit-frame-pointer -fwrapv -Qunused-arguments -fPIC -fPIE T:ref64
clang -march=native -O -fomit-frame-pointer -fwrapv -Qunused-arguments -fPIC -fPIE T:ref64
clang -march=native -Os -fomit-frame-pointer -fwrapv -Qunused-arguments -fPIC -fPIE T:ref64
clang -mcpu=native -O3 -fomit-frame-pointer -fwrapv -Qunused-arguments -fPIC -fPIE T:ref64
gcc -march=native -mtune=native -O2 -fomit-frame-pointer -fwrapv -fPIC -fPIE T:ref64
gcc -march=native -mtune=native -O3 -fomit-frame-pointer -fwrapv -fPIC -fPIE T:ref64
gcc -march=native -mtune=native -O -fomit-frame-pointer -fwrapv -fPIC -fPIE T:ref64
gcc -march=native -mtune=native -Os -fomit-frame-pointer -fwrapv -fPIC -fPIE T:ref64

Namespace violations

Implementation: T:sse2
Security model: timingleaks
Compiler: clang -march=native -O2 -fomit-frame-pointer -fwrapv -Qunused-arguments -fPIC -fPIE
encrypt.o morus_dec_aut_partialblock T
encrypt.o morus_enc_aut_partialblock T
encrypt.o morus_initialization T
encrypt.o morus_stateupdate T
encrypt.o morus_tag_generation T
encrypt.o morus_tag_verification T

Number of similar (compiler,implementation) pairs: 8, namely:
CompilerImplementations
clang -march=native -O2 -fomit-frame-pointer -fwrapv -Qunused-arguments -fPIC -fPIE T:sse2
clang -march=native -O3 -fomit-frame-pointer -fwrapv -Qunused-arguments -fPIC -fPIE T:sse2
clang -march=native -O -fomit-frame-pointer -fwrapv -Qunused-arguments -fPIC -fPIE T:sse2
clang -march=native -Os -fomit-frame-pointer -fwrapv -Qunused-arguments -fPIC -fPIE T:sse2
clang -mcpu=native -O3 -fomit-frame-pointer -fwrapv -Qunused-arguments -fPIC -fPIE T:sse2
gcc -march=native -mtune=native -O2 -fomit-frame-pointer -fwrapv -fPIC -fPIE T:sse2
gcc -march=native -mtune=native -O3 -fomit-frame-pointer -fwrapv -fPIC -fPIE T:sse2
gcc -march=native -mtune=native -O -fomit-frame-pointer -fwrapv -fPIC -fPIE T:sse2