Implementation notes: amd64, ryzen, crypto_aead/aegis256

Computer: ryzen
Architecture: amd64
CPU ID: AuthenticAMD-00800f11-178bfbff
SUPERCOP version: 20170904
Operation: crypto_aead
Primitive: aegis256
TimeObject sizeTest sizeImplementationCompilerBenchmark dateSUPERCOP version
2310? ? ?? ? ?aesniclang_-O3_-fwrapv_-march=native_-fomit-frame-pointer_-Qunused-arguments2017091120170904
2310? ? ?? ? ?aesnigcc_-m64_-march=core-avx-i_-O3_-fomit-frame-pointer2017091120170904
2310? ? ?? ? ?aesnigcc_-m64_-march=core-avx2_-O3_-fomit-frame-pointer2017091120170904
2310? ? ?? ? ?aesnigcc_-m64_-march=corei7-avx_-O3_-fomit-frame-pointer2017091120170904
2340? ? ?? ? ?aesniclang_-march=native_-O3_-fomit-frame-pointer_-fwrapv_-Qunused-arguments2017091120170904
2430? ? ?? ? ?aesniclang_-O3_-fwrapv_-mavx_-maes_-mpclmul_-fomit-frame-pointer_-Qunused-arguments2017091120170904
2460? ? ?? ? ?aesniclang_-O3_-fwrapv_-march=x86-64_-mcpu=core-avx2_-mavx2_-maes_-mpclmul_-fomit-frame-pointer_-Qunused-arguments2017091120170904
2460? ? ?? ? ?aesnigcc_-m64_-march=core-avx-i_-O2_-fomit-frame-pointer2017091120170904
2490? ? ?? ? ?aesnigcc_-m64_-march=core-avx2_-O_-fomit-frame-pointer2017091120170904
2490? ? ?? ? ?aesnigcc_-m64_-march=corei7-avx_-O2_-fomit-frame-pointer2017091120170904
2520? ? ?? ? ?aesnigcc_-m64_-march=core-avx2_-O2_-fomit-frame-pointer2017091120170904
2550? ? ?? ? ?aesnigcc_-m64_-march=corei7-avx_-O_-fomit-frame-pointer2017091120170904
2880? ? ?? ? ?aesniicc_-no-vec2017091120170904
2910? ? ?? ? ?aesniicc2017091120170904
3000? ? ?? ? ?aesnigcc_-m64_-march=native_-mtune=native_-O3_-fomit-frame-pointer2017091120170904
3240? ? ?? ? ?aesnigcc_-m64_-march=native_-mtune=native_-O_-fomit-frame-pointer2017091120170904
3240? ? ?? ? ?aesnigcc_-march=native_-mtune=native_-O_-fomit-frame-pointer_-fwrapv2017091120170904
3270? ? ?? ? ?aesnigcc_-m64_-march=native_-mtune=native_-O2_-fomit-frame-pointer2017091120170904
3270? ? ?? ? ?aesnigcc_-march=native_-mtune=native_-O2_-fomit-frame-pointer_-fwrapv2017091120170904
6330? ? ?? ? ?aesnigcc_-m64_-march=core-avx-i_-O_-fomit-frame-pointer2017091120170904
7530? ? ?? ? ?aesnigcc_-march=native_-mtune=native_-O3_-fomit-frame-pointer_-fwrapv2017091120170904
55290? ? ?? ? ?reficc2017091120170904
55470? ? ?? ? ?reficc_-no-vec2017091120170904
60000? ? ?? ? ?refgcc_-march=native_-mtune=native_-O3_-fomit-frame-pointer_-fwrapv2017091120170904
60030? ? ?? ? ?refgcc_-funroll-loops_-m64_-O3_-fomit-frame-pointer2017091120170904
60030? ? ?? ? ?refgcc_-m64_-march=corei7_-O3_-fomit-frame-pointer2017091120170904
60030? ? ?? ? ?refgcc_-m64_-march=native_-mtune=native_-O3_-fomit-frame-pointer2017091120170904
60060? ? ?? ? ?refgcc_-funroll-loops_-m64_-march=barcelona_-O3_-fomit-frame-pointer2017091120170904
60060? ? ?? ? ?refgcc_-m64_-march=core2_-msse4_-O3_-fomit-frame-pointer2017091120170904
60060? ? ?? ? ?refgcc_-march=nocona_-O3_-fomit-frame-pointer2017091120170904
60090? ? ?? ? ?refgcc_-funroll-loops_-fno-schedule-insns_-O3_-fomit-frame-pointer2017091120170904
60090? ? ?? ? ?refgcc_-march=barcelona_-O3_-fomit-frame-pointer2017091120170904
60120? ? ?? ? ?refgcc_-funroll-loops_-march=barcelona_-O3_-fomit-frame-pointer2017091120170904
60120? ? ?? ? ?refgcc_-m64_-O3_-fomit-frame-pointer2017091120170904
60120? ? ?? ? ?refgcc_-m64_-march=barcelona_-O3_-fomit-frame-pointer2017091120170904
60120? ? ?? ? ?refgcc_-m64_-march=core2_-msse4.1_-O3_-fomit-frame-pointer2017091120170904
60120? ? ?? ? ?refgcc_-m64_-march=k8_-O3_-fomit-frame-pointer2017091120170904
60120? ? ?? ? ?refgcc_-m64_-march=nocona_-O3_-fomit-frame-pointer2017091120170904
60120? ? ?? ? ?refgcc_-march=k8_-O3_-fomit-frame-pointer2017091120170904
60150? ? ?? ? ?refgcc_-m64_-march=core2_-O3_-fomit-frame-pointer2017091120170904
60210? ? ?? ? ?refgcc_-funroll-loops_-O3_-fomit-frame-pointer2017091120170904
60210? ? ?? ? ?refgcc_-funroll-loops_-m64_-march=nocona_-O3_-fomit-frame-pointer2017091120170904
60210? ? ?? ? ?refgcc_-funroll-loops_-march=nocona_-O3_-fomit-frame-pointer2017091120170904
60300? ? ?? ? ?refgcc_-funroll-loops_-m64_-march=k8_-O3_-fomit-frame-pointer2017091120170904
60330? ? ?? ? ?refgcc_-funroll-loops_-march=k8_-O3_-fomit-frame-pointer2017091120170904
60360? ? ?? ? ?refgcc_-O3_-fomit-frame-pointer2017091120170904
60390? ? ?? ? ?refgcc_-m64_-march=core-avx2_-O3_-fomit-frame-pointer2017091120170904
60450? ? ?? ? ?refgcc_-m64_-march=core-avx-i_-O3_-fomit-frame-pointer2017091120170904
60450? ? ?? ? ?refgcc_-m64_-march=corei7-avx_-O3_-fomit-frame-pointer2017091120170904
60810? ? ?? ? ?refgcc_-funroll-loops_-m64_-O2_-fomit-frame-pointer2017091120170904
60870? ? ?? ? ?refgcc_-funroll-loops_-m64_-march=barcelona_-O2_-fomit-frame-pointer2017091120170904
60870? ? ?? ? ?refgcc_-funroll-loops_-march=barcelona_-O2_-fomit-frame-pointer2017091120170904
60900? ? ?? ? ?refgcc_-funroll-loops_-march=k8_-O2_-fomit-frame-pointer2017091120170904
60960? ? ?? ? ?refgcc_-funroll-loops_-fno-schedule-insns_-O2_-fomit-frame-pointer2017091120170904
61020? ? ?? ? ?refgcc_-funroll-loops_-O2_-fomit-frame-pointer2017091120170904
61020? ? ?? ? ?refgcc_-funroll-loops_-m64_-march=k8_-O2_-fomit-frame-pointer2017091120170904
61080? ? ?? ? ?refgcc_-m64_-march=core-avx2_-O2_-fomit-frame-pointer2017091120170904
61110? ? ?? ? ?refgcc_-m64_-march=native_-mtune=native_-O2_-fomit-frame-pointer2017091120170904
61110? ? ?? ? ?refgcc_-m64_-march=nocona_-O2_-fomit-frame-pointer2017091120170904
61110? ? ?? ? ?refgcc_-march=native_-mtune=native_-O2_-fomit-frame-pointer_-fwrapv2017091120170904
61140? ? ?? ? ?refgcc_-m64_-march=corei7-avx_-O2_-fomit-frame-pointer2017091120170904
61140? ? ?? ? ?refgcc_-march=nocona_-O2_-fomit-frame-pointer2017091120170904
61170? ? ?? ? ?refgcc_-O2_-fomit-frame-pointer2017091120170904
61170? ? ?? ? ?refgcc_-m64_-march=core2_-msse4_-O2_-fomit-frame-pointer2017091120170904
61170? ? ?? ? ?refgcc_-m64_-march=corei7_-O2_-fomit-frame-pointer2017091120170904
61200? ? ?? ? ?refgcc_-m64_-O2_-fomit-frame-pointer2017091120170904
61200? ? ?? ? ?refgcc_-m64_-march=barcelona_-O2_-fomit-frame-pointer2017091120170904
61200? ? ?? ? ?refgcc_-m64_-march=core2_-O2_-fomit-frame-pointer2017091120170904
61200? ? ?? ? ?refgcc_-m64_-march=k8_-O2_-fomit-frame-pointer2017091120170904
61230? ? ?? ? ?refgcc_-m64_-march=core2_-msse4.1_-O2_-fomit-frame-pointer2017091120170904
61230? ? ?? ? ?refgcc_-march=barcelona_-O2_-fomit-frame-pointer2017091120170904
61260? ? ?? ? ?refgcc_-fno-schedule-insns_-O2_-fomit-frame-pointer2017091120170904
61260? ? ?? ? ?refgcc_-funroll-loops_-march=nocona_-O2_-fomit-frame-pointer2017091120170904
61350? ? ?? ? ?refgcc_-funroll-loops_-m64_-march=barcelona_-O_-fomit-frame-pointer2017091120170904
61350? ? ?? ? ?refgcc_-m64_-march=native_-mtune=native_-O_-fomit-frame-pointer2017091120170904
61380? ? ?? ? ?refgcc_-funroll-loops_-march=barcelona_-O_-fomit-frame-pointer2017091120170904
61530? ? ?? ? ?refgcc_-m64_-march=barcelona_-O_-fomit-frame-pointer2017091120170904
61590? ? ?? ? ?refgcc_-march=barcelona_-O_-fomit-frame-pointer2017091120170904
61620? ? ?? ? ?refgcc_-m64_-march=core2_-O_-fomit-frame-pointer2017091120170904
61680? ? ?? ? ?refgcc_-funroll-loops_-m64_-march=k8_-O_-fomit-frame-pointer2017091120170904
61680? ? ?? ? ?refgcc_-march=nocona_-O_-fomit-frame-pointer2017091120170904
61710? ? ?? ? ?refgcc_-fno-schedule-insns_-O_-fomit-frame-pointer2017091120170904
61710? ? ?? ? ?refgcc_-funroll-loops_-O_-fomit-frame-pointer2017091120170904
61710? ? ?? ? ?refgcc_-m64_-march=core2_-msse4.1_-O_-fomit-frame-pointer2017091120170904
61710? ? ?? ? ?refgcc_-m64_-march=nocona_-O_-fomit-frame-pointer2017091120170904
61740? ? ?? ? ?refgcc_-funroll-loops_-fno-schedule-insns_-O_-fomit-frame-pointer2017091120170904
61740? ? ?? ? ?refgcc_-m64_-march=core-avx2_-O_-fomit-frame-pointer2017091120170904
61740? ? ?? ? ?refgcc_-m64_-march=corei7-avx_-O_-fomit-frame-pointer2017091120170904
61740? ? ?? ? ?refgcc_-m64_-march=corei7_-O_-fomit-frame-pointer2017091120170904
61740? ? ?? ? ?refgcc_-m64_-march=k8_-O_-fomit-frame-pointer2017091120170904
61740? ? ?? ? ?refgcc_-march=k8_-O_-fomit-frame-pointer2017091120170904
61770? ? ?? ? ?refgcc_-O_-fomit-frame-pointer2017091120170904
61770? ? ?? ? ?refgcc_-m64_-O_-fomit-frame-pointer2017091120170904
61800? ? ?? ? ?refgcc_-funroll-loops_-m64_-O_-fomit-frame-pointer2017091120170904
61800? ? ?? ? ?refgcc_-funroll-loops_-march=nocona_-O_-fomit-frame-pointer2017091120170904
61830? ? ?? ? ?refgcc_-funroll-loops_-m64_-march=nocona_-O_-fomit-frame-pointer2017091120170904
61980? ? ?? ? ?refgcc_-m64_-march=core-avx-i_-O_-fomit-frame-pointer2017091120170904
62220? ? ?? ? ?refgcc_-funroll-loops_-march=k8_-O_-fomit-frame-pointer2017091120170904
150690? ? ?? ? ?refgcc_-fno-schedule-insns_-O3_-fomit-frame-pointer2017091120170904
152880? ? ?? ? ?refgcc_-march=k8_-O2_-fomit-frame-pointer2017091120170904
152910? ? ?? ? ?refgcc_-m64_-march=core-avx-i_-O2_-fomit-frame-pointer2017091120170904
152940? ? ?? ? ?refgcc_-funroll-loops_-m64_-march=nocona_-O2_-fomit-frame-pointer2017091120170904
153240? ? ?? ? ?refgcc_-march=native_-mtune=native_-O_-fomit-frame-pointer_-fwrapv2017091120170904
154200? ? ?? ? ?refgcc_-m64_-march=core2_-msse4_-O_-fomit-frame-pointer2017091120170904

Compiler output

Implementation: crypto_aead/aegis256/aesni
Compiler: cc
encrypt.c: In file included from /usr/lib/gcc/x86_64-pc-linux-gnu/7.2.0/include/immintrin.h:39:0,
encrypt.c: from encrypt.c:4:
encrypt.c: encrypt.c: In function 'aegis256_initialization':
encrypt.c: /usr/lib/gcc/x86_64-pc-linux-gnu/7.2.0/include/wmmintrin.h:61:1: error: inlining failed in call to always_inline '_mm_aesenc_si128': target specific option mismatch
encrypt.c: _mm_aesenc_si128 (__m128i __X, __m128i __Y)
encrypt.c: ^~~~~~~~~~~~~~~~
encrypt.c: encrypt.c:61:25: note: called from here
encrypt.c: state[0] = _mm_aesenc_si128(tmp,state[0]);
encrypt.c: ^~~~~~~~~~~~~~~~~~~~~~~~~~~~~~
encrypt.c: In file included from /usr/lib/gcc/x86_64-pc-linux-gnu/7.2.0/include/immintrin.h:39:0,
encrypt.c: from encrypt.c:4:
encrypt.c: /usr/lib/gcc/x86_64-pc-linux-gnu/7.2.0/include/wmmintrin.h:61:1: error: inlining failed in call to always_inline '_mm_aesenc_si128': target specific option mismatch
encrypt.c: _mm_aesenc_si128 (__m128i __X, __m128i __Y)
encrypt.c: ^~~~~~~~~~~~~~~~
encrypt.c: encrypt.c:60:25: note: called from here
encrypt.c: state[1] = _mm_aesenc_si128(state[0],state[1]);
encrypt.c: ^~~~~~~~~~~~~~~~~~~~~~~~~~~~~~~~~~~
encrypt.c: In file included from /usr/lib/gcc/x86_64-pc-linux-gnu/7.2.0/include/immintrin.h:39:0,
encrypt.c: from encrypt.c:4:
encrypt.c: /usr/lib/gcc/x86_64-pc-linux-gnu/7.2.0/include/wmmintrin.h:61:1: error: inlining failed in call to always_inline '_mm_aesenc_si128': target specific option mismatch
encrypt.c: _mm_aesenc_si128 (__m128i __X, __m128i __Y)
encrypt.c: ^~~~~~~~~~~~~~~~
encrypt.c: encrypt.c:59:25: note: called from here
encrypt.c: state[2] = _mm_aesenc_si128(state[1],state[2]);
encrypt.c: ^~~~~~~~~~~~~~~~~~~~~~~~~~~~~~~~~~~
encrypt.c: ...

Number of similar (compiler,implementation) pairs: 3, namely:
CompilerImplementations
cc aesni
gcc aesni
gcc -funroll-loops aesni

Compiler output

Implementation: crypto_aead/aegis256/ref
Compiler: cc
try.c: crypto_aead_aegis256.a(encrypt.o): In function `crypto_aead_aegis256_ref_encrypt':
try.c: encrypt.c:(.text+0x...): undefined reference to `aegis256_initialization'
try.c: encrypt.c:(.text+0x...): undefined reference to `aegis256_enc_aut_step'
try.c: encrypt.c:(.text+0x...): undefined reference to `aegis256_enc_aut_step'
try.c: encrypt.c:(.text+0x...): undefined reference to `aegis256_enc_aut_step'
try.c: encrypt.c:(.text+0x...): undefined reference to `aegis256_enc_aut_step'
try.c: crypto_aead_aegis256.a(encrypt.o): In function `crypto_aead_aegis256_ref_decrypt':
try.c: encrypt.c:(.text+0x...): undefined reference to `aegis256_initialization'
try.c: encrypt.c:(.text+0x...): undefined reference to `aegis256_enc_aut_step'
try.c: encrypt.c:(.text+0x...): undefined reference to `aegis256_enc_aut_step'
try.c: encrypt.c:(.text+0x...): undefined reference to `aegis256_dec_aut_step'
try.c: encrypt.c:(.text+0x...): undefined reference to `aegis256_dec_aut_step'
try.c: collect2: error: ld returned 1 exit status

Number of similar (compiler,implementation) pairs: 29, namely:
CompilerImplementations
cc ref
gcc ref
gcc -Os -fomit-frame-pointer ref
gcc -fno-schedule-insns -Os -fomit-frame-pointer ref
gcc -funroll-loops ref
gcc -funroll-loops -Os -fomit-frame-pointer ref
gcc -funroll-loops -fno-schedule-insns -Os -fomit-frame-pointer ref
gcc -funroll-loops -m64 -Os -fomit-frame-pointer ref
gcc -funroll-loops -m64 -march=barcelona -Os -fomit-frame-pointer ref
gcc -funroll-loops -m64 -march=k8 -Os -fomit-frame-pointer ref
gcc -funroll-loops -m64 -march=nocona -Os -fomit-frame-pointer ref
gcc -funroll-loops -march=barcelona -Os -fomit-frame-pointer ref
gcc -funroll-loops -march=k8 -Os -fomit-frame-pointer ref
gcc -funroll-loops -march=nocona -Os -fomit-frame-pointer ref
gcc -m64 -Os -fomit-frame-pointer ref
gcc -m64 -march=core-avx-i -Os -fomit-frame-pointer ref
gcc -m64 -march=core-avx2 -Os -fomit-frame-pointer ref
gcc -m64 -march=core2 -Os -fomit-frame-pointer ref
gcc -m64 -march=core2 -msse4.1 -Os -fomit-frame-pointer ref
gcc -m64 -march=core2 -msse4 -Os -fomit-frame-pointer ref
gcc -m64 -march=corei7-avx -Os -fomit-frame-pointer ref
gcc -m64 -march=corei7 -Os -fomit-frame-pointer ref
gcc -m64 -march=k8 -Os -fomit-frame-pointer ref
gcc -m64 -march=native -mtune=native -Os -fomit-frame-pointer ref
gcc -m64 -march=nocona -Os -fomit-frame-pointer ref
gcc -march=barcelona -Os -fomit-frame-pointer ref
gcc -march=k8 -Os -fomit-frame-pointer ref
gcc -march=native -mtune=native -Os -fomit-frame-pointer -fwrapv ref
gcc -march=nocona -Os -fomit-frame-pointer ref

Compiler output

Implementation: crypto_aead/aegis256/aesni
Compiler: clang -O3 -fomit-frame-pointer -Qunused-arguments
encrypt.c: encrypt.c:42:25: error: always_inline function '_mm_aesenc_si128' requires target feature 'aes', but would be inlined into function 'aegis256_initialization' that is compiled without support for 'aes'
encrypt.c: state[5] = _mm_aesenc_si128(state[4],state[5]);
encrypt.c: ^
encrypt.c: encrypt.c:43:25: error: always_inline function '_mm_aesenc_si128' requires target feature 'aes', but would be inlined into function 'aegis256_initialization' that is compiled without support for 'aes'
encrypt.c: state[4] = _mm_aesenc_si128(state[3],state[4]);
encrypt.c: ^
encrypt.c: encrypt.c:44:25: error: always_inline function '_mm_aesenc_si128' requires target feature 'aes', but would be inlined into function 'aegis256_initialization' that is compiled without support for 'aes'
encrypt.c: state[3] = _mm_aesenc_si128(state[2],state[3]);
encrypt.c: ^
encrypt.c: encrypt.c:45:25: error: always_inline function '_mm_aesenc_si128' requires target feature 'aes', but would be inlined into function 'aegis256_initialization' that is compiled without support for 'aes'
encrypt.c: state[2] = _mm_aesenc_si128(state[1],state[2]);
encrypt.c: ^
encrypt.c: encrypt.c:46:25: error: always_inline function '_mm_aesenc_si128' requires target feature 'aes', but would be inlined into function 'aegis256_initialization' that is compiled without support for 'aes'
encrypt.c: state[1] = _mm_aesenc_si128(state[0],state[1]);
encrypt.c: ^
encrypt.c: encrypt.c:47:25: error: always_inline function '_mm_aesenc_si128' requires target feature 'aes', but would be inlined into function 'aegis256_initialization' that is compiled without support for 'aes'
encrypt.c: state[0] = _mm_aesenc_si128(tmp,state[0]);
encrypt.c: ^
encrypt.c: encrypt.c:56:25: error: always_inline function '_mm_aesenc_si128' requires target feature 'aes', but would be inlined into function 'aegis256_initialization' that is compiled without support for 'aes'
encrypt.c: state[5] = _mm_aesenc_si128(state[4],state[5]);
encrypt.c: ^
encrypt.c: encrypt.c:57:25: error: always_inline function '_mm_aesenc_si128' requires target feature 'aes', but would be inlined into function 'aegis256_initialization' that is compiled without support for 'aes'
encrypt.c: state[4] = _mm_aesenc_si128(state[3],state[4]);
encrypt.c: ^
encrypt.c: encrypt.c:58:25: error: always_inline function '_mm_aesenc_si128' requires target feature 'aes', but would be inlined into function 'aegis256_initialization' that is compiled without support for 'aes'
encrypt.c: ...

Number of similar (compiler,implementation) pairs: 6, namely:
CompilerImplementations
clang -O3 -fomit-frame-pointer -Qunused-arguments aesni
clang -O3 -fwrapv -mavx2 -fomit-frame-pointer -Qunused-arguments aesni
clang -O3 -fwrapv -mavx -fomit-frame-pointer -Qunused-arguments aesni
clang -mcpu=cortex-a8 -mfpu=neon -O3 -fomit-frame-pointer -fwrapv -Qunused-arguments aesni
clang -mcpu=cortex-a9 -mfpu=neon -O3 -fomit-frame-pointer -fwrapv -Qunused-arguments aesni
clang -mcpu=native -mfpu=neon -O3 -fomit-frame-pointer -fwrapv -Qunused-arguments aesni

Compiler output

Implementation: crypto_aead/aegis256/ref
Compiler: clang -O3 -fomit-frame-pointer -Qunused-arguments
try.c: crypto_aead_aegis256.a(encrypt.o): In function `crypto_aead_aegis256_ref_encrypt':
try.c: encrypt.c:(.text+0x...): undefined reference to `aegis256_initialization'
try.c: crypto_aead_aegis256.a(encrypt.o): In function `crypto_aead_aegis256_ref_decrypt':
try.c: encrypt.c:(.text+0x...): undefined reference to `aegis256_initialization'
try.c: clang-4.0: error: linker command failed with exit code 1 (use -v to see invocation)

Number of similar (compiler,implementation) pairs: 10, namely:
CompilerImplementations
clang -O3 -fomit-frame-pointer -Qunused-arguments ref
clang -O3 -fwrapv -march=native -fomit-frame-pointer -Qunused-arguments ref
clang -O3 -fwrapv -march=x86-64 -mcpu=core-avx2 -mavx2 -maes -mpclmul -fomit-frame-pointer -Qunused-arguments ref
clang -O3 -fwrapv -mavx2 -fomit-frame-pointer -Qunused-arguments ref
clang -O3 -fwrapv -mavx -fomit-frame-pointer -Qunused-arguments ref
clang -O3 -fwrapv -mavx -maes -mpclmul -fomit-frame-pointer -Qunused-arguments ref
clang -march=native -O3 -fomit-frame-pointer -fwrapv -Qunused-arguments ref
clang -mcpu=cortex-a8 -mfpu=neon -O3 -fomit-frame-pointer -fwrapv -Qunused-arguments ref
clang -mcpu=cortex-a9 -mfpu=neon -O3 -fomit-frame-pointer -fwrapv -Qunused-arguments ref
clang -mcpu=native -mfpu=neon -O3 -fomit-frame-pointer -fwrapv -Qunused-arguments ref

Compiler output

Implementation: crypto_aead/aegis256/aesni
Compiler: gcc -O2 -fomit-frame-pointer
encrypt.c: In file included from /usr/lib/gcc/x86_64-pc-linux-gnu/7.2.0/include/immintrin.h:39:0,
encrypt.c: from encrypt.c:4:
encrypt.c: encrypt.c: In function 'aegis256_enc_aut_step':
encrypt.c: /usr/lib/gcc/x86_64-pc-linux-gnu/7.2.0/include/wmmintrin.h:61:1: error: inlining failed in call to always_inline '_mm_aesenc_si128': target specific option mismatch
encrypt.c: _mm_aesenc_si128 (__m128i __X, __m128i __Y)
encrypt.c: ^~~~~~~~~~~~~~~~
encrypt.c: encrypt.c:132:20: note: called from here
encrypt.c: state[0] = _mm_aesenc_si128(tmp,state[0]);
encrypt.c: ^~~~~~~~~~~~~~~~~~~~~~~~~~~~~~
encrypt.c: In file included from /usr/lib/gcc/x86_64-pc-linux-gnu/7.2.0/include/immintrin.h:39:0,
encrypt.c: from encrypt.c:4:
encrypt.c: /usr/lib/gcc/x86_64-pc-linux-gnu/7.2.0/include/wmmintrin.h:61:1: error: inlining failed in call to always_inline '_mm_aesenc_si128': target specific option mismatch
encrypt.c: _mm_aesenc_si128 (__m128i __X, __m128i __Y)
encrypt.c: ^~~~~~~~~~~~~~~~
encrypt.c: encrypt.c:131:20: note: called from here
encrypt.c: state[1] = _mm_aesenc_si128(state[0],state[1]);
encrypt.c: ^~~~~~~~~~~~~~~~~~~~~~~~~~~~~~~~~~~
encrypt.c: In file included from /usr/lib/gcc/x86_64-pc-linux-gnu/7.2.0/include/immintrin.h:39:0,
encrypt.c: from encrypt.c:4:
encrypt.c: /usr/lib/gcc/x86_64-pc-linux-gnu/7.2.0/include/wmmintrin.h:61:1: error: inlining failed in call to always_inline '_mm_aesenc_si128': target specific option mismatch
encrypt.c: _mm_aesenc_si128 (__m128i __X, __m128i __Y)
encrypt.c: ^~~~~~~~~~~~~~~~
encrypt.c: encrypt.c:130:20: note: called from here
encrypt.c: state[2] = _mm_aesenc_si128(state[1],state[2]);
encrypt.c: ^~~~~~~~~~~~~~~~~~~~~~~~~~~~~~~~~~~
encrypt.c: ...

Number of similar (compiler,implementation) pairs: 84, namely:
CompilerImplementations
gcc -O2 -fomit-frame-pointer aesni
gcc -O3 -fomit-frame-pointer aesni
gcc -O -fomit-frame-pointer aesni
gcc -Os -fomit-frame-pointer aesni
gcc -fno-schedule-insns -O2 -fomit-frame-pointer aesni
gcc -fno-schedule-insns -O3 -fomit-frame-pointer aesni
gcc -fno-schedule-insns -O -fomit-frame-pointer aesni
gcc -fno-schedule-insns -Os -fomit-frame-pointer aesni
gcc -funroll-loops -O2 -fomit-frame-pointer aesni
gcc -funroll-loops -O3 -fomit-frame-pointer aesni
gcc -funroll-loops -O -fomit-frame-pointer aesni
gcc -funroll-loops -Os -fomit-frame-pointer aesni
gcc -funroll-loops -fno-schedule-insns -O2 -fomit-frame-pointer aesni
gcc -funroll-loops -fno-schedule-insns -O3 -fomit-frame-pointer aesni
gcc -funroll-loops -fno-schedule-insns -O -fomit-frame-pointer aesni
gcc -funroll-loops -fno-schedule-insns -Os -fomit-frame-pointer aesni
gcc -funroll-loops -m64 -O2 -fomit-frame-pointer aesni
gcc -funroll-loops -m64 -O3 -fomit-frame-pointer aesni
gcc -funroll-loops -m64 -O -fomit-frame-pointer aesni
gcc -funroll-loops -m64 -Os -fomit-frame-pointer aesni
gcc -funroll-loops -m64 -march=barcelona -O2 -fomit-frame-pointer aesni
gcc -funroll-loops -m64 -march=barcelona -O3 -fomit-frame-pointer aesni
gcc -funroll-loops -m64 -march=barcelona -O -fomit-frame-pointer aesni
gcc -funroll-loops -m64 -march=barcelona -Os -fomit-frame-pointer aesni
gcc -funroll-loops -m64 -march=k8 -O2 -fomit-frame-pointer aesni
gcc -funroll-loops -m64 -march=k8 -O3 -fomit-frame-pointer aesni
gcc -funroll-loops -m64 -march=k8 -O -fomit-frame-pointer aesni
gcc -funroll-loops -m64 -march=k8 -Os -fomit-frame-pointer aesni
gcc -funroll-loops -m64 -march=nocona -O2 -fomit-frame-pointer aesni
gcc -funroll-loops -m64 -march=nocona -O3 -fomit-frame-pointer aesni
gcc -funroll-loops -m64 -march=nocona -O -fomit-frame-pointer aesni
gcc -funroll-loops -m64 -march=nocona -Os -fomit-frame-pointer aesni
gcc -funroll-loops -march=barcelona -O2 -fomit-frame-pointer aesni
gcc -funroll-loops -march=barcelona -O3 -fomit-frame-pointer aesni
gcc -funroll-loops -march=barcelona -O -fomit-frame-pointer aesni
gcc -funroll-loops -march=barcelona -Os -fomit-frame-pointer aesni
gcc -funroll-loops -march=k8 -O2 -fomit-frame-pointer aesni
gcc -funroll-loops -march=k8 -O3 -fomit-frame-pointer aesni
gcc -funroll-loops -march=k8 -O -fomit-frame-pointer aesni
gcc -funroll-loops -march=k8 -Os -fomit-frame-pointer aesni
gcc -funroll-loops -march=nocona -O2 -fomit-frame-pointer aesni
gcc -funroll-loops -march=nocona -O3 -fomit-frame-pointer aesni
gcc -funroll-loops -march=nocona -O -fomit-frame-pointer aesni
gcc -funroll-loops -march=nocona -Os -fomit-frame-pointer aesni
gcc -m64 -O2 -fomit-frame-pointer aesni
gcc -m64 -O3 -fomit-frame-pointer aesni
gcc -m64 -O -fomit-frame-pointer aesni
gcc -m64 -Os -fomit-frame-pointer aesni
gcc -m64 -march=core2 -O2 -fomit-frame-pointer aesni
gcc -m64 -march=core2 -O3 -fomit-frame-pointer aesni
gcc -m64 -march=core2 -O -fomit-frame-pointer aesni
gcc -m64 -march=core2 -Os -fomit-frame-pointer aesni
gcc -m64 -march=core2 -msse4.1 -O2 -fomit-frame-pointer aesni
gcc -m64 -march=core2 -msse4.1 -O3 -fomit-frame-pointer aesni
gcc -m64 -march=core2 -msse4.1 -O -fomit-frame-pointer aesni
gcc -m64 -march=core2 -msse4.1 -Os -fomit-frame-pointer aesni
gcc -m64 -march=core2 -msse4 -O2 -fomit-frame-pointer aesni
gcc -m64 -march=core2 -msse4 -O3 -fomit-frame-pointer aesni
gcc -m64 -march=core2 -msse4 -O -fomit-frame-pointer aesni
gcc -m64 -march=core2 -msse4 -Os -fomit-frame-pointer aesni
gcc -m64 -march=corei7 -O2 -fomit-frame-pointer aesni
gcc -m64 -march=corei7 -O3 -fomit-frame-pointer aesni
gcc -m64 -march=corei7 -O -fomit-frame-pointer aesni
gcc -m64 -march=corei7 -Os -fomit-frame-pointer aesni
gcc -m64 -march=k8 -O2 -fomit-frame-pointer aesni
gcc -m64 -march=k8 -O3 -fomit-frame-pointer aesni
gcc -m64 -march=k8 -O -fomit-frame-pointer aesni
gcc -m64 -march=k8 -Os -fomit-frame-pointer aesni
gcc -m64 -march=nocona -O2 -fomit-frame-pointer aesni
gcc -m64 -march=nocona -O3 -fomit-frame-pointer aesni
gcc -m64 -march=nocona -O -fomit-frame-pointer aesni
gcc -m64 -march=nocona -Os -fomit-frame-pointer aesni
gcc -march=barcelona -O2 -fomit-frame-pointer aesni
gcc -march=barcelona -O3 -fomit-frame-pointer aesni
gcc -march=barcelona -O -fomit-frame-pointer aesni
gcc -march=barcelona -Os -fomit-frame-pointer aesni
gcc -march=k8 -O2 -fomit-frame-pointer aesni
gcc -march=k8 -O3 -fomit-frame-pointer aesni
gcc -march=k8 -O -fomit-frame-pointer aesni
gcc -march=k8 -Os -fomit-frame-pointer aesni
gcc -march=nocona -O2 -fomit-frame-pointer aesni
gcc -march=nocona -O3 -fomit-frame-pointer aesni
gcc -march=nocona -O -fomit-frame-pointer aesni
gcc -march=nocona -Os -fomit-frame-pointer aesni

Compiler output

Implementation: crypto_aead/aegis256/aesni
Compiler: gcc -m64 -march=barcelona -O2 -fomit-frame-pointer
encrypt.c: In file included from /usr/lib/gcc/x86_64-pc-linux-gnu/7.2.0/include/immintrin.h:39:0,
encrypt.c: from encrypt.c:4:
encrypt.c: encrypt.c: In function 'aegis256_enc_aut_step':
encrypt.c: /usr/lib/gcc/x86_64-pc-linux-gnu/7.2.0/include/wmmintrin.h:61:1: error: inlining failed in call to always_inline '_mm_aesenc_si128': target specific option mismatch
encrypt.c: _mm_aesenc_si128 (__m128i __X, __m128i __Y)
encrypt.c: ^~~~~~~~~~~~~~~~
encrypt.c: encrypt.c:132:20: note: called from here
encrypt.c: state[0] = _mm_aesenc_si128(tmp,state[0]);
encrypt.c: ^~~~~~~~~~~~~~~~~~~~~~~~~~~~~~
encrypt.c: In file included from /usr/lib/gcc/x86_64-pc-linux-gnu/7.2.0/include/immintrin.h:39:0,
encrypt.c: from encrypt.c:4:
encrypt.c: /usr/lib/gcc/x86_64-pc-linux-gnu/7.2.0/include/wmmintrin.h:61:1: error: inlining failed in call to always_inline '_mm_aesenc_si128': target specific option mismatch
encrypt.c: _mm_aesenc_si128 (__m128i __X, __m128i __Y)
encrypt.c: ^~~~~~~~~~~~~~~~
encrypt.c: encrypt.c:131:20: note: called from here
encrypt.c: state[1] = _mm_aesenc_si128(state[0],state[1]);
encrypt.c: ^~~~~~~~~~~~~~~~~~~~~~~~~~~~~~~~~~~
encrypt.c: In file included from /usr/lib/gcc/x86_64-pc-linux-gnu/7.2.0/include/immintrin.h:39:0,
encrypt.c: from encrypt.c:4:
encrypt.c: /usr/lib/gcc/x86_64-pc-linux-gnu/7.2.0/include/wmmintrin.h:61:1: error: inlining failed in call to always_inline '_mm_aesenc_si128': target specific option mismatch
encrypt.c: _mm_aesenc_si128 (__m128i __X, __m128i __Y)
encrypt.c: ^~~~~~~~~~~~~~~~
encrypt.c: encrypt.c:130:20: note: called from here
encrypt.c: state[2] = _mm_aesenc_si128(state[1],state[2]);
encrypt.c: ^~~~~~~~~~~~~~~~~~~~~~~~~~~~~~~~~~~
encrypt.c: ...
encrypt.c: In file included from /usr/lib/gcc/x86_64-pc-linux-gnu/7.2.0/include/immintrin.h:39:0,
encrypt.c: from encrypt.c:4:
encrypt.c: encrypt.c: In function 'aegis256_enc_aut_step':
encrypt.c: /usr/lib/gcc/x86_64-pc-linux-gnu/7.2.0/include/wmmintrin.h:61:1: error: inlining failed in call to always_inline '_mm_aesenc_si128': target specific option mismatch
encrypt.c: _mm_aesenc_si128 (__m128i __X, __m128i __Y)
encrypt.c: ^~~~~~~~~~~~~~~~
encrypt.c: encrypt.c:132:20: note: called from here
encrypt.c: state[0] = _mm_aesenc_si128(tmp,state[0]);
encrypt.c: ^~~~~~~~~~~~~~~~~~~~~~~~~~~~~~
encrypt.c: In file included from /usr/lib/gcc/x86_64-pc-linux-gnu/7.2.0/include/immintrin.h:39:0,
encrypt.c: from encrypt.c:4:
encrypt.c: /usr/lib/gcc/x86_64-pc-linux-gnu/7.2.0/include/wmmintrin.h:61:1: error: inlining failed in call to always_inline '_mm_aesenc_si128': target specific option mismatch
encrypt.c: _mm_aesenc_si128 (__m128i __X, __m128i __Y)
encrypt.c: ^~~~~~~~~~~~~~~~
encrypt.c: encrypt.c:131:20: note: called from here
encrypt.c: state[1] = _mm_aesenc_si128(state[0],state[1]);
encrypt.c: ^~~~~~~~~~~~~~~~~~~~~~~~~~~~~~~~~~~
encrypt.c: In file included from /usr/lib/gcc/x86_64-pc-linux-gnu/7.2.0/include/immintrin.h:39:0,
encrypt.c: from encrypt.c:4:
encrypt.c: /usr/lib/gcc/x86_64-pc-linux-gnu/7.2.0/include/wmmintrin.h:61:1: error: inlining failed in call to always_inline '_mm_aesenc_si128': target specific option mismatch
encrypt.c: _mm_aesenc_si128 (__m128i __X, __m128i __Y)
encrypt.c: ^~~~~~~~~~~~~~~~
encrypt.c: encrypt.c:130:20: note: called from here
encrypt.c: state[2] = _mm_aesenc_si128(state[1],state[2]);
encrypt.c: ^~~~~~~~~~~~~~~~~~~~~~~~~~~~~~~~~~~
encrypt.c: ...

Number of similar (compiler,implementation) pairs: 4, namely:
CompilerImplementations
gcc -m64 -march=barcelona -O2 -fomit-frame-pointer aesni
gcc -m64 -march=barcelona -O3 -fomit-frame-pointer aesni
gcc -m64 -march=barcelona -O -fomit-frame-pointer aesni
gcc -m64 -march=barcelona -Os -fomit-frame-pointer aesni

Compiler output

Implementation: crypto_aead/aegis256/ref
Compiler: gcc -m64 -march=barcelona -Os -fomit-frame-pointer
try.c: crypto_aead_aegis256.a(encrypt.o): In function `crypto_aead_aegis256_ref_encrypt':
try.c: encrypt.c:(.text+0x...): undefined reference to `aegis256_initialization'
try.c: encrypt.c:(.text+0x...): undefined reference to `aegis256_enc_aut_step'
try.c: encrypt.c:(.text+0x...): undefined reference to `aegis256_enc_aut_step'
try.c: encrypt.c:(.text+0x...): undefined reference to `aegis256_enc_aut_step'
try.c: encrypt.c:(.text+0x...): undefined reference to `aegis256_enc_aut_step'
try.c: crypto_aead_aegis256.a(encrypt.o): In function `crypto_aead_aegis256_ref_decrypt':
try.c: encrypt.c:(.text+0x...): undefined reference to `aegis256_initialization'
try.c: encrypt.c:(.text+0x...): undefined reference to `aegis256_enc_aut_step'
try.c: encrypt.c:(.text+0x...): undefined reference to `aegis256_enc_aut_step'
try.c: encrypt.c:(.text+0x...): undefined reference to `aegis256_dec_aut_step'
try.c: encrypt.c:(.text+0x...): undefined reference to `aegis256_dec_aut_step'
try.c: collect2: error: ld returned 1 exit status
try.c: crypto_aead_aegis256.a(encrypt.o): In function `crypto_aead_aegis256_ref_encrypt':
try.c: encrypt.c:(.text+0x...): undefined reference to `aegis256_initialization'
try.c: encrypt.c:(.text+0x...): undefined reference to `aegis256_enc_aut_step'
try.c: encrypt.c:(.text+0x...): undefined reference to `aegis256_enc_aut_step'
try.c: encrypt.c:(.text+0x...): undefined reference to `aegis256_enc_aut_step'
try.c: encrypt.c:(.text+0x...): undefined reference to `aegis256_enc_aut_step'
try.c: crypto_aead_aegis256.a(encrypt.o): In function `crypto_aead_aegis256_ref_decrypt':
try.c: encrypt.c:(.text+0x...): undefined reference to `aegis256_initialization'
try.c: encrypt.c:(.text+0x...): undefined reference to `aegis256_enc_aut_step'
try.c: encrypt.c:(.text+0x...): undefined reference to `aegis256_enc_aut_step'
try.c: encrypt.c:(.text+0x...): undefined reference to `aegis256_dec_aut_step'
try.c: encrypt.c:(.text+0x...): undefined reference to `aegis256_dec_aut_step'
try.c: collect2: error: ld returned 1 exit status

Number of similar (compiler,implementation) pairs: 1, namely:
CompilerImplementations
gcc -m64 -march=barcelona -Os -fomit-frame-pointer ref

Compiler output

Implementation: crypto_aead/aegis256/aesni
Compiler: gcc -m64 -march=core-avx-i -Os -fomit-frame-pointer
try.c: crypto_aead_aegis256.a(encrypt.o): In function `crypto_aead_aegis256_aesni_encrypt':
try.c: encrypt.c:(.text+0x...): undefined reference to `aegis256_enc_aut_step'
try.c: encrypt.c:(.text+0x...): undefined reference to `aegis256_enc_aut_step'
try.c: encrypt.c:(.text+0x...): undefined reference to `aegis256_enc_aut_step'
try.c: encrypt.c:(.text+0x...): undefined reference to `aegis256_enc_aut_step'
try.c: crypto_aead_aegis256.a(encrypt.o): In function `crypto_aead_aegis256_aesni_decrypt':
try.c: encrypt.c:(.text+0x...): undefined reference to `aegis256_enc_aut_step'
try.c: crypto_aead_aegis256.a(encrypt.o):encrypt.c:(.text+0x...): more undefined references to `aegis256_enc_aut_step' follow
try.c: crypto_aead_aegis256.a(encrypt.o): In function `crypto_aead_aegis256_aesni_decrypt':
try.c: encrypt.c:(.text+0x...): undefined reference to `aegis256_dec_aut_step'
try.c: encrypt.c:(.text+0x...): undefined reference to `aegis256_dec_aut_step'
try.c: collect2: error: ld returned 1 exit status

Number of similar (compiler,implementation) pairs: 5, namely:
CompilerImplementations
gcc -m64 -march=core-avx-i -Os -fomit-frame-pointer aesni
gcc -m64 -march=core-avx2 -Os -fomit-frame-pointer aesni
gcc -m64 -march=corei7-avx -Os -fomit-frame-pointer aesni
gcc -m64 -march=native -mtune=native -Os -fomit-frame-pointer aesni
gcc -march=native -mtune=native -Os -fomit-frame-pointer -fwrapv aesni

Compiler output

Implementation: crypto_aead/aegis256/aesni
Compiler: icc -O1 -static
try.c: ld: cannot find -lcrypto

Number of similar (compiler,implementation) pairs: 32, namely:
CompilerImplementations
icc -O1 -static aesni ref
icc -O1 -static -no-vec aesni ref
icc -O2 -static aesni ref
icc -O2 -static -no-vec aesni ref
icc -O3 -static aesni ref
icc -O3 -static -no-vec aesni ref
icc -Os -static aesni ref
icc -Os -static -no-vec aesni ref
icc -m64 -O1 -static aesni ref
icc -m64 -O1 -static -no-vec aesni ref
icc -m64 -O2 -static aesni ref
icc -m64 -O2 -static -no-vec aesni ref
icc -m64 -O3 -static aesni ref
icc -m64 -O3 -static -no-vec aesni ref
icc -m64 -Os -static aesni ref
icc -m64 -Os -static -no-vec aesni ref

Compiler output

Implementation: crypto_aead/aegis256/ref
Compiler: icc -O1 -xB -static
aes.c: icc: command line warning #10131: extension 'B' not supported ignored in option '-x'
encrypt.c: icc: command line warning #10131: extension 'B' not supported ignored in option '-x'
try.c: icc: command line warning #10131: extension 'B' not supported ignored in option '-x'
try.c: ld: cannot find -lcrypto

Number of similar (compiler,implementation) pairs: 8, namely:
CompilerImplementations
icc -O1 -xB -static ref
icc -O1 -xB -static -no-vec ref
icc -O2 -xB -static ref
icc -O2 -xB -static -no-vec ref
icc -O3 -xB -static ref
icc -O3 -xB -static -no-vec ref
icc -Os -xB -static ref
icc -Os -xB -static -no-vec ref

Compiler output

Implementation: crypto_aead/aegis256/aesni
Compiler: icc -O1 -xB -static
encrypt.c: icc: command line warning #10131: extension 'B' not supported ignored in option '-x'
try.c: icc: command line warning #10131: extension 'B' not supported ignored in option '-x'
try.c: ld: cannot find -lcrypto

Number of similar (compiler,implementation) pairs: 8, namely:
CompilerImplementations
icc -O1 -xB -static aesni
icc -O1 -xB -static -no-vec aesni
icc -O2 -xB -static aesni
icc -O2 -xB -static -no-vec aesni
icc -O3 -xB -static aesni
icc -O3 -xB -static -no-vec aesni
icc -Os -xB -static aesni
icc -Os -xB -static -no-vec aesni

Compiler output

Implementation: crypto_aead/aegis256/ref
Compiler: icc -O1 -xK -static
aes.c: icc: command line warning #10131: extension 'K' not supported ignored in option '-x'
encrypt.c: icc: command line warning #10131: extension 'K' not supported ignored in option '-x'
try.c: icc: command line warning #10131: extension 'K' not supported ignored in option '-x'
try.c: ld: cannot find -lcrypto

Number of similar (compiler,implementation) pairs: 8, namely:
CompilerImplementations
icc -O1 -xK -static ref
icc -O1 -xK -static -no-vec ref
icc -O2 -xK -static ref
icc -O2 -xK -static -no-vec ref
icc -O3 -xK -static ref
icc -O3 -xK -static -no-vec ref
icc -Os -xK -static ref
icc -Os -xK -static -no-vec ref

Compiler output

Implementation: crypto_aead/aegis256/aesni
Compiler: icc -O1 -xK -static
encrypt.c: icc: command line warning #10131: extension 'K' not supported ignored in option '-x'
try.c: icc: command line warning #10131: extension 'K' not supported ignored in option '-x'
try.c: ld: cannot find -lcrypto

Number of similar (compiler,implementation) pairs: 8, namely:
CompilerImplementations
icc -O1 -xK -static aesni
icc -O1 -xK -static -no-vec aesni
icc -O2 -xK -static aesni
icc -O2 -xK -static -no-vec aesni
icc -O3 -xK -static aesni
icc -O3 -xK -static -no-vec aesni
icc -Os -xK -static aesni
icc -Os -xK -static -no-vec aesni

Compiler output

Implementation: crypto_aead/aegis256/ref
Compiler: icc -O1 -xN -static
aes.c: icc: command line warning #10131: extension 'N' not supported ignored in option '-x'
encrypt.c: icc: command line warning #10131: extension 'N' not supported ignored in option '-x'
try.c: icc: command line warning #10131: extension 'N' not supported ignored in option '-x'
try.c: ld: cannot find -lcrypto

Number of similar (compiler,implementation) pairs: 8, namely:
CompilerImplementations
icc -O1 -xN -static ref
icc -O1 -xN -static -no-vec ref
icc -O2 -xN -static ref
icc -O2 -xN -static -no-vec ref
icc -O3 -xN -static ref
icc -O3 -xN -static -no-vec ref
icc -Os -xN -static ref
icc -Os -xN -static -no-vec ref

Compiler output

Implementation: crypto_aead/aegis256/aesni
Compiler: icc -O1 -xN -static
encrypt.c: icc: command line warning #10131: extension 'N' not supported ignored in option '-x'
try.c: icc: command line warning #10131: extension 'N' not supported ignored in option '-x'
try.c: ld: cannot find -lcrypto

Number of similar (compiler,implementation) pairs: 8, namely:
CompilerImplementations
icc -O1 -xN -static aesni
icc -O1 -xN -static -no-vec aesni
icc -O2 -xN -static aesni
icc -O2 -xN -static -no-vec aesni
icc -O3 -xN -static aesni
icc -O3 -xN -static -no-vec aesni
icc -Os -xN -static aesni
icc -Os -xN -static -no-vec aesni

Compiler output

Implementation: crypto_aead/aegis256/ref
Compiler: icc -O1 -xW -static
aes.c: icc: command line warning #10131: extension 'W' not supported ignored in option '-x'
encrypt.c: icc: command line warning #10131: extension 'W' not supported ignored in option '-x'
try.c: icc: command line warning #10131: extension 'W' not supported ignored in option '-x'
try.c: ld: cannot find -lcrypto

Number of similar (compiler,implementation) pairs: 8, namely:
CompilerImplementations
icc -O1 -xW -static ref
icc -O1 -xW -static -no-vec ref
icc -O2 -xW -static ref
icc -O2 -xW -static -no-vec ref
icc -O3 -xW -static ref
icc -O3 -xW -static -no-vec ref
icc -Os -xW -static ref
icc -Os -xW -static -no-vec ref

Compiler output

Implementation: crypto_aead/aegis256/aesni
Compiler: icc -O1 -xW -static
encrypt.c: icc: command line warning #10131: extension 'W' not supported ignored in option '-x'
try.c: icc: command line warning #10131: extension 'W' not supported ignored in option '-x'
try.c: ld: cannot find -lcrypto

Number of similar (compiler,implementation) pairs: 8, namely:
CompilerImplementations
icc -O1 -xW -static aesni
icc -O1 -xW -static -no-vec aesni
icc -O2 -xW -static aesni
icc -O2 -xW -static -no-vec aesni
icc -O3 -xW -static aesni
icc -O3 -xW -static -no-vec aesni
icc -Os -xW -static aesni
icc -Os -xW -static -no-vec aesni

Compiler output

Implementation: crypto_aead/aegis256/aesni
Compiler: icc -fast
try.c: ipo: warning #11003: no IR in object file /root/supercop-20170904/supercop-data/ryzen/amd64/lib/kernelrandombytes.o; was the source file compiled with -ipo
try.c: ipo: warning #11003: no IR in object file /root/supercop-20170904/supercop-data/ryzen/amd64/lib/cpucycles.o; was the source file compiled with -ipo
try.c: ld: cannot find -lcrypto

Number of similar (compiler,implementation) pairs: 2, namely:
CompilerImplementations
icc -fast aesni ref

Compiler output

Implementation: crypto_aead/aegis256/ref
Compiler: icc -m64 -xHost -vec-report0 -static
aes.c: icc: command line remark #10148: option '-vec-report0' not supported
encrypt.c: icc: command line remark #10148: option '-vec-report0' not supported
try.c: icc: command line remark #10148: option '-vec-report0' not supported
try.c: ld: cannot find -lcrypto

Number of similar (compiler,implementation) pairs: 1, namely:
CompilerImplementations
icc -m64 -xHost -vec-report0 -static ref

Compiler output

Implementation: crypto_aead/aegis256/aesni
Compiler: icc -m64 -xHost -vec-report0 -static
encrypt.c: icc: command line remark #10148: option '-vec-report0' not supported
try.c: icc: command line remark #10148: option '-vec-report0' not supported
try.c: ld: cannot find -lcrypto

Number of similar (compiler,implementation) pairs: 1, namely:
CompilerImplementations
icc -m64 -xHost -vec-report0 -static aesni