Implementation notes: amd64, rumba7, crypto_kem/titaniumccasuper

Computer: rumba7
Architecture: amd64
CPU ID: AuthenticAMD-00800f11-178bfbff
SUPERCOP version: 20210604
Operation: crypto_kem
Primitive: titaniumccasuper
TimeObject sizeTest sizeImplementationCompilerBenchmark dateSUPERCOP version
6480300154871 0 0313598 828 1752T:avx2clang_-march=native_-O_-fomit-frame-pointer_-fwrapv_-Qunused-arguments_-fPIC_-fPIE2021012920210114
6481952154871 0 0313598 828 1752T:avx2clang_-march=native_-O2_-fomit-frame-pointer_-fwrapv_-Qunused-arguments_-fPIC_-fPIE2021012920210114
6534327156353 0 0315158 828 1752T:avx2clang_-march=native_-O3_-fomit-frame-pointer_-fwrapv_-Qunused-arguments_-fPIC_-fPIE2021012920210114
6674226145292 0 0301372 820 1752T:avx2clang_-march=native_-Os_-fomit-frame-pointer_-fwrapv_-Qunused-arguments_-fPIC_-fPIE2021012920210114
6724461170523 0 0330439 828 1800T:avx2gcc_-march=native_-mtune=native_-O3_-fomit-frame-pointer_-fwrapv_-fPIC_-fPIE2021012920210114
6746914148114 0 0305623 828 1800T:avx2gcc_-march=native_-mtune=native_-O_-fomit-frame-pointer_-fwrapv_-fPIC_-fPIE2021012920210114
6759854148768 0 0306687 828 1800T:avx2gcc_-march=native_-mtune=native_-O2_-fomit-frame-pointer_-fwrapv_-fPIC_-fPIE2021012920210114
8534846116061 0 0275967 828 1800T:optgcc_-march=native_-mtune=native_-O3_-fomit-frame-pointer_-fwrapv_-fPIC_-fPIE2021012920210114
8553948115373 0 0274150 828 1752T:optclang_-march=native_-O_-fomit-frame-pointer_-fwrapv_-Qunused-arguments_-fPIC_-fPIE2021012920210114
8672591123884 0 0282750 828 1752T:optclang_-march=native_-O3_-fomit-frame-pointer_-fwrapv_-Qunused-arguments_-fPIC_-fPIE2021012920210114
8688998115373 0 0274150 828 1752T:optclang_-march=native_-O2_-fomit-frame-pointer_-fwrapv_-Qunused-arguments_-fPIC_-fPIE2021012920210114
8692260102853 0 0262198 828 1752T:optclang_-mcpu=native_-O3_-fomit-frame-pointer_-fwrapv_-Qunused-arguments_-fPIC_-fPIE2021012920210114
892409285049 0 0241276 820 1752T:optclang_-march=native_-Os_-fomit-frame-pointer_-fwrapv_-Qunused-arguments_-fPIC_-fPIE2021012920210114
900376682346 0 0240415 828 1800T:optgcc_-march=native_-mtune=native_-O2_-fomit-frame-pointer_-fwrapv_-fPIC_-fPIE2021012920210114
945179082095 0 0239807 828 1800T:optgcc_-march=native_-mtune=native_-O_-fomit-frame-pointer_-fwrapv_-fPIC_-fPIE2021012920210114
112054059578248 0 0237526 828 1752T:refclang_-mcpu=native_-O3_-fomit-frame-pointer_-fwrapv_-Qunused-arguments_-fPIC_-fPIE2021012920210114
112878358468471 0 0228375 828 1800T:refgcc_-march=native_-mtune=native_-O3_-fomit-frame-pointer_-fwrapv_-fPIC_-fPIE2021012920210114
113309083356927 0 0213012 820 1752T:refclang_-march=native_-Os_-fomit-frame-pointer_-fwrapv_-Qunused-arguments_-fPIC_-fPIE2021012920210114
113405869455691 0 0213623 828 1800T:refgcc_-march=native_-mtune=native_-O2_-fomit-frame-pointer_-fwrapv_-fPIC_-fPIE2021012920210114
122070299890502 0 0249646 828 1752T:refclang_-march=native_-O3_-fomit-frame-pointer_-fwrapv_-Qunused-arguments_-fPIC_-fPIE2021012920210114
122106805765724 0 0224718 828 1752T:refclang_-march=native_-O2_-fomit-frame-pointer_-fwrapv_-Qunused-arguments_-fPIC_-fPIE2021012920210114
122111019365724 0 0224718 828 1752T:refclang_-march=native_-O_-fomit-frame-pointer_-fwrapv_-Qunused-arguments_-fPIC_-fPIE2021012920210114
146034875655715 0 0213239 828 1800T:refgcc_-march=native_-mtune=native_-O_-fomit-frame-pointer_-fwrapv_-fPIC_-fPIE2021012920210114

Compiler output

Implementation: T:avx2
Security model: timingleaks
Compiler: clang -mcpu=native -O3 -fomit-frame-pointer -fwrapv -Qunused-arguments -fPIC -fPIE
encrypt.c: encrypt.c:63:8: error: always_inline function '_mm256_loadu_si256' requires target feature 'sse4.2', but would be inlined into function 'crypto_encrypt_keypair' that is compiled without support for 'sse4.2'
encrypt.c: u = _mm256_loadu_si256((__m256i *)(a[i] + j));
encrypt.c: ^
encrypt.c: encrypt.c:64:8: error: always_inline function '_mm256_loadu_si256' requires target feature 'sse4.2', but would be inlined into function 'crypto_encrypt_keypair' that is compiled without support for 'sse4.2'
encrypt.c: v = _mm256_loadu_si256((__m256i *)(s + j));
encrypt.c: ^
encrypt.c: encrypt.c:65:8: error: always_inline function '_mm256_mul_epu32' requires target feature 'avx2', but would be inlined into function 'crypto_encrypt_keypair' that is compiled without support for 'avx2'
encrypt.c: t = _mm256_mul_epu32(u, v);
encrypt.c: ^
encrypt.c: encrypt.c:66:4: error: always_inline function '_mm256_storeu_si256' requires target feature 'sse4.2', but would be inlined into function 'crypto_encrypt_keypair' that is compiled without support for 'sse4.2'
encrypt.c: _mm256_storeu_si256((__m256i *)(a[i] + j), t);
encrypt.c: ^
encrypt.c: encrypt.c:78:8: error: always_inline function '_mm256_loadu_si256' requires target feature 'sse4.2', but would be inlined into function 'crypto_encrypt_keypair' that is compiled without support for 'sse4.2'
encrypt.c: u = _mm256_loadu_si256((__m256i *)(a[i] + j));
encrypt.c: ^
encrypt.c: encrypt.c:79:8: error: always_inline function '_mm256_loadu_si256' requires target feature 'sse4.2', but would be inlined into function 'crypto_encrypt_keypair' that is compiled without support for 'sse4.2'
encrypt.c: v = _mm256_loadu_si256((__m256i *)(e[i] + j));
encrypt.c: ^
encrypt.c: encrypt.c:80:8: error: always_inline function '_mm256_add_epi64' requires target feature 'avx2', but would be inlined into function 'crypto_encrypt_keypair' that is compiled without support for 'avx2'
encrypt.c: t = _mm256_add_epi64(u, v);
encrypt.c: ^
encrypt.c: encrypt.c:81:9: error: always_inline function '_mm256_mul_epu32' requires target feature 'avx2', but would be inlined into function 'crypto_encrypt_keypair' that is compiled without support for 'avx2'
encrypt.c: t1 = _mm256_mul_epu32(t, V_B4Q_B4Q_B4Q_B4Q);
encrypt.c: ^
encrypt.c: encrypt.c:82:9: error: always_inline function '_mm256_srli_epi64' requires target feature 'avx2', but would be inlined into function 'crypto_encrypt_keypair' that is compiled without support for 'avx2'
encrypt.c: ...

Number of similar (compiler,implementation) pairs: 1, namely:
CompilerImplementations
clang -mcpu=native -O3 -fomit-frame-pointer -fwrapv -Qunused-arguments -fPIC -fPIE T:avx2

Compiler output

Implementation: T:avx2
Security model: timingleaks
Compiler: gcc -march=native -mtune=native -Os -fomit-frame-pointer -fwrapv -fPIC -fPIE
try.c: crypto_kem_titaniumccasuper.a(sampler.o): In function `sampler_zq':
try.c: sampler.c:(.text+0x...): undefined reference to `load_24'
try.c: sampler.c:(.text+0x...): undefined reference to `barrett_zq'
try.c: collect2: error: ld returned 1 exit status

Number of similar (compiler,implementation) pairs: 1, namely:
CompilerImplementations
gcc -march=native -mtune=native -Os -fomit-frame-pointer -fwrapv -fPIC -fPIE T:avx2

Compiler output

Implementation: T:opt
Security model: timingleaks
Compiler: gcc -march=native -mtune=native -Os -fomit-frame-pointer -fwrapv -fPIC -fPIE
try.c: crypto_kem_titaniumccasuper.a(encrypt.o): In function `crypto_encrypt_keypair':
try.c: encrypt.c:(.text+0x...): undefined reference to `barrett_4q'
try.c: crypto_kem_titaniumccasuper.a(fastrandombytes.o): In function `fastrandombytes':
try.c: fastrandombytes.c:(.text+0x...): undefined reference to `load_32'
try.c: fastrandombytes.c:(.text+0x...): undefined reference to `store_32'
try.c: crypto_kem_titaniumccasuper.a(ntt.o): In function `ntt_2':
try.c: ntt.c:(.text+0x...): undefined reference to `barrett_4q'
try.c: ntt.c:(.text+0x...): undefined reference to `barrett_4q'
try.c: ntt.c:(.text+0x...): undefined reference to `barrett_4q'
try.c: ntt.c:(.text+0x...): undefined reference to `montgomery'
try.c: ntt.c:(.text+0x...): undefined reference to `barrett_4q'
try.c: ntt.c:(.text+0x...): undefined reference to `barrett_4q'
try.c: ntt.c:(.text+0x...): undefined reference to `barrett_4q'
try.c: ntt.c:(.text+0x...): undefined reference to `montgomery'
try.c: ntt.c:(.text+0x...): undefined reference to `barrett_4q'
try.c: ntt.c:(.text+0x...): undefined reference to `barrett_4q'
try.c: crypto_kem_titaniumccasuper.a(ntt.o): In function `ntt_core':
try.c: ntt.c:(.text+0x...): undefined reference to `montgomery'
try.c: crypto_kem_titaniumccasuper.a(ntt.o): In function `intt_core':
try.c: ntt.c:(.text+0x...): undefined reference to `montgomery'
try.c: ntt.c:(.text+0x...): undefined reference to `montgomery'
try.c: crypto_kem_titaniumccasuper.a(ntt.o): In function `ntt_butterfly_2048_3328':
try.c: ntt.c:(.text+0x...): undefined reference to `barrett_16q'
try.c: crypto_kem_titaniumccasuper.a(ntt.o): In function `ntt_butterfly_3328_1280':
try.c: ntt.c:(.text+0x...): undefined reference to `barrett_32q'
try.c: ...

Number of similar (compiler,implementation) pairs: 1, namely:
CompilerImplementations
gcc -march=native -mtune=native -Os -fomit-frame-pointer -fwrapv -fPIC -fPIE T:opt

Compiler output

Implementation: T:ref
Security model: timingleaks
Compiler: gcc -march=native -mtune=native -Os -fomit-frame-pointer -fwrapv -fPIC -fPIE
try.c: crypto_kem_titaniumccasuper.a(fastrandombytes.o): In function `fastrandombytes':
try.c: fastrandombytes.c:(.text+0x...): undefined reference to `load_32'
try.c: fastrandombytes.c:(.text+0x...): undefined reference to `store_32'
try.c: crypto_kem_titaniumccasuper.a(sampler.o): In function `sampler_zq':
try.c: sampler.c:(.text+0x...): undefined reference to `load_24'
try.c: collect2: error: ld returned 1 exit status

Number of similar (compiler,implementation) pairs: 1, namely:
CompilerImplementations
gcc -march=native -mtune=native -Os -fomit-frame-pointer -fwrapv -fPIC -fPIE T:ref

Namespace violations

Implementation: T:avx2
Security model: timingleaks
Compiler: clang -march=native -O2 -fomit-frame-pointer -fwrapv -Qunused-arguments -fPIC -fPIE
encrypt.o crypto_encrypt T
encrypt.o crypto_encrypt_keypair T
encrypt.o crypto_encrypt_open T
fastrandombytes.o fastrandombytes T
fastrandombytes.o fastrandombytes_setseed T
fastrandombytes.o iv C
fastrandombytes.o key C
ntt.o intt_1280_256 T
ntt.o intt_3072_3072_inv T
ntt.o intt_3328_1280 T
ntt.o intt_3328_256 T
ntt.o ntt_1024_1280 T
ntt.o ntt_1024_3072 T
ntt.o ntt_1280_1280_inv T
ntt.o ntt_2048_3072 T
ntt.o ntt_2048_3328 T
ntt.o ntt_3072_3328 T
pack.o poly_decode T
pack.o poly_decode_c2 T
pack.o poly_encode T
pack.o poly_encode_c2 T
sampler.o sampler_binomial T
sampler.o sampler_zb T
sampler.o sampler_zq T

Number of similar (compiler,implementation) pairs: 15, namely:
CompilerImplementations
clang -march=native -O2 -fomit-frame-pointer -fwrapv -Qunused-arguments -fPIC -fPIE T:avx2
clang -march=native -O3 -fomit-frame-pointer -fwrapv -Qunused-arguments -fPIC -fPIE T:avx2
clang -march=native -O -fomit-frame-pointer -fwrapv -Qunused-arguments -fPIC -fPIE T:avx2
clang -march=native -Os -fomit-frame-pointer -fwrapv -Qunused-arguments -fPIC -fPIE T:avx2
gcc -march=native -mtune=native -O2 -fomit-frame-pointer -fwrapv -fPIC -fPIE T:avx2
gcc -march=native -mtune=native -O3 -fomit-frame-pointer -fwrapv -fPIC -fPIE T:avx2
gcc -march=native -mtune=native -O -fomit-frame-pointer -fwrapv -fPIC -fPIE T:avx2
clang -march=native -O2 -fomit-frame-pointer -fwrapv -Qunused-arguments -fPIC -fPIE T:opt
clang -march=native -O3 -fomit-frame-pointer -fwrapv -Qunused-arguments -fPIC -fPIE T:opt
clang -march=native -O -fomit-frame-pointer -fwrapv -Qunused-arguments -fPIC -fPIE T:opt
clang -march=native -Os -fomit-frame-pointer -fwrapv -Qunused-arguments -fPIC -fPIE T:opt
clang -mcpu=native -O3 -fomit-frame-pointer -fwrapv -Qunused-arguments -fPIC -fPIE T:opt
gcc -march=native -mtune=native -O2 -fomit-frame-pointer -fwrapv -fPIC -fPIE T:opt
gcc -march=native -mtune=native -O3 -fomit-frame-pointer -fwrapv -fPIC -fPIE T:opt
gcc -march=native -mtune=native -O -fomit-frame-pointer -fwrapv -fPIC -fPIE T:opt

Namespace violations

Implementation: T:ref
Security model: timingleaks
Compiler: clang -march=native -O2 -fomit-frame-pointer -fwrapv -Qunused-arguments -fPIC -fPIE
encrypt.o crypto_encrypt T
encrypt.o crypto_encrypt_keypair T
encrypt.o crypto_encrypt_open T
fastrandombytes.o fastrandombytes T
fastrandombytes.o fastrandombytes_setseed T
fastrandombytes.o iv C
fastrandombytes.o key C
ntt.o intt_1280_1280 T
ntt.o intt_3072_3072_inv T
ntt.o intt_3328_3328 T
ntt.o ntt_1280_1280_inv T
ntt.o ntt_3072_3072 T
pack.o poly_decode T
pack.o poly_decode_c2 T
pack.o poly_encode T
pack.o poly_encode_c2 T
product.o mp T
product.o product T
sampler.o sampler_binomial T
sampler.o sampler_zb T
sampler.o sampler_zq T

Number of similar (compiler,implementation) pairs: 8, namely:
CompilerImplementations
clang -march=native -O2 -fomit-frame-pointer -fwrapv -Qunused-arguments -fPIC -fPIE T:ref
clang -march=native -O3 -fomit-frame-pointer -fwrapv -Qunused-arguments -fPIC -fPIE T:ref
clang -march=native -O -fomit-frame-pointer -fwrapv -Qunused-arguments -fPIC -fPIE T:ref
clang -march=native -Os -fomit-frame-pointer -fwrapv -Qunused-arguments -fPIC -fPIE T:ref
clang -mcpu=native -O3 -fomit-frame-pointer -fwrapv -Qunused-arguments -fPIC -fPIE T:ref
gcc -march=native -mtune=native -O2 -fomit-frame-pointer -fwrapv -fPIC -fPIE T:ref
gcc -march=native -mtune=native -O3 -fomit-frame-pointer -fwrapv -fPIC -fPIE T:ref
gcc -march=native -mtune=native -O -fomit-frame-pointer -fwrapv -fPIC -fPIE T:ref