Implementation notes: amd64, rumba7, crypto_hash/echo256

Computer: rumba7
Architecture: amd64
CPU ID: AuthenticAMD-00800f11-178bfbff
SUPERCOP version: 20211108
Operation: crypto_hash
Primitive: echo256
TimeObject sizeTest sizeImplementationCompilerBenchmark dateSUPERCOP version
593610657 0 024217 804 952T:ccalik/aesnigcc_-march=native_-mtune=native_-O3_-fomit-frame-pointer_-fwrapv_-fPIC_-fPIE2021011420210114
61046956 0 018329 804 952T:ccalik/aesnigcc_-march=native_-mtune=native_-O2_-fomit-frame-pointer_-fwrapv_-fPIC_-fPIE2021011420210114
61866398 0 017553 804 952T:ccalik/aesnigcc_-march=native_-mtune=native_-O_-fomit-frame-pointer_-fwrapv_-fPIC_-fPIE2021011420210114
64527351 0 020172 804 920T:ccalik/aesniclang_-march=native_-O2_-fomit-frame-pointer_-fwrapv_-Qunused-arguments_-fPIC_-fPIE2021011420210114
64627351 0 020172 804 920T:ccalik/aesniclang_-march=native_-O_-fomit-frame-pointer_-fwrapv_-Qunused-arguments_-fPIC_-fPIE2021011420210114
64736036 0 015938 796 888T:ccalik/aesniclang_-march=native_-Os_-fomit-frame-pointer_-fwrapv_-Qunused-arguments_-fPIC_-fPIE2021011420210114
68767367 0 020220 804 920T:ccalik/aesniclang_-march=native_-O3_-fomit-frame-pointer_-fwrapv_-Qunused-arguments_-fPIC_-fPIE2021011420210114
72676507 0 016740 780 920T:ccalik/aesnigcc_-march=native_-mtune=native_-Os_-fomit-frame-pointer_-fwrapv_-fPIC_-fPIE2021011420210114
4317524299 0 037132 804 920T:ccalik/vpermclang_-march=native_-O2_-fomit-frame-pointer_-fwrapv_-Qunused-arguments_-fPIC_-fPIE2021011420210114
4390932371 0 046025 804 952T:sphlibgcc_-march=native_-mtune=native_-O3_-fomit-frame-pointer_-fwrapv_-fPIC_-fPIE2021011420210114
4397222275 0 032170 796 888T:ccalik/vpermclang_-march=native_-Os_-fomit-frame-pointer_-fwrapv_-Qunused-arguments_-fPIC_-fPIE2021011420210114
4444124299 0 037132 804 920T:ccalik/vpermclang_-march=native_-O_-fomit-frame-pointer_-fwrapv_-Qunused-arguments_-fPIC_-fPIE2021011420210114
4447129160 0 040665 804 952T:sphlibgcc_-march=native_-mtune=native_-O2_-fomit-frame-pointer_-fwrapv_-fPIC_-fPIE2021011420210114
4508227496 0 037852 780 920T:sphlibgcc_-march=native_-mtune=native_-Os_-fomit-frame-pointer_-fwrapv_-fPIC_-fPIE2021011420210114
4520024987 0 037852 804 920T:ccalik/vpermclang_-march=native_-O3_-fomit-frame-pointer_-fwrapv_-Qunused-arguments_-fPIC_-fPIE2021011420210114
4521026692 0 040281 804 960T:generic/opt64gcc_-march=native_-mtune=native_-O3_-fomit-frame-pointer_-fwrapv_-fPIC_-fPIE2021011420210114
4527228860 0 040153 804 952T:sphlibgcc_-march=native_-mtune=native_-O_-fomit-frame-pointer_-fwrapv_-fPIC_-fPIE2021011420210114
4573517467 0 031129 804 952T:sphlib-smallgcc_-march=native_-mtune=native_-O3_-fomit-frame-pointer_-fwrapv_-fPIC_-fPIE2021011420210114
4574521196 0 032617 804 960T:generic/opt64gcc_-march=native_-mtune=native_-O2_-fomit-frame-pointer_-fwrapv_-fPIC_-fPIE2021011420210114
4663720745 0 031937 804 960T:generic/opt64gcc_-march=native_-mtune=native_-O_-fomit-frame-pointer_-fwrapv_-fPIC_-fPIE2021011420210114
4707329440 0 042604 804 888T:sphlibclang_-mcpu=native_-O3_-fomit-frame-pointer_-fwrapv_-Qunused-arguments_-fPIC_-fPIE2021011420210114
4744220642 0 030908 780 928T:generic/opt64gcc_-march=native_-mtune=native_-Os_-fomit-frame-pointer_-fwrapv_-fPIC_-fPIE2021011420210114
4773119530 0 029764 780 920T:ccalik/vpermgcc_-march=native_-mtune=native_-Os_-fomit-frame-pointer_-fwrapv_-fPIC_-fPIE2021011420210114
4780626353 0 039913 804 952T:ccalik/vpermgcc_-march=native_-mtune=native_-O3_-fomit-frame-pointer_-fwrapv_-fPIC_-fPIE2021011420210114
4800421500 0 032873 804 952T:ccalik/vpermgcc_-march=native_-mtune=native_-O2_-fomit-frame-pointer_-fwrapv_-fPIC_-fPIE2021011420210114
4810930670 0 043548 804 920T:sphlibclang_-march=native_-O2_-fomit-frame-pointer_-fwrapv_-Qunused-arguments_-fPIC_-fPIE2021011420210114
4814730670 0 043548 804 920T:sphlibclang_-march=native_-O_-fomit-frame-pointer_-fwrapv_-Qunused-arguments_-fPIC_-fPIE2021011420210114
4863120989 0 032145 804 952T:ccalik/vpermgcc_-march=native_-mtune=native_-O_-fomit-frame-pointer_-fwrapv_-fPIC_-fPIE2021011420210114
4948829997 0 042924 804 920T:sphlibclang_-march=native_-O3_-fomit-frame-pointer_-fwrapv_-Qunused-arguments_-fPIC_-fPIE2021011420210114
4996229653 0 039634 796 888T:sphlibclang_-march=native_-Os_-fomit-frame-pointer_-fwrapv_-Qunused-arguments_-fPIC_-fPIE2021011420210114
4997813631 0 026820 804 888T:sphlib-smallclang_-mcpu=native_-O3_-fomit-frame-pointer_-fwrapv_-Qunused-arguments_-fPIC_-fPIE2021011420210114
5086810768 0 022289 804 952T:sphlib-smallgcc_-march=native_-mtune=native_-O2_-fomit-frame-pointer_-fwrapv_-fPIC_-fPIE2021011420210114
5162510606 0 021905 804 952T:sphlib-smallgcc_-march=native_-mtune=native_-O_-fomit-frame-pointer_-fwrapv_-fPIC_-fPIE2021011420210114
5172123828 0 037480 812 968T:generic/opt32gcc_-march=native_-mtune=native_-O3_-fomit-frame-pointer_-fwrapv_-fPIC_-fPIE2021011420210114
5175816267 0 029100 804 920T:ccalik/bitslicedclang_-march=native_-O_-fomit-frame-pointer_-fwrapv_-Qunused-arguments_-fPIC_-fPIE2021011420210114
5176916267 0 029100 804 920T:ccalik/bitslicedclang_-march=native_-O2_-fomit-frame-pointer_-fwrapv_-Qunused-arguments_-fPIC_-fPIE2021011420210114
5216216299 0 029164 804 920T:ccalik/bitslicedclang_-march=native_-O3_-fomit-frame-pointer_-fwrapv_-Qunused-arguments_-fPIC_-fPIE2021011420210114
5274912403 0 025348 804 920T:sphlib-smallclang_-march=native_-O_-fomit-frame-pointer_-fwrapv_-Qunused-arguments_-fPIC_-fPIE2021011420210114
5299912403 0 025348 804 920T:sphlib-smallclang_-march=native_-O2_-fomit-frame-pointer_-fwrapv_-Qunused-arguments_-fPIC_-fPIE2021011420210114
5305012688 0 025668 804 920T:sphlib-smallclang_-march=native_-O3_-fomit-frame-pointer_-fwrapv_-Qunused-arguments_-fPIC_-fPIE2021011420210114
5329215137 0 025034 796 888T:ccalik/bitslicedclang_-march=native_-Os_-fomit-frame-pointer_-fwrapv_-Qunused-arguments_-fPIC_-fPIE2021011420210114
5360119668 0 031168 812 968T:generic/opt32gcc_-march=native_-mtune=native_-O2_-fomit-frame-pointer_-fwrapv_-fPIC_-fPIE2021011420210114
5460619016 0 030288 812 968T:generic/opt32gcc_-march=native_-mtune=native_-O_-fomit-frame-pointer_-fwrapv_-fPIC_-fPIE2021011420210114
5489518585 0 028923 788 936T:generic/opt32gcc_-march=native_-mtune=native_-Os_-fomit-frame-pointer_-fwrapv_-fPIC_-fPIE2021011420210114
5784316108 0 027481 804 952T:ccalik/bitslicedgcc_-march=native_-mtune=native_-O2_-fomit-frame-pointer_-fwrapv_-fPIC_-fPIE2021011420210114
5787719329 0 032889 804 952T:ccalik/bitslicedgcc_-march=native_-mtune=native_-O3_-fomit-frame-pointer_-fwrapv_-fPIC_-fPIE2021011420210114
5847615965 0 027121 804 952T:ccalik/bitslicedgcc_-march=native_-mtune=native_-O_-fomit-frame-pointer_-fwrapv_-fPIC_-fPIE2021011420210114
585949022 0 019042 796 888T:sphlib-smallclang_-march=native_-Os_-fomit-frame-pointer_-fwrapv_-Qunused-arguments_-fPIC_-fPIE2021011420210114
6114322681 0 035796 804 904T:generic/opt32clang_-mcpu=native_-O3_-fomit-frame-pointer_-fwrapv_-Qunused-arguments_-fPIC_-fPIE2021011420210114
6226820356 0 033204 804 936T:generic/opt32clang_-march=native_-O2_-fomit-frame-pointer_-fwrapv_-Qunused-arguments_-fPIC_-fPIE2021011420210114
6226920356 0 033204 804 936T:generic/opt32clang_-march=native_-O_-fomit-frame-pointer_-fwrapv_-Qunused-arguments_-fPIC_-fPIE2021011420210114
6234820441 0 033332 804 936T:generic/opt32clang_-march=native_-O3_-fomit-frame-pointer_-fwrapv_-Qunused-arguments_-fPIC_-fPIE2021011420210114
6244427021 0 036666 796 896T:generic/opt64clang_-march=native_-Os_-fomit-frame-pointer_-fwrapv_-Qunused-arguments_-fPIC_-fPIE2021011420210114
6248820381 0 029970 796 904T:generic/opt32clang_-march=native_-Os_-fomit-frame-pointer_-fwrapv_-Qunused-arguments_-fPIC_-fPIE2021011420210114
6347516168 0 026388 780 920T:ccalik/bitslicedgcc_-march=native_-mtune=native_-Os_-fomit-frame-pointer_-fwrapv_-fPIC_-fPIE2021011420210114
6403330731 0 043828 804 896T:generic/opt64clang_-mcpu=native_-O3_-fomit-frame-pointer_-fwrapv_-Qunused-arguments_-fPIC_-fPIE2021011420210114
6641925406 0 038252 804 928T:generic/opt64clang_-march=native_-O_-fomit-frame-pointer_-fwrapv_-Qunused-arguments_-fPIC_-fPIE2021011420210114
6647725406 0 038252 804 928T:generic/opt64clang_-march=native_-O2_-fomit-frame-pointer_-fwrapv_-Qunused-arguments_-fPIC_-fPIE2021011420210114
6653625203 0 038076 804 928T:generic/opt64clang_-march=native_-O3_-fomit-frame-pointer_-fwrapv_-Qunused-arguments_-fPIC_-fPIE2021011420210114
6728029801 0 042916 804 904T:powerpc/pp32cv2clang_-mcpu=native_-O3_-fomit-frame-pointer_-fwrapv_-Qunused-arguments_-fPIC_-fPIE2021011420210114
6872426889 0 039780 804 936T:powerpc/pp32cv2clang_-march=native_-O3_-fomit-frame-pointer_-fwrapv_-Qunused-arguments_-fPIC_-fPIE2021011420210114
6884126836 0 039684 804 936T:powerpc/pp32cv2clang_-march=native_-O_-fomit-frame-pointer_-fwrapv_-Qunused-arguments_-fPIC_-fPIE2021011420210114
6903026836 0 039684 804 936T:powerpc/pp32cv2clang_-march=native_-O2_-fomit-frame-pointer_-fwrapv_-Qunused-arguments_-fPIC_-fPIE2021011420210114
7643127002 0 036578 796 904T:powerpc/pp32cv2clang_-march=native_-Os_-fomit-frame-pointer_-fwrapv_-Qunused-arguments_-fPIC_-fPIE2021011420210114
7975025775 0 036123 788 936T:powerpc/pp32cv2gcc_-march=native_-mtune=native_-Os_-fomit-frame-pointer_-fwrapv_-fPIC_-fPIE2021011420210114
8034721977 0 035092 804 904T:powerpc/pp32cv1clang_-mcpu=native_-O3_-fomit-frame-pointer_-fwrapv_-Qunused-arguments_-fPIC_-fPIE2021011420210114
8040133268 0 046920 812 968T:powerpc/pp32cv2gcc_-march=native_-mtune=native_-O3_-fomit-frame-pointer_-fwrapv_-fPIC_-fPIE2021011420210114
8335329092 0 040592 812 968T:powerpc/pp32cv2gcc_-march=native_-mtune=native_-O2_-fomit-frame-pointer_-fwrapv_-fPIC_-fPIE2021011420210114
8641227912 0 039184 812 968T:powerpc/pp32cv2gcc_-march=native_-mtune=native_-O_-fomit-frame-pointer_-fwrapv_-fPIC_-fPIE2021011420210114
8715019193 0 032084 804 936T:powerpc/pp32cv1clang_-march=native_-O3_-fomit-frame-pointer_-fwrapv_-Qunused-arguments_-fPIC_-fPIE2021011420210114
8715419140 0 031988 804 936T:powerpc/pp32cv1clang_-march=native_-O_-fomit-frame-pointer_-fwrapv_-Qunused-arguments_-fPIC_-fPIE2021011420210114
8722719140 0 031988 804 936T:powerpc/pp32cv1clang_-march=native_-O2_-fomit-frame-pointer_-fwrapv_-Qunused-arguments_-fPIC_-fPIE2021011420210114
9137422356 0 036008 812 968T:powerpc/pp32cv1gcc_-march=native_-mtune=native_-O3_-fomit-frame-pointer_-fwrapv_-fPIC_-fPIE2021011420210114
922609643 0 020020 780 920T:sphlib-smallgcc_-march=native_-mtune=native_-Os_-fomit-frame-pointer_-fwrapv_-fPIC_-fPIE2021011420210114
9451619207 0 028786 796 904T:powerpc/pp32cv1clang_-march=native_-Os_-fomit-frame-pointer_-fwrapv_-Qunused-arguments_-fPIC_-fPIE2021011420210114
9513518212 0 029712 812 968T:powerpc/pp32cv1gcc_-march=native_-mtune=native_-O2_-fomit-frame-pointer_-fwrapv_-fPIC_-fPIE2021011420210114
10037717637 0 028912 812 968T:powerpc/pp32cv1gcc_-march=native_-mtune=native_-O_-fomit-frame-pointer_-fwrapv_-fPIC_-fPIE2021011420210114
10671516839 0 027179 788 936T:powerpc/pp32cv1gcc_-march=native_-mtune=native_-Os_-fomit-frame-pointer_-fwrapv_-fPIC_-fPIE2021011420210114

Compiler output

Implementation: T:aes/aes64
Security model: timingleaks
Compiler: clang -march=native -O2 -fomit-frame-pointer -fwrapv -Qunused-arguments -fPIC -fPIE
echo64.S: echo64.S:1040:2: error: '.att_syntax noprefix' is not supported: registers must have a '%' prefix in .att_syntax
echo64.S: .att_syntax noprefix
echo64.S: ^
echo64.S: echo64.S:1053:10: error: unknown token in expression
echo64.S: movabsq $-9187201950435737472, %rax
echo64.S: ^
echo64.S: echo64.S:1054:10: error: unknown token in expression
echo64.S: movabsq $-9187201950435737472, %r11
echo64.S: ^
echo64.S: echo64.S:1055:10: error: unknown token in expression
echo64.S: movabsq $7599940337074203, %r10
echo64.S: ^
echo64.S: echo64.S:1056:7: error: unknown token in expression
echo64.S: movq %rax, MEM_CST+16(%rip)
echo64.S: ^
echo64.S: echo64.S:1057:10: error: unknown token in expression
echo64.S: movabsq $7599940337074203, %r9
echo64.S: ^
echo64.S: echo64.S:1058:10: error: unknown token in expression
echo64.S: movabsq $-72340172838076674, %rax
echo64.S: ^
echo64.S: echo64.S:1059:10: error: unknown token in expression
echo64.S: movabsq $72340172838076673, %r8
echo64.S: ^
echo64.S: echo64.S:1060:10: error: unknown token in expression
echo64.S: ...

Number of similar (compiler,implementation) pairs: 5, namely:
CompilerImplementations
clang -march=native -O2 -fomit-frame-pointer -fwrapv -Qunused-arguments -fPIC -fPIE T:aes/aes64
clang -march=native -O3 -fomit-frame-pointer -fwrapv -Qunused-arguments -fPIC -fPIE T:aes/aes64
clang -march=native -O -fomit-frame-pointer -fwrapv -Qunused-arguments -fPIC -fPIE T:aes/aes64
clang -march=native -Os -fomit-frame-pointer -fwrapv -Qunused-arguments -fPIC -fPIE T:aes/aes64
clang -mcpu=native -O3 -fomit-frame-pointer -fwrapv -Qunused-arguments -fPIC -fPIE T:aes/aes64

Compiler output

Implementation: T:aes/aes64
Security model: timingleaks
Compiler: gcc -march=native -mtune=native -O2 -fomit-frame-pointer -fwrapv -fPIC -fPIE
try.c: /usr/bin/ld: crypto_hash_echo256.a(echo64.o): relocation R_X86_64_32S against undefined symbol `OLDCV' can not be used when making a PIE object; recompile with -fPIC
try.c: /usr/bin/ld: final link failed: Nonrepresentable section on output
try.c: collect2: error: ld returned 1 exit status

Number of similar (compiler,implementation) pairs: 4, namely:
CompilerImplementations
gcc -march=native -mtune=native -O2 -fomit-frame-pointer -fwrapv -fPIC -fPIE T:aes/aes64
gcc -march=native -mtune=native -O3 -fomit-frame-pointer -fwrapv -fPIC -fPIE T:aes/aes64
gcc -march=native -mtune=native -O -fomit-frame-pointer -fwrapv -fPIC -fPIE T:aes/aes64
gcc -march=native -mtune=native -Os -fomit-frame-pointer -fwrapv -fPIC -fPIE T:aes/aes64

Compiler output

Implementation: T:athlon/athlon64
Security model: timingleaks
Compiler: clang -march=native -O2 -fomit-frame-pointer -fwrapv -Qunused-arguments -fPIC -fPIE
echo64.S: echo64.S:224:2: error: invalid instruction mnemonic 'movzbl'
echo64.S: movzbl ebp, ah
echo64.S: ^~~~~~
echo64.S: echo64.S:227:2: error: invalid instruction mnemonic 'movzbl'
echo64.S: movzbl esi, al
echo64.S: ^~~~~~
echo64.S: echo64.S:239:2: error: invalid instruction mnemonic 'movzbl'
echo64.S: movzbl ebp, bl
echo64.S: ^~~~~~
echo64.S: echo64.S:242:2: error: invalid instruction mnemonic 'movzbl'
echo64.S: movzbl esi, bh
echo64.S: ^~~~~~
echo64.S: echo64.S:254:2: error: invalid instruction mnemonic 'movzbl'
echo64.S: movzbl ebp, al
echo64.S: ^~~~~~
echo64.S: echo64.S:257:2: error: invalid instruction mnemonic 'movzbl'
echo64.S: movzbl esi, ah
echo64.S: ^~~~~~
echo64.S: echo64.S:269:2: error: invalid instruction mnemonic 'movzbl'
echo64.S: movzbl ebp, bh
echo64.S: ^~~~~~
echo64.S: echo64.S:272:2: error: invalid instruction mnemonic 'movzbl'
echo64.S: movzbl esi, bl
echo64.S: ^~~~~~
echo64.S: echo64.S:284:2: error: invalid instruction mnemonic 'movzbl'
echo64.S: ...

Number of similar (compiler,implementation) pairs: 5, namely:
CompilerImplementations
clang -march=native -O2 -fomit-frame-pointer -fwrapv -Qunused-arguments -fPIC -fPIE T:athlon/athlon64
clang -march=native -O3 -fomit-frame-pointer -fwrapv -Qunused-arguments -fPIC -fPIE T:athlon/athlon64
clang -march=native -O -fomit-frame-pointer -fwrapv -Qunused-arguments -fPIC -fPIE T:athlon/athlon64
clang -march=native -Os -fomit-frame-pointer -fwrapv -Qunused-arguments -fPIC -fPIE T:athlon/athlon64
clang -mcpu=native -O3 -fomit-frame-pointer -fwrapv -Qunused-arguments -fPIC -fPIE T:athlon/athlon64

Compiler output

Implementation: T:athlon/athlon64
Security model: timingleaks
Compiler: gcc -march=native -mtune=native -O2 -fomit-frame-pointer -fwrapv -fPIC -fPIE
echo64.S: echo64.c: Assembler messages:
echo64.S: echo64.c:519: Error: no such instruction: `movzbl ebp,ah'
echo64.S: echo64.c:519: Error: no such instruction: `movzbl esi,al'
echo64.S: echo64.c:519: Error: no such instruction: `movzbl ebp,bl'
echo64.S: echo64.c:519: Error: no such instruction: `movzbl esi,bh'
echo64.S: echo64.c:519: Error: no such instruction: `movzbl ebp,al'
echo64.S: echo64.c:519: Error: no such instruction: `movzbl esi,ah'
echo64.S: echo64.c:519: Error: no such instruction: `movzbl ebp,bh'
echo64.S: echo64.c:519: Error: no such instruction: `movzbl esi,bl'
echo64.S: echo64.c:519: Error: no such instruction: `movzbl ebp,ah'
echo64.S: echo64.c:519: Error: no such instruction: `movzbl esi,al'
echo64.S: echo64.c:519: Error: no such instruction: `movzbl ebp,bl'
echo64.S: echo64.c:519: Error: no such instruction: `movzbl esi,bh'
echo64.S: echo64.c:519: Error: no such instruction: `movzbl ebp,al'
echo64.S: echo64.c:519: Error: no such instruction: `movzbl esi,ah'
echo64.S: echo64.c:519: Error: no such instruction: `movzbl ebp,bl'
echo64.S: echo64.c:519: Error: no such instruction: `movzbl esi,bh'
echo64.S: echo64.c:519: Error: no such instruction: `movzbl ebp,dl'
echo64.S: echo64.c:519: Error: no such instruction: `movzbl esi,dh'
echo64.S: echo64.c:519: Error: no such instruction: `movzbl ebp,ch'
echo64.S: echo64.c:519: Error: no such instruction: `movzbl esi,cl'
echo64.S: echo64.c:519: Error: no such instruction: `movzbl ebp,cl'
echo64.S: echo64.c:519: Error: no such instruction: `movzbl esi,ch'
echo64.S: echo64.c:519: Error: no such instruction: `movzbl ebp,dh'
echo64.S: echo64.c:519: Error: no such instruction: `movzbl esi,dl'
echo64.S: ...

Number of similar (compiler,implementation) pairs: 4, namely:
CompilerImplementations
gcc -march=native -mtune=native -O2 -fomit-frame-pointer -fwrapv -fPIC -fPIE T:athlon/athlon64
gcc -march=native -mtune=native -O3 -fomit-frame-pointer -fwrapv -fPIC -fPIE T:athlon/athlon64
gcc -march=native -mtune=native -O -fomit-frame-pointer -fwrapv -fPIC -fPIE T:athlon/athlon64
gcc -march=native -mtune=native -Os -fomit-frame-pointer -fwrapv -fPIC -fPIE T:athlon/athlon64

Compiler output

Implementation: T:ccalik/aesni
Security model: timingleaks
Compiler: clang -mcpu=native -O3 -fomit-frame-pointer -fwrapv -Qunused-arguments -fPIC -fPIE
hash.c: hash.c:295:4: error: always_inline function '_mm_aesenc_si128' requires target feature 'aes', but would be inlined into function 'Compress' that is compiled without support for 'aes'
hash.c: ECHO_ROUND_UNROLL2;
hash.c: ^
hash.c: hash.c:185:4: note: expanded from macro 'ECHO_ROUND_UNROLL2'
hash.c: ECHO_SUBBYTES(_state, 0, 0);\
hash.c: ^
hash.c: hash.c:114:19: note: expanded from macro 'ECHO_SUBBYTES'
hash.c: state[i][j] = _mm_aesenc_si128(state[i][j], k1);\
hash.c: ^
hash.c: hash.c:295:4: error: always_inline function '_mm_aesenc_si128' requires target feature 'aes', but would be inlined into function 'Compress' that is compiled without support for 'aes'
hash.c: hash.c:185:4: note: expanded from macro 'ECHO_ROUND_UNROLL2'
hash.c: ECHO_SUBBYTES(_state, 0, 0);\
hash.c: ^
hash.c: hash.c:115:19: note: expanded from macro 'ECHO_SUBBYTES'
hash.c: state[i][j] = _mm_aesenc_si128(state[i][j], M128(zero));\
hash.c: ^
hash.c: hash.c:295:4: error: always_inline function '_mm_aesenc_si128' requires target feature 'aes', but would be inlined into function 'Compress' that is compiled without support for 'aes'
hash.c: hash.c:186:4: note: expanded from macro 'ECHO_ROUND_UNROLL2'
hash.c: ECHO_SUBBYTES(_state, 1, 0);\
hash.c: ^
hash.c: hash.c:114:19: note: expanded from macro 'ECHO_SUBBYTES'
hash.c: state[i][j] = _mm_aesenc_si128(state[i][j], k1);\
hash.c: ^
hash.c: hash.c:295:4: error: always_inline function '_mm_aesenc_si128' requires target feature 'aes', but would be inlined into function 'Compress' that is compiled without support for 'aes'
hash.c: hash.c:186:4: note: expanded from macro 'ECHO_ROUND_UNROLL2'
hash.c: ...

Number of similar (compiler,implementation) pairs: 1, namely:
CompilerImplementations
clang -mcpu=native -O3 -fomit-frame-pointer -fwrapv -Qunused-arguments -fPIC -fPIE T:ccalik/aesni

Compiler output

Implementation: T:ccalik/bitsliced
Security model: timingleaks
Compiler: clang -mcpu=native -O3 -fomit-frame-pointer -fwrapv -Qunused-arguments -fPIC -fPIE
hash.c: hash.c:467:4: error: always_inline function '_mm_shuffle_epi8' requires target feature 'ssse3', but would be inlined into function 'Compress' that is compiled without support for 'ssse3'
hash.c: AES_SHIFT_ROWS(_state);
hash.c: ^
hash.c: hash.c:140:14: note: expanded from macro 'AES_SHIFT_ROWS'
hash.c: s[0][0] = _mm_shuffle_epi8(s[0][0], M128(shiftrowsslice));\
hash.c: ^
hash.c: hash.c:467:4: error: always_inline function '_mm_shuffle_epi8' requires target feature 'ssse3', but would be inlined into function 'Compress' that is compiled without support for 'ssse3'
hash.c: hash.c:141:14: note: expanded from macro 'AES_SHIFT_ROWS'
hash.c: s[0][1] = _mm_shuffle_epi8(s[0][1], M128(shiftrowsslice));\
hash.c: ^
hash.c: hash.c:467:4: error: always_inline function '_mm_shuffle_epi8' requires target feature 'ssse3', but would be inlined into function 'Compress' that is compiled without support for 'ssse3'
hash.c: hash.c:142:14: note: expanded from macro 'AES_SHIFT_ROWS'
hash.c: s[0][2] = _mm_shuffle_epi8(s[0][2], M128(shiftrowsslice));\
hash.c: ^
hash.c: hash.c:467:4: error: always_inline function '_mm_shuffle_epi8' requires target feature 'ssse3', but would be inlined into function 'Compress' that is compiled without support for 'ssse3'
hash.c: hash.c:143:14: note: expanded from macro 'AES_SHIFT_ROWS'
hash.c: s[0][3] = _mm_shuffle_epi8(s[0][3], M128(shiftrowsslice));\
hash.c: ^
hash.c: hash.c:467:4: error: always_inline function '_mm_shuffle_epi8' requires target feature 'ssse3', but would be inlined into function 'Compress' that is compiled without support for 'ssse3'
hash.c: hash.c:144:14: note: expanded from macro 'AES_SHIFT_ROWS'
hash.c: s[1][0] = _mm_shuffle_epi8(s[1][0], M128(shiftrowsslice));\
hash.c: ^
hash.c: hash.c:467:4: error: always_inline function '_mm_shuffle_epi8' requires target feature 'ssse3', but would be inlined into function 'Compress' that is compiled without support for 'ssse3'
hash.c: hash.c:145:14: note: expanded from macro 'AES_SHIFT_ROWS'
hash.c: s[1][1] = _mm_shuffle_epi8(s[1][1], M128(shiftrowsslice));\
hash.c: ...

Number of similar (compiler,implementation) pairs: 1, namely:
CompilerImplementations
clang -mcpu=native -O3 -fomit-frame-pointer -fwrapv -Qunused-arguments -fPIC -fPIE T:ccalik/bitsliced

Compiler output

Implementation: T:ccalik/vperm
Security model: timingleaks
Compiler: clang -mcpu=native -O3 -fomit-frame-pointer -fwrapv -Qunused-arguments -fPIC -fPIE
hash.c: hash.c:264:4: error: always_inline function '_mm_shuffle_epi8' requires target feature 'ssse3', but would be inlined into function 'Compress' that is compiled without support for 'ssse3'
hash.c: TRANSFORM(_state[i][j], _k_ipt, t1, t2);
hash.c: ^
hash.c: ./vperm.h:52:7: note: expanded from macro 'TRANSFORM'
hash.c: t1 = _mm_shuffle_epi8(*((__m128i*)table + 1), t1);\
hash.c: ^
hash.c: hash.c:264:4: error: always_inline function '_mm_shuffle_epi8' requires target feature 'ssse3', but would be inlined into function 'Compress' that is compiled without support for 'ssse3'
hash.c: ./vperm.h:53:7: note: expanded from macro 'TRANSFORM'
hash.c: x = _mm_shuffle_epi8(*((__m128i*)table + 0), x);\
hash.c: ^
hash.c: hash.c:281:5: error: always_inline function '_mm_shuffle_epi8' requires target feature 'ssse3', but would be inlined into function 'Compress' that is compiled without support for 'ssse3'
hash.c: TRANSFORM(_state[i][j], _k_ipt, t1, t2);
hash.c: ^
hash.c: ./vperm.h:52:7: note: expanded from macro 'TRANSFORM'
hash.c: t1 = _mm_shuffle_epi8(*((__m128i*)table + 1), t1);\
hash.c: ^
hash.c: hash.c:281:5: error: always_inline function '_mm_shuffle_epi8' requires target feature 'ssse3', but would be inlined into function 'Compress' that is compiled without support for 'ssse3'
hash.c: ./vperm.h:53:7: note: expanded from macro 'TRANSFORM'
hash.c: x = _mm_shuffle_epi8(*((__m128i*)table + 0), x);\
hash.c: ^
hash.c: hash.c:306:4: error: always_inline function '_mm_shuffle_epi8' requires target feature 'ssse3', but would be inlined into function 'Compress' that is compiled without support for 'ssse3'
hash.c: ECHO_SUB_AND_MIX(_state, 0, 0, _state2, 0, 0, 1, 2, 3);
hash.c: ^
hash.c: hash.c:125:5: note: expanded from macro 'ECHO_SUB_AND_MIX'
hash.c: AES_ROUND_VPERM_CORE(state[i][j], t1, t2, t3, t4, s1, s2, s3);\
hash.c: ...

Number of similar (compiler,implementation) pairs: 1, namely:
CompilerImplementations
clang -mcpu=native -O3 -fomit-frame-pointer -fwrapv -Qunused-arguments -fPIC -fPIE T:ccalik/vperm

Compiler output

Implementation: T:core2/core2v64
Security model: timingleaks
Compiler: clang -march=native -O2 -fomit-frame-pointer -fwrapv -Qunused-arguments -fPIC -fPIE
echo64.S: echo64.S:212:2: error: invalid instruction mnemonic 'movzbl'
echo64.S: movzbl ebp, ah
echo64.S: ^~~~~~
echo64.S: echo64.S:218:2: error: invalid instruction mnemonic 'movzbl'
echo64.S: movzbl esi, al
echo64.S: ^~~~~~
echo64.S: echo64.S:227:2: error: invalid instruction mnemonic 'movzbl'
echo64.S: movzbl ebp, bl
echo64.S: ^~~~~~
echo64.S: echo64.S:233:2: error: invalid instruction mnemonic 'movzbl'
echo64.S: movzbl esi, bh
echo64.S: ^~~~~~
echo64.S: echo64.S:242:2: error: invalid instruction mnemonic 'movzbl'
echo64.S: movzbl ebp, al
echo64.S: ^~~~~~
echo64.S: echo64.S:248:2: error: invalid instruction mnemonic 'movzbl'
echo64.S: movzbl esi, ah
echo64.S: ^~~~~~
echo64.S: echo64.S:257:2: error: invalid instruction mnemonic 'movzbl'
echo64.S: movzbl ebp, bh
echo64.S: ^~~~~~
echo64.S: echo64.S:263:2: error: invalid instruction mnemonic 'movzbl'
echo64.S: movzbl esi, bl
echo64.S: ^~~~~~
echo64.S: echo64.S:272:2: error: invalid instruction mnemonic 'movzbl'
echo64.S: ...

Number of similar (compiler,implementation) pairs: 5, namely:
CompilerImplementations
clang -march=native -O2 -fomit-frame-pointer -fwrapv -Qunused-arguments -fPIC -fPIE T:core2/core2v64
clang -march=native -O3 -fomit-frame-pointer -fwrapv -Qunused-arguments -fPIC -fPIE T:core2/core2v64
clang -march=native -O -fomit-frame-pointer -fwrapv -Qunused-arguments -fPIC -fPIE T:core2/core2v64
clang -march=native -Os -fomit-frame-pointer -fwrapv -Qunused-arguments -fPIC -fPIE T:core2/core2v64
clang -mcpu=native -O3 -fomit-frame-pointer -fwrapv -Qunused-arguments -fPIC -fPIE T:core2/core2v64

Compiler output

Implementation: T:core2/core2v64
Security model: timingleaks
Compiler: gcc -march=native -mtune=native -O2 -fomit-frame-pointer -fwrapv -fPIC -fPIE
echo64.S: echo64.c: Assembler messages:
echo64.S: echo64.c:473: Error: no such instruction: `movzbl ebp,ah'
echo64.S: echo64.c:473: Error: no such instruction: `movzbl esi,al'
echo64.S: echo64.c:473: Error: no such instruction: `movzbl ebp,bl'
echo64.S: echo64.c:473: Error: no such instruction: `movzbl esi,bh'
echo64.S: echo64.c:473: Error: no such instruction: `movzbl ebp,al'
echo64.S: echo64.c:473: Error: no such instruction: `movzbl esi,ah'
echo64.S: echo64.c:473: Error: no such instruction: `movzbl ebp,bh'
echo64.S: echo64.c:473: Error: no such instruction: `movzbl esi,bl'
echo64.S: echo64.c:473: Error: no such instruction: `movzbl ebp,ah'
echo64.S: echo64.c:473: Error: no such instruction: `movzbl esi,al'
echo64.S: echo64.c:473: Error: no such instruction: `movzbl ebp,bl'
echo64.S: echo64.c:473: Error: no such instruction: `movzbl esi,bh'
echo64.S: echo64.c:473: Error: no such instruction: `movzbl ebp,al'
echo64.S: echo64.c:473: Error: no such instruction: `movzbl esi,ah'
echo64.S: echo64.c:473: Error: no such instruction: `movzbl ebp,bl'
echo64.S: echo64.c:473: Error: no such instruction: `movzbl esi,bh'
echo64.S: echo64.c:473: Error: no such instruction: `movzbl ebp,dl'
echo64.S: echo64.c:473: Error: no such instruction: `movzbl esi,dh'
echo64.S: echo64.c:473: Error: no such instruction: `movzbl ebp,ch'
echo64.S: echo64.c:473: Error: no such instruction: `movzbl esi,cl'
echo64.S: echo64.c:473: Error: no such instruction: `movzbl ebp,cl'
echo64.S: echo64.c:473: Error: no such instruction: `movzbl esi,ch'
echo64.S: echo64.c:473: Error: no such instruction: `movzbl ebp,dh'
echo64.S: echo64.c:473: Error: no such instruction: `movzbl esi,dl'
echo64.S: ...

Number of similar (compiler,implementation) pairs: 4, namely:
CompilerImplementations
gcc -march=native -mtune=native -O2 -fomit-frame-pointer -fwrapv -fPIC -fPIE T:core2/core2v64
gcc -march=native -mtune=native -O3 -fomit-frame-pointer -fwrapv -fPIC -fPIE T:core2/core2v64
gcc -march=native -mtune=native -O -fomit-frame-pointer -fwrapv -fPIC -fPIE T:core2/core2v64
gcc -march=native -mtune=native -Os -fomit-frame-pointer -fwrapv -fPIC -fPIE T:core2/core2v64

Compiler output

Implementation: T:generic/opt64
Security model: timingleaks
Compiler: clang -march=native -O2 -fomit-frame-pointer -fwrapv -Qunused-arguments -fPIC -fPIE
echo64.c: echo64.c:501:29: warning: passing 'const unsigned char *' to parameter of type 'BitSequence *' (aka 'unsigned char *') discards qualifiers [-Wincompatible-pointer-types-discards-qualifiers]
echo64.c: if (Hash(CRYPTO_BYTES * 8,in,inlen * 8,out) == SUCCESS) return 0;
echo64.c: ^~
echo64.c: echo64.c:488:46: note: passing argument to parameter 'data' here
echo64.c: HashReturn Hash(int hashbitlen, BitSequence *data, DataLength databitlen, BitSequence *hashval)
echo64.c: ^
echo64.c: 1 warning generated.

Number of similar (compiler,implementation) pairs: 5, namely:
CompilerImplementations
clang -march=native -O2 -fomit-frame-pointer -fwrapv -Qunused-arguments -fPIC -fPIE T:generic/opt64
clang -march=native -O3 -fomit-frame-pointer -fwrapv -Qunused-arguments -fPIC -fPIE T:generic/opt64
clang -march=native -O -fomit-frame-pointer -fwrapv -Qunused-arguments -fPIC -fPIE T:generic/opt64
clang -march=native -Os -fomit-frame-pointer -fwrapv -Qunused-arguments -fPIC -fPIE T:generic/opt64
clang -mcpu=native -O3 -fomit-frame-pointer -fwrapv -Qunused-arguments -fPIC -fPIE T:generic/opt64

Compiler output

Implementation: T:generic/opt64
Security model: timingleaks
Compiler: gcc -march=native -mtune=native -O2 -fomit-frame-pointer -fwrapv -fPIC -fPIE
echo64.c: echo64.c: In function 'crypto_hash_echo256_generic_opt64_timingleaks':
echo64.c: echo64.c:501:29: warning: passing argument 2 of 'Hash' discards 'const' qualifier from pointer target type [-Wdiscarded-qualifiers]
echo64.c: if (Hash(CRYPTO_BYTES * 8,in,inlen * 8,out) == SUCCESS) return 0;
echo64.c: ^~
echo64.c: echo64.c:488:12: note: expected 'BitSequence * {aka unsigned char *}' but argument is of type 'const unsigned char *'
echo64.c: HashReturn Hash(int hashbitlen, BitSequence *data, DataLength databitlen, BitSequence *hashval)
echo64.c: ^~~~

Number of similar (compiler,implementation) pairs: 4, namely:
CompilerImplementations
gcc -march=native -mtune=native -O2 -fomit-frame-pointer -fwrapv -fPIC -fPIE T:generic/opt64
gcc -march=native -mtune=native -O3 -fomit-frame-pointer -fwrapv -fPIC -fPIE T:generic/opt64
gcc -march=native -mtune=native -O -fomit-frame-pointer -fwrapv -fPIC -fPIE T:generic/opt64
gcc -march=native -mtune=native -Os -fomit-frame-pointer -fwrapv -fPIC -fPIE T:generic/opt64

Compiler output

Implementation: T:pentium/pentium4v64v1
Security model: timingleaks
Compiler: clang -march=native -O2 -fomit-frame-pointer -fwrapv -Qunused-arguments -fPIC -fPIE
echo32.S: echo32.S:311:2: error: invalid instruction mnemonic 'addd'
echo32.S: addd [SHA3_CNT], 1
echo32.S: ^~~~
echo32.S: echo32.S:575:2: error: invalid instruction mnemonic 'addd'
echo32.S: addd [SHA3_CNT], 1
echo32.S: ^~~~
echo32.S: echo32.S:839:2: error: invalid instruction mnemonic 'addd'
echo32.S: addd [SHA3_CNT], 1
echo32.S: ^~~~
echo32.S: echo32.S:1103:2: error: invalid instruction mnemonic 'addd'
echo32.S: addd [SHA3_CNT], 1
echo32.S: ^~~~
echo32.S: echo32.S:1367:2: error: invalid instruction mnemonic 'addd'
echo32.S: addd [SHA3_CNT], 1
echo32.S: ^~~~
echo32.S: echo32.S:1631:2: error: invalid instruction mnemonic 'addd'
echo32.S: addd [SHA3_CNT], 1
echo32.S: ^~~~
echo32.S: echo32.S:1895:2: error: invalid instruction mnemonic 'addd'
echo32.S: addd [SHA3_CNT], 1
echo32.S: ^~~~
echo32.S: echo32.S:2159:2: error: invalid instruction mnemonic 'addd'
echo32.S: addd [SHA3_CNT], 1
echo32.S: ^~~~
echo32.S: echo32.S:2423:2: error: invalid instruction mnemonic 'addd'
echo32.S: ...

Number of similar (compiler,implementation) pairs: 5, namely:
CompilerImplementations
clang -march=native -O2 -fomit-frame-pointer -fwrapv -Qunused-arguments -fPIC -fPIE T:pentium/pentium4v64v1
clang -march=native -O3 -fomit-frame-pointer -fwrapv -Qunused-arguments -fPIC -fPIE T:pentium/pentium4v64v1
clang -march=native -O -fomit-frame-pointer -fwrapv -Qunused-arguments -fPIC -fPIE T:pentium/pentium4v64v1
clang -march=native -Os -fomit-frame-pointer -fwrapv -Qunused-arguments -fPIC -fPIE T:pentium/pentium4v64v1
clang -mcpu=native -O3 -fomit-frame-pointer -fwrapv -Qunused-arguments -fPIC -fPIE T:pentium/pentium4v64v1

Compiler output

Implementation: T:pentium/pentium4v64v1
Security model: timingleaks
Compiler: gcc -march=native -mtune=native -O2 -fomit-frame-pointer -fwrapv -fPIC -fPIE
try.c: /usr/bin/ld: crypto_hash_echo256.a(echo32.o): relocation R_X86_64_32S against undefined symbol `SHA3_R' can not be used when making a PIE object; recompile with -fPIC
try.c: /usr/bin/ld: final link failed: Nonrepresentable section on output
try.c: collect2: error: ld returned 1 exit status

Number of similar (compiler,implementation) pairs: 4, namely:
CompilerImplementations
gcc -march=native -mtune=native -O2 -fomit-frame-pointer -fwrapv -fPIC -fPIE T:pentium/pentium4v64v1
gcc -march=native -mtune=native -O3 -fomit-frame-pointer -fwrapv -fPIC -fPIE T:pentium/pentium4v64v1
gcc -march=native -mtune=native -O -fomit-frame-pointer -fwrapv -fPIC -fPIE T:pentium/pentium4v64v1
gcc -march=native -mtune=native -Os -fomit-frame-pointer -fwrapv -fPIC -fPIE T:pentium/pentium4v64v1

Compiler output

Implementation: T:pentium/pentium4v64v2
Security model: timingleaks
Compiler: clang -march=native -O2 -fomit-frame-pointer -fwrapv -Qunused-arguments -fPIC -fPIE
echo64.S: echo64.S:371:2: error: invalid instruction mnemonic 'addd'
echo64.S: addd [SHA3_CNT], 1
echo64.S: ^~~~
echo64.S: echo64.S:635:2: error: invalid instruction mnemonic 'addd'
echo64.S: addd [SHA3_CNT], 1
echo64.S: ^~~~
echo64.S: echo64.S:899:2: error: invalid instruction mnemonic 'addd'
echo64.S: addd [SHA3_CNT], 1
echo64.S: ^~~~
echo64.S: echo64.S:1163:2: error: invalid instruction mnemonic 'addd'
echo64.S: addd [SHA3_CNT], 1
echo64.S: ^~~~
echo64.S: echo64.S:1427:2: error: invalid instruction mnemonic 'addd'
echo64.S: addd [SHA3_CNT], 1
echo64.S: ^~~~
echo64.S: echo64.S:1691:2: error: invalid instruction mnemonic 'addd'
echo64.S: addd [SHA3_CNT], 1
echo64.S: ^~~~
echo64.S: echo64.S:1955:2: error: invalid instruction mnemonic 'addd'
echo64.S: addd [SHA3_CNT], 1
echo64.S: ^~~~
echo64.S: echo64.S:2219:2: error: invalid instruction mnemonic 'addd'
echo64.S: addd [SHA3_CNT], 1
echo64.S: ^~~~
echo64.S: echo64.S:2483:2: error: invalid instruction mnemonic 'addd'
echo64.S: ...

Number of similar (compiler,implementation) pairs: 5, namely:
CompilerImplementations
clang -march=native -O2 -fomit-frame-pointer -fwrapv -Qunused-arguments -fPIC -fPIE T:pentium/pentium4v64v2
clang -march=native -O3 -fomit-frame-pointer -fwrapv -Qunused-arguments -fPIC -fPIE T:pentium/pentium4v64v2
clang -march=native -O -fomit-frame-pointer -fwrapv -Qunused-arguments -fPIC -fPIE T:pentium/pentium4v64v2
clang -march=native -Os -fomit-frame-pointer -fwrapv -Qunused-arguments -fPIC -fPIE T:pentium/pentium4v64v2
clang -mcpu=native -O3 -fomit-frame-pointer -fwrapv -Qunused-arguments -fPIC -fPIE T:pentium/pentium4v64v2

Compiler output

Implementation: T:pentium/pentium4v64v2
Security model: timingleaks
Compiler: gcc -march=native -mtune=native -O2 -fomit-frame-pointer -fwrapv -fPIC -fPIE
try.c: /usr/bin/ld: crypto_hash_echo256.a(echo64.o): relocation R_X86_64_32S against undefined symbol `SHA3_R' can not be used when making a PIE object; recompile with -fPIC
try.c: /usr/bin/ld: final link failed: Nonrepresentable section on output
try.c: collect2: error: ld returned 1 exit status

Number of similar (compiler,implementation) pairs: 4, namely:
CompilerImplementations
gcc -march=native -mtune=native -O2 -fomit-frame-pointer -fwrapv -fPIC -fPIE T:pentium/pentium4v64v2
gcc -march=native -mtune=native -O3 -fomit-frame-pointer -fwrapv -fPIC -fPIE T:pentium/pentium4v64v2
gcc -march=native -mtune=native -O -fomit-frame-pointer -fwrapv -fPIC -fPIE T:pentium/pentium4v64v2
gcc -march=native -mtune=native -Os -fomit-frame-pointer -fwrapv -fPIC -fPIE T:pentium/pentium4v64v2

Namespace violations

Implementation: T:ccalik/aesni
Security model: timingleaks
Compiler: clang -march=native -O2 -fomit-frame-pointer -fwrapv -Qunused-arguments -fPIC -fPIE
hash.o Compress T
hash.o Final T
hash.o Hash T
hash.o Init T
hash.o Update T
hash.o _k_aesmix1 R
hash.o _k_aesmix2 R
hash.o _k_aesmix3 R
hash.o _k_aesmix4 R
hash.o _k_h0e R
hash.o _k_h15 R
hash.o _k_h4e R
hash.o _k_h5b R
hash.o _k_h63 R
hash.o _k_hc6 R
hash.o _k_inv R
hash.o _k_ipt R
hash.o _k_opt R
hash.o _k_s0F R
hash.o _k_sb1 R
hash.o _k_sb2 R
hash.o _k_sb3 R
hash.o _k_sb4 R
hash.o _k_sb5 R
hash.o _k_sb7 R
hash.o _k_sbo R
hash.o const1 R
hash.o invshiftrows R
hash.o lsbmask R
hash.o mul2ipt R
hash.o mul2mask R
hash.o zero R

Number of similar (compiler,implementation) pairs: 16, namely:
CompilerImplementations
clang -march=native -O2 -fomit-frame-pointer -fwrapv -Qunused-arguments -fPIC -fPIE T:ccalik/aesni
clang -march=native -O3 -fomit-frame-pointer -fwrapv -Qunused-arguments -fPIC -fPIE T:ccalik/aesni
clang -march=native -O -fomit-frame-pointer -fwrapv -Qunused-arguments -fPIC -fPIE T:ccalik/aesni
clang -march=native -Os -fomit-frame-pointer -fwrapv -Qunused-arguments -fPIC -fPIE T:ccalik/aesni
gcc -march=native -mtune=native -O2 -fomit-frame-pointer -fwrapv -fPIC -fPIE T:ccalik/aesni
gcc -march=native -mtune=native -O3 -fomit-frame-pointer -fwrapv -fPIC -fPIE T:ccalik/aesni
gcc -march=native -mtune=native -O -fomit-frame-pointer -fwrapv -fPIC -fPIE T:ccalik/aesni
gcc -march=native -mtune=native -Os -fomit-frame-pointer -fwrapv -fPIC -fPIE T:ccalik/aesni
clang -march=native -O2 -fomit-frame-pointer -fwrapv -Qunused-arguments -fPIC -fPIE T:ccalik/vperm
clang -march=native -O3 -fomit-frame-pointer -fwrapv -Qunused-arguments -fPIC -fPIE T:ccalik/vperm
clang -march=native -O -fomit-frame-pointer -fwrapv -Qunused-arguments -fPIC -fPIE T:ccalik/vperm
clang -march=native -Os -fomit-frame-pointer -fwrapv -Qunused-arguments -fPIC -fPIE T:ccalik/vperm
gcc -march=native -mtune=native -O2 -fomit-frame-pointer -fwrapv -fPIC -fPIE T:ccalik/vperm
gcc -march=native -mtune=native -O3 -fomit-frame-pointer -fwrapv -fPIC -fPIE T:ccalik/vperm
gcc -march=native -mtune=native -O -fomit-frame-pointer -fwrapv -fPIC -fPIE T:ccalik/vperm
gcc -march=native -mtune=native -Os -fomit-frame-pointer -fwrapv -fPIC -fPIE T:ccalik/vperm

Namespace violations

Implementation: T:ccalik/bitsliced
Security model: timingleaks
Compiler: clang -march=native -O2 -fomit-frame-pointer -fwrapv -Qunused-arguments -fPIC -fPIE
hash.o Compress T
hash.o Final T
hash.o Hash T
hash.o Init T
hash.o Update T
hash.o _BS0 R
hash.o _BS1 R
hash.o _BS2 R
hash.o _ONE R
hash.o bigshiftrows1 R
hash.o bigshiftrows2 R
hash.o bigshiftrows3 R
hash.o const1 R
hash.o lownibblemask R
hash.o mixcol1 R
hash.o mixcol2 R
hash.o mixcol3 R
hash.o shiftrowsslice R

Number of similar (compiler,implementation) pairs: 8, namely:
CompilerImplementations
clang -march=native -O2 -fomit-frame-pointer -fwrapv -Qunused-arguments -fPIC -fPIE T:ccalik/bitsliced
clang -march=native -O3 -fomit-frame-pointer -fwrapv -Qunused-arguments -fPIC -fPIE T:ccalik/bitsliced
clang -march=native -O -fomit-frame-pointer -fwrapv -Qunused-arguments -fPIC -fPIE T:ccalik/bitsliced
clang -march=native -Os -fomit-frame-pointer -fwrapv -Qunused-arguments -fPIC -fPIE T:ccalik/bitsliced
gcc -march=native -mtune=native -O2 -fomit-frame-pointer -fwrapv -fPIC -fPIE T:ccalik/bitsliced
gcc -march=native -mtune=native -O3 -fomit-frame-pointer -fwrapv -fPIC -fPIE T:ccalik/bitsliced
gcc -march=native -mtune=native -O -fomit-frame-pointer -fwrapv -fPIC -fPIE T:ccalik/bitsliced
gcc -march=native -mtune=native -Os -fomit-frame-pointer -fwrapv -fPIC -fPIE T:ccalik/bitsliced

Namespace violations

Implementation: T:generic/opt32
Security model: timingleaks
Compiler: clang -march=native -O2 -fomit-frame-pointer -fwrapv -Qunused-arguments -fPIC -fPIE
echo32.o CNT_r C
echo32.o Compress T
echo32.o Endianess T
echo32.o Final T
echo32.o Hash T
echo32.o Init T
echo32.o PushString T
echo32.o Update T
echo32.o endian C
echo32.o flip_bits T
echo32.o r C

Number of similar (compiler,implementation) pairs: 27, namely:
CompilerImplementations
clang -march=native -O2 -fomit-frame-pointer -fwrapv -Qunused-arguments -fPIC -fPIE T:generic/opt32
clang -march=native -O3 -fomit-frame-pointer -fwrapv -Qunused-arguments -fPIC -fPIE T:generic/opt32
clang -march=native -O -fomit-frame-pointer -fwrapv -Qunused-arguments -fPIC -fPIE T:generic/opt32
clang -march=native -Os -fomit-frame-pointer -fwrapv -Qunused-arguments -fPIC -fPIE T:generic/opt32
clang -mcpu=native -O3 -fomit-frame-pointer -fwrapv -Qunused-arguments -fPIC -fPIE T:generic/opt32
gcc -march=native -mtune=native -O2 -fomit-frame-pointer -fwrapv -fPIC -fPIE T:generic/opt32
gcc -march=native -mtune=native -O3 -fomit-frame-pointer -fwrapv -fPIC -fPIE T:generic/opt32
gcc -march=native -mtune=native -O -fomit-frame-pointer -fwrapv -fPIC -fPIE T:generic/opt32
gcc -march=native -mtune=native -Os -fomit-frame-pointer -fwrapv -fPIC -fPIE T:generic/opt32
clang -march=native -O2 -fomit-frame-pointer -fwrapv -Qunused-arguments -fPIC -fPIE T:powerpc/pp32cv1
clang -march=native -O3 -fomit-frame-pointer -fwrapv -Qunused-arguments -fPIC -fPIE T:powerpc/pp32cv1
clang -march=native -O -fomit-frame-pointer -fwrapv -Qunused-arguments -fPIC -fPIE T:powerpc/pp32cv1
clang -march=native -Os -fomit-frame-pointer -fwrapv -Qunused-arguments -fPIC -fPIE T:powerpc/pp32cv1
clang -mcpu=native -O3 -fomit-frame-pointer -fwrapv -Qunused-arguments -fPIC -fPIE T:powerpc/pp32cv1
gcc -march=native -mtune=native -O2 -fomit-frame-pointer -fwrapv -fPIC -fPIE T:powerpc/pp32cv1
gcc -march=native -mtune=native -O3 -fomit-frame-pointer -fwrapv -fPIC -fPIE T:powerpc/pp32cv1
gcc -march=native -mtune=native -O -fomit-frame-pointer -fwrapv -fPIC -fPIE T:powerpc/pp32cv1
gcc -march=native -mtune=native -Os -fomit-frame-pointer -fwrapv -fPIC -fPIE T:powerpc/pp32cv1
clang -march=native -O2 -fomit-frame-pointer -fwrapv -Qunused-arguments -fPIC -fPIE T:powerpc/pp32cv2
clang -march=native -O3 -fomit-frame-pointer -fwrapv -Qunused-arguments -fPIC -fPIE T:powerpc/pp32cv2
clang -march=native -O -fomit-frame-pointer -fwrapv -Qunused-arguments -fPIC -fPIE T:powerpc/pp32cv2
clang -march=native -Os -fomit-frame-pointer -fwrapv -Qunused-arguments -fPIC -fPIE T:powerpc/pp32cv2
clang -mcpu=native -O3 -fomit-frame-pointer -fwrapv -Qunused-arguments -fPIC -fPIE T:powerpc/pp32cv2
gcc -march=native -mtune=native -O2 -fomit-frame-pointer -fwrapv -fPIC -fPIE T:powerpc/pp32cv2
gcc -march=native -mtune=native -O3 -fomit-frame-pointer -fwrapv -fPIC -fPIE T:powerpc/pp32cv2
gcc -march=native -mtune=native -O -fomit-frame-pointer -fwrapv -fPIC -fPIE T:powerpc/pp32cv2
gcc -march=native -mtune=native -Os -fomit-frame-pointer -fwrapv -fPIC -fPIE T:powerpc/pp32cv2

Namespace violations

Implementation: T:generic/opt64
Security model: timingleaks
Compiler: clang -march=native -O2 -fomit-frame-pointer -fwrapv -Qunused-arguments -fPIC -fPIE
echo64.o Compress T
echo64.o Endianess T
echo64.o Final T
echo64.o Hash T
echo64.o Init T
echo64.o PushString T
echo64.o Update T
echo64.o endian C

Number of similar (compiler,implementation) pairs: 9, namely:
CompilerImplementations
clang -march=native -O2 -fomit-frame-pointer -fwrapv -Qunused-arguments -fPIC -fPIE T:generic/opt64
clang -march=native -O3 -fomit-frame-pointer -fwrapv -Qunused-arguments -fPIC -fPIE T:generic/opt64
clang -march=native -O -fomit-frame-pointer -fwrapv -Qunused-arguments -fPIC -fPIE T:generic/opt64
clang -march=native -Os -fomit-frame-pointer -fwrapv -Qunused-arguments -fPIC -fPIE T:generic/opt64
clang -mcpu=native -O3 -fomit-frame-pointer -fwrapv -Qunused-arguments -fPIC -fPIE T:generic/opt64
gcc -march=native -mtune=native -O2 -fomit-frame-pointer -fwrapv -fPIC -fPIE T:generic/opt64
gcc -march=native -mtune=native -O3 -fomit-frame-pointer -fwrapv -fPIC -fPIE T:generic/opt64
gcc -march=native -mtune=native -O -fomit-frame-pointer -fwrapv -fPIC -fPIE T:generic/opt64
gcc -march=native -mtune=native -Os -fomit-frame-pointer -fwrapv -fPIC -fPIE T:generic/opt64

Namespace violations

Implementation: T:sphlib
Security model: timingleaks
Compiler: clang -march=native -O2 -fomit-frame-pointer -fwrapv -Qunused-arguments -fPIC -fPIE
echo.o sph_echo224 T
echo.o sph_echo224_addbits_and_close T
echo.o sph_echo224_close T
echo.o sph_echo224_init T
echo.o sph_echo256 T
echo.o sph_echo256_addbits_and_close T
echo.o sph_echo256_close T
echo.o sph_echo256_init T
echo.o sph_echo384 T
echo.o sph_echo384_addbits_and_close T
echo.o sph_echo384_close T
echo.o sph_echo384_init T
echo.o sph_echo512 T
echo.o sph_echo512_addbits_and_close T
echo.o sph_echo512_close T
echo.o sph_echo512_init T

Number of similar (compiler,implementation) pairs: 18, namely:
CompilerImplementations
clang -march=native -O2 -fomit-frame-pointer -fwrapv -Qunused-arguments -fPIC -fPIE T:sphlib
clang -march=native -O3 -fomit-frame-pointer -fwrapv -Qunused-arguments -fPIC -fPIE T:sphlib
clang -march=native -O -fomit-frame-pointer -fwrapv -Qunused-arguments -fPIC -fPIE T:sphlib
clang -march=native -Os -fomit-frame-pointer -fwrapv -Qunused-arguments -fPIC -fPIE T:sphlib
clang -mcpu=native -O3 -fomit-frame-pointer -fwrapv -Qunused-arguments -fPIC -fPIE T:sphlib
gcc -march=native -mtune=native -O2 -fomit-frame-pointer -fwrapv -fPIC -fPIE T:sphlib
gcc -march=native -mtune=native -O3 -fomit-frame-pointer -fwrapv -fPIC -fPIE T:sphlib
gcc -march=native -mtune=native -O -fomit-frame-pointer -fwrapv -fPIC -fPIE T:sphlib
gcc -march=native -mtune=native -Os -fomit-frame-pointer -fwrapv -fPIC -fPIE T:sphlib
clang -march=native -O2 -fomit-frame-pointer -fwrapv -Qunused-arguments -fPIC -fPIE T:sphlib-small
clang -march=native -O3 -fomit-frame-pointer -fwrapv -Qunused-arguments -fPIC -fPIE T:sphlib-small
clang -march=native -O -fomit-frame-pointer -fwrapv -Qunused-arguments -fPIC -fPIE T:sphlib-small
clang -march=native -Os -fomit-frame-pointer -fwrapv -Qunused-arguments -fPIC -fPIE T:sphlib-small
clang -mcpu=native -O3 -fomit-frame-pointer -fwrapv -Qunused-arguments -fPIC -fPIE T:sphlib-small
gcc -march=native -mtune=native -O2 -fomit-frame-pointer -fwrapv -fPIC -fPIE T:sphlib-small
gcc -march=native -mtune=native -O3 -fomit-frame-pointer -fwrapv -fPIC -fPIE T:sphlib-small
gcc -march=native -mtune=native -O -fomit-frame-pointer -fwrapv -fPIC -fPIE T:sphlib-small
gcc -march=native -mtune=native -Os -fomit-frame-pointer -fwrapv -fPIC -fPIE T:sphlib-small