Implementation notes: amd64, rumba7, crypto_hash/asconxofav12

Computer: rumba7
Microarchitecture: amd64; Zen (800f11)
Architecture: amd64
CPU ID: AuthenticAMD-00800f11-178bfbff
SUPERCOP version: 20240425
Operation: crypto_hash
Primitive: asconxofav12
TimeObject sizeTest sizeImplementationCompilerBenchmark dateSUPERCOP version
185664835 0 018739 844 928opt64clang_-march=native_-O3_-fomit-frame-pointer_-fwrapv_-Qunused-arguments_-fPIC_-fPIE2024042620240425
186094835 0 018363 844 928opt64clang_-march=native_-O2_-fomit-frame-pointer_-fwrapv_-Qunused-arguments_-fPIC_-fPIE2024042620240425
188024813 0 016029 836 960opt64clang_-march=native_-Os_-fomit-frame-pointer_-fwrapv_-Qunused-arguments_-fPIC_-fPIE2024042620240425
194264819 0 015315 844 896opt64clang_-march=native_-O_-fomit-frame-pointer_-fwrapv_-Qunused-arguments_-fPIC_-fPIE2024042620240425
202235864 0 018973 804 960refgcc_-march=native_-mtune=native_-O3_-fomit-frame-pointer_-fwrapv_-fPIC_-fPIE2024042620240425
203685140 0 015479 788 928opt64gcc_-march=native_-mtune=native_-Os_-fomit-frame-pointer_-fwrapv_-fPIC_-fPIE2024042620240425
206505124 0 016980 812 960opt64gcc_-march=native_-mtune=native_-O2_-fomit-frame-pointer_-fwrapv_-fPIC_-fPIE2024042620240425
206695124 0 018292 812 960opt64gcc_-march=native_-mtune=native_-O3_-fomit-frame-pointer_-fwrapv_-fPIC_-fPIE2024042620240425
214254539 0 018107 844 928refclang_-march=native_-O2_-fomit-frame-pointer_-fwrapv_-Qunused-arguments_-fPIC_-fPIE2024042620240425
214314539 0 018483 844 928refclang_-march=native_-O3_-fomit-frame-pointer_-fwrapv_-Qunused-arguments_-fPIC_-fPIE2024042620240425
221935727 0 017059 804 960opt64gcc_-march=native_-mtune=native_-O_-fomit-frame-pointer_-fwrapv_-fPIC_-fPIE2024042620240425
223265425 0 017229 804 960refgcc_-march=native_-mtune=native_-O2_-fomit-frame-pointer_-fwrapv_-fPIC_-fPIE2024042620240425
232286232 0 020163 844 928opt32clang_-march=native_-O3_-fomit-frame-pointer_-fwrapv_-Qunused-arguments_-fPIC_-fPIE2024042620240425
232876232 0 019787 844 928opt32clang_-march=native_-O2_-fomit-frame-pointer_-fwrapv_-Qunused-arguments_-fPIC_-fPIE2024042620240425
233755314 0 016580 796 960refgcc_-march=native_-mtune=native_-O_-fomit-frame-pointer_-fwrapv_-fPIC_-fPIE2024042620240425
23394901 0 014068 812 960opt64_lowsizegcc_-march=native_-mtune=native_-O3_-fomit-frame-pointer_-fwrapv_-fPIC_-fPIE2024042620240425
234806216 0 017453 836 960opt32clang_-march=native_-Os_-fomit-frame-pointer_-fwrapv_-Qunused-arguments_-fPIC_-fPIE2024042620240425
23619892 0 012756 812 960opt64_lowsizegcc_-march=native_-mtune=native_-O2_-fomit-frame-pointer_-fwrapv_-fPIC_-fPIE2024042620240425
24172731 0 011973 836 960opt64_lowsizeclang_-march=native_-Os_-fomit-frame-pointer_-fwrapv_-Qunused-arguments_-fPIC_-fPIE2024042620240425
241794114 0 017011 844 896refclang_-mcpu=native_-O3_-fomit-frame-pointer_-fwrapv_-Qunused-arguments_-fPIC_-fPIE2024042620240425
24218765 0 014715 844 928opt64_lowsizeclang_-march=native_-O3_-fomit-frame-pointer_-fwrapv_-Qunused-arguments_-fPIC_-fPIE2024042620240425
24305677 0 011211 844 896opt64_lowsizeclang_-march=native_-O_-fomit-frame-pointer_-fwrapv_-Qunused-arguments_-fPIC_-fPIE2024042620240425
244186071 0 016563 844 896opt32clang_-march=native_-O_-fomit-frame-pointer_-fwrapv_-Qunused-arguments_-fPIC_-fPIE2024042620240425
244463891 0 014403 844 896refclang_-march=native_-O_-fomit-frame-pointer_-fwrapv_-Qunused-arguments_-fPIC_-fPIE2024042620240425
246346804 0 019972 812 960opt32gcc_-march=native_-mtune=native_-O3_-fomit-frame-pointer_-fwrapv_-fPIC_-fPIE2024042620240425
246356804 0 018660 812 960opt32gcc_-march=native_-mtune=native_-O2_-fomit-frame-pointer_-fwrapv_-fPIC_-fPIE2024042620240425
24878864 0 011191 788 928opt64_lowsizegcc_-march=native_-mtune=native_-Os_-fomit-frame-pointer_-fwrapv_-fPIC_-fPIE2024042620240425
249725001 0 017891 844 896opt64clang_-mcpu=native_-O3_-fomit-frame-pointer_-fwrapv_-Qunused-arguments_-fPIC_-fPIE2024042620240425
253096193 0 016535 788 928opt32gcc_-march=native_-mtune=native_-Os_-fomit-frame-pointer_-fwrapv_-fPIC_-fPIE2024042620240425
256593984 0 015229 836 960refclang_-march=native_-Os_-fomit-frame-pointer_-fwrapv_-Qunused-arguments_-fPIC_-fPIE2024042620240425
259011401 0 012707 804 960opt64_lowsizegcc_-march=native_-mtune=native_-O_-fomit-frame-pointer_-fwrapv_-fPIC_-fPIE2024042620240425
261947317 0 018643 804 960opt32gcc_-march=native_-mtune=native_-O_-fomit-frame-pointer_-fwrapv_-fPIC_-fPIE2024042620240425
264166536 0 019411 844 896opt32clang_-mcpu=native_-O3_-fomit-frame-pointer_-fwrapv_-Qunused-arguments_-fPIC_-fPIE2024042620240425
26527797 0 013707 844 896opt64_lowsizeclang_-mcpu=native_-O3_-fomit-frame-pointer_-fwrapv_-Qunused-arguments_-fPIC_-fPIE2024042620240425
27250765 0 014339 844 928opt64_lowsizeclang_-march=native_-O2_-fomit-frame-pointer_-fwrapv_-Qunused-arguments_-fPIC_-fPIE2024042620240425
27293723 0 011259 844 896opt32_lowsizeclang_-march=native_-O_-fomit-frame-pointer_-fwrapv_-Qunused-arguments_-fPIC_-fPIE2024042620240425
27699957 0 012820 812 960opt32_lowsizegcc_-march=native_-mtune=native_-O2_-fomit-frame-pointer_-fwrapv_-fPIC_-fPIE2024042620240425
27718957 0 014132 812 960opt32_lowsizegcc_-march=native_-mtune=native_-O3_-fomit-frame-pointer_-fwrapv_-fPIC_-fPIE2024042620240425
28028916 0 011231 788 928opt32_lowsizegcc_-march=native_-mtune=native_-Os_-fomit-frame-pointer_-fwrapv_-fPIC_-fPIE2024042620240425
292641466 0 012771 804 960opt32_lowsizegcc_-march=native_-mtune=native_-O_-fomit-frame-pointer_-fwrapv_-fPIC_-fPIE2024042620240425
30157837 0 013747 844 896opt32_lowsizeclang_-mcpu=native_-O3_-fomit-frame-pointer_-fwrapv_-Qunused-arguments_-fPIC_-fPIE2024042620240425
34971980 0 011248 780 928refgcc_-march=native_-mtune=native_-Os_-fomit-frame-pointer_-fwrapv_-fPIC_-fPIE2024042620240425
440058462 0 018971 844 896bi32clang_-march=native_-O_-fomit-frame-pointer_-fwrapv_-Qunused-arguments_-fPIC_-fPIE2024042620240425
454748899 0 022795 844 928bi32clang_-march=native_-O3_-fomit-frame-pointer_-fwrapv_-Qunused-arguments_-fPIC_-fPIE2024042620240425
456348482 0 022003 844 928bi32clang_-march=native_-O2_-fomit-frame-pointer_-fwrapv_-Qunused-arguments_-fPIC_-fPIE2024042620240425
460099054 0 020836 812 960bi32gcc_-march=native_-mtune=native_-O2_-fomit-frame-pointer_-fwrapv_-fPIC_-fPIE2024042620240425
467928328 0 019525 836 960bi32clang_-march=native_-Os_-fomit-frame-pointer_-fwrapv_-Qunused-arguments_-fPIC_-fPIE2024042620240425
474688513 0 021395 844 896bi32clang_-mcpu=native_-O3_-fomit-frame-pointer_-fwrapv_-Qunused-arguments_-fPIC_-fPIE2024042620240425
475579062 0 019303 788 928bi32gcc_-march=native_-mtune=native_-Os_-fomit-frame-pointer_-fwrapv_-fPIC_-fPIE2024042620240425
478199557 0 020803 804 960bi32gcc_-march=native_-mtune=native_-O_-fomit-frame-pointer_-fwrapv_-fPIC_-fPIE2024042620240425
517972978 0 016547 844 928bi32_lowregclang_-march=native_-O2_-fomit-frame-pointer_-fwrapv_-Qunused-arguments_-fPIC_-fPIE2024042620240425
518103268 0 015100 812 960bi32_lowreggcc_-march=native_-mtune=native_-O2_-fomit-frame-pointer_-fwrapv_-fPIC_-fPIE2024042620240425
519432978 0 016923 844 928bi32_lowregclang_-march=native_-O3_-fomit-frame-pointer_-fwrapv_-Qunused-arguments_-fPIC_-fPIE2024042620240425
534922945 0 014197 836 960bi32_lowregclang_-march=native_-Os_-fomit-frame-pointer_-fwrapv_-Qunused-arguments_-fPIC_-fPIE2024042620240425
548271515 0 015475 844 928bi32_lowsizeclang_-march=native_-O3_-fomit-frame-pointer_-fwrapv_-Qunused-arguments_-fPIC_-fPIE2024042620240425
548421515 0 015099 844 928bi32_lowsizeclang_-march=native_-O2_-fomit-frame-pointer_-fwrapv_-Qunused-arguments_-fPIC_-fPIE2024042620240425
552652985 0 015899 844 896bi32_lowregclang_-mcpu=native_-O3_-fomit-frame-pointer_-fwrapv_-Qunused-arguments_-fPIC_-fPIE2024042620240425
559401726 0 013516 812 960bi32_lowsizegcc_-march=native_-mtune=native_-O2_-fomit-frame-pointer_-fwrapv_-fPIC_-fPIE2024042620240425
559851436 0 012685 836 960bi32_lowsizeclang_-march=native_-Os_-fomit-frame-pointer_-fwrapv_-Qunused-arguments_-fPIC_-fPIE2024042620240425
589601514 0 014427 844 896bi32_lowsizeclang_-mcpu=native_-O3_-fomit-frame-pointer_-fwrapv_-Qunused-arguments_-fPIC_-fPIE2024042620240425
5955310301 0 023380 812 960bi32gcc_-march=native_-mtune=native_-O3_-fomit-frame-pointer_-fwrapv_-fPIC_-fPIE2024042620240425
607912900 0 013215 788 928bi32_lowreggcc_-march=native_-mtune=native_-Os_-fomit-frame-pointer_-fwrapv_-fPIC_-fPIE2024042620240425
608951686 0 011951 788 928bi32_lowsizegcc_-march=native_-mtune=native_-Os_-fomit-frame-pointer_-fwrapv_-fPIC_-fPIE2024042620240425
612322882 0 013403 844 896bi32_lowregclang_-march=native_-O_-fomit-frame-pointer_-fwrapv_-Qunused-arguments_-fPIC_-fPIE2024042620240425
617243609 0 014907 804 960bi32_lowreggcc_-march=native_-mtune=native_-O_-fomit-frame-pointer_-fwrapv_-fPIC_-fPIE2024042620240425
617301468 0 011979 844 896bi32_lowsizeclang_-march=native_-O_-fomit-frame-pointer_-fwrapv_-Qunused-arguments_-fPIC_-fPIE2024042620240425
619161929 0 013187 804 960bi32_lowsizegcc_-march=native_-mtune=native_-O_-fomit-frame-pointer_-fwrapv_-fPIC_-fPIE2024042620240425
637473518 0 016660 812 960bi32_lowreggcc_-march=native_-mtune=native_-O3_-fomit-frame-pointer_-fwrapv_-fPIC_-fPIE2024042620240425
645041804 0 014892 812 960bi32_lowsizegcc_-march=native_-mtune=native_-O3_-fomit-frame-pointer_-fwrapv_-fPIC_-fPIE2024042620240425
786581020 0 014979 844 928opt32_lowsizeclang_-march=native_-O3_-fomit-frame-pointer_-fwrapv_-Qunused-arguments_-fPIC_-fPIE2024042620240425
78845982 0 012253 836 960opt32_lowsizeclang_-march=native_-Os_-fomit-frame-pointer_-fwrapv_-Qunused-arguments_-fPIC_-fPIE2024042620240425
794171020 0 014603 844 928opt32_lowsizeclang_-march=native_-O2_-fomit-frame-pointer_-fwrapv_-Qunused-arguments_-fPIC_-fPIE2024042620240425
1770533187 0 016747 844 928opt8_lowsizeclang_-march=native_-O2_-fomit-frame-pointer_-fwrapv_-Qunused-arguments_-fPIC_-fPIE2024042620240425
1776873503 0 016979 844 928opt8clang_-march=native_-O2_-fomit-frame-pointer_-fwrapv_-Qunused-arguments_-fPIC_-fPIE2024042620240425
1919882384 0 013597 836 960opt8clang_-march=native_-Os_-fomit-frame-pointer_-fwrapv_-Qunused-arguments_-fPIC_-fPIE2024042620240425
1923512357 0 013589 836 960opt8_lowsizeclang_-march=native_-Os_-fomit-frame-pointer_-fwrapv_-Qunused-arguments_-fPIC_-fPIE2024042620240425
1977573942 0 016451 844 896bi8clang_-mcpu=native_-O3_-fomit-frame-pointer_-fwrapv_-Qunused-arguments_-fPIC_-fPIE2024042620240425
2042223840 0 017003 844 928bi8clang_-march=native_-O2_-fomit-frame-pointer_-fwrapv_-Qunused-arguments_-fPIC_-fPIE2024042620240425
2051473840 0 017379 844 928bi8clang_-march=native_-O3_-fomit-frame-pointer_-fwrapv_-Qunused-arguments_-fPIC_-fPIE2024042620240425
2097033427 0 013571 844 896bi8clang_-march=native_-O_-fomit-frame-pointer_-fwrapv_-Qunused-arguments_-fPIC_-fPIE2024042620240425
2158973471 0 014317 836 960bi8clang_-march=native_-Os_-fomit-frame-pointer_-fwrapv_-Qunused-arguments_-fPIC_-fPIE2024042620240425
2292143677 0 016388 812 960bi8gcc_-march=native_-mtune=native_-O3_-fomit-frame-pointer_-fwrapv_-fPIC_-fPIE2024042620240425
2594884432 0 015828 812 960bi8gcc_-march=native_-mtune=native_-O2_-fomit-frame-pointer_-fwrapv_-fPIC_-fPIE2024042620240425
2601744771 0 015651 804 960bi8gcc_-march=native_-mtune=native_-O_-fomit-frame-pointer_-fwrapv_-fPIC_-fPIE2024042620240425
2746914740 0 017619 844 896opt8clang_-mcpu=native_-O3_-fomit-frame-pointer_-fwrapv_-Qunused-arguments_-fPIC_-fPIE2024042620240425
2769554214 0 017107 844 896opt8_lowsizeclang_-mcpu=native_-O3_-fomit-frame-pointer_-fwrapv_-Qunused-arguments_-fPIC_-fPIE2024042620240425
2807154038 0 013903 788 928bi8gcc_-march=native_-mtune=native_-Os_-fomit-frame-pointer_-fwrapv_-fPIC_-fPIE2024042620240425
2885025266 0 019091 844 928opt8clang_-march=native_-O3_-fomit-frame-pointer_-fwrapv_-Qunused-arguments_-fPIC_-fPIE2024042620240425
2885434568 0 018499 844 928opt8_lowsizeclang_-march=native_-O3_-fomit-frame-pointer_-fwrapv_-Qunused-arguments_-fPIC_-fPIE2024042620240425
3114082166 0 012675 844 896opt8_lowsizeclang_-march=native_-O_-fomit-frame-pointer_-fwrapv_-Qunused-arguments_-fPIC_-fPIE2024042620240425
3141452452 0 012971 844 896opt8clang_-march=native_-O_-fomit-frame-pointer_-fwrapv_-Qunused-arguments_-fPIC_-fPIE2024042620240425
4653104662 0 017741 804 960opt8gcc_-march=native_-mtune=native_-O3_-fomit-frame-pointer_-fwrapv_-fPIC_-fPIE2024042620240425
4667394114 0 017141 804 960opt8_lowsizegcc_-march=native_-mtune=native_-O3_-fomit-frame-pointer_-fwrapv_-fPIC_-fPIE2024042620240425
5054074050 0 015292 796 960opt8gcc_-march=native_-mtune=native_-O_-fomit-frame-pointer_-fwrapv_-fPIC_-fPIE2024042620240425
5057024040 0 015765 804 960opt8_lowsizegcc_-march=native_-mtune=native_-O2_-fomit-frame-pointer_-fwrapv_-fPIC_-fPIE2024042620240425
5101244191 0 015965 804 960opt8gcc_-march=native_-mtune=native_-O2_-fomit-frame-pointer_-fwrapv_-fPIC_-fPIE2024042620240425
5159113963 0 015124 796 960opt8_lowsizegcc_-march=native_-mtune=native_-O_-fomit-frame-pointer_-fwrapv_-fPIC_-fPIE2024042620240425
5855563874 0 014048 780 928opt8_lowsizegcc_-march=native_-mtune=native_-Os_-fomit-frame-pointer_-fwrapv_-fPIC_-fPIE2024042620240425
6001643872 0 014120 780 928opt8gcc_-march=native_-mtune=native_-Os_-fomit-frame-pointer_-fwrapv_-fPIC_-fPIE2024042620240425

Compiler output

Implementation: T:asm_esp32
Security model: timingleaks
Compiler: clang -march=native -O2 -fomit-frame-pointer -fwrapv -Qunused-arguments -fPIC -fPIE
ascon.S: ascon.S:1:10: fatal error: 'xtensa/coreasm.h' file not found
ascon.S: #include <xtensa/coreasm.h>
ascon.S: ^~~~~~~~~~~~~~~~~~
ascon.S: 1 error generated.

Number of similar (compiler,implementation) pairs: 5, namely:
CompilerImplementations
clang -march=native -O2 -fomit-frame-pointer -fwrapv -Qunused-arguments -fPIC -fPIE T:asm_esp32
clang -march=native -O3 -fomit-frame-pointer -fwrapv -Qunused-arguments -fPIC -fPIE T:asm_esp32
clang -march=native -O -fomit-frame-pointer -fwrapv -Qunused-arguments -fPIC -fPIE T:asm_esp32
clang -march=native -Os -fomit-frame-pointer -fwrapv -Qunused-arguments -fPIC -fPIE T:asm_esp32
clang -mcpu=native -O3 -fomit-frame-pointer -fwrapv -Qunused-arguments -fPIC -fPIE T:asm_esp32

Compiler output

Implementation: T:asm_esp32
Security model: timingleaks
Compiler: gcc -march=native -mtune=native -O2 -fomit-frame-pointer -fwrapv -fPIC -fPIE
ascon.S: ascon.S:1:10: fatal error: xtensa/coreasm.h: No such file or directory
ascon.S: 1 | #include <xtensa/coreasm.h>
ascon.S: | ^~~~~~~~~~~~~~~~~~
ascon.S: compilation terminated.

Number of similar (compiler,implementation) pairs: 4, namely:
CompilerImplementations
gcc -march=native -mtune=native -O2 -fomit-frame-pointer -fwrapv -fPIC -fPIE T:asm_esp32
gcc -march=native -mtune=native -O3 -fomit-frame-pointer -fwrapv -fPIC -fPIE T:asm_esp32
gcc -march=native -mtune=native -O -fomit-frame-pointer -fwrapv -fPIC -fPIE T:asm_esp32
gcc -march=native -mtune=native -Os -fomit-frame-pointer -fwrapv -fPIC -fPIE T:asm_esp32

Compiler output

Implementation: avr
Security model: constbranchindex
Compiler: clang -march=native -O2 -fomit-frame-pointer -fwrapv -Qunused-arguments -fPIC -fPIE
permutations.S: permutations.S:29:10: fatal error: 'avr/io.h' file not found
permutations.S: #include "avr/io.h"
permutations.S: ^~~~~~~~~~
permutations.S: 1 error generated.

Number of similar (compiler,implementation) pairs: 10, namely:
CompilerImplementations
clang -march=native -O2 -fomit-frame-pointer -fwrapv -Qunused-arguments -fPIC -fPIE avr
clang -march=native -O3 -fomit-frame-pointer -fwrapv -Qunused-arguments -fPIC -fPIE avr
clang -march=native -O -fomit-frame-pointer -fwrapv -Qunused-arguments -fPIC -fPIE avr
clang -march=native -Os -fomit-frame-pointer -fwrapv -Qunused-arguments -fPIC -fPIE avr
clang -mcpu=native -O3 -fomit-frame-pointer -fwrapv -Qunused-arguments -fPIC -fPIE avr
clang -march=native -O2 -fomit-frame-pointer -fwrapv -Qunused-arguments -fPIC -fPIE avr_lowsize
clang -march=native -O3 -fomit-frame-pointer -fwrapv -Qunused-arguments -fPIC -fPIE avr_lowsize
clang -march=native -O -fomit-frame-pointer -fwrapv -Qunused-arguments -fPIC -fPIE avr_lowsize
clang -march=native -Os -fomit-frame-pointer -fwrapv -Qunused-arguments -fPIC -fPIE avr_lowsize
clang -mcpu=native -O3 -fomit-frame-pointer -fwrapv -Qunused-arguments -fPIC -fPIE avr_lowsize

Compiler output

Implementation: avr
Security model: constbranchindex
Compiler: gcc -march=native -mtune=native -O2 -fomit-frame-pointer -fwrapv -fPIC -fPIE
permutations.S: permutations.S:29:10: fatal error: avr/io.h: No such file or directory
permutations.S: 29 | #include "avr/io.h"
permutations.S: | ^~~~~~~~~~
permutations.S: compilation terminated.

Number of similar (compiler,implementation) pairs: 8, namely:
CompilerImplementations
gcc -march=native -mtune=native -O2 -fomit-frame-pointer -fwrapv -fPIC -fPIE avr
gcc -march=native -mtune=native -O3 -fomit-frame-pointer -fwrapv -fPIC -fPIE avr
gcc -march=native -mtune=native -O -fomit-frame-pointer -fwrapv -fPIC -fPIE avr
gcc -march=native -mtune=native -Os -fomit-frame-pointer -fwrapv -fPIC -fPIE avr
gcc -march=native -mtune=native -O2 -fomit-frame-pointer -fwrapv -fPIC -fPIE avr_lowsize
gcc -march=native -mtune=native -O3 -fomit-frame-pointer -fwrapv -fPIC -fPIE avr_lowsize
gcc -march=native -mtune=native -O -fomit-frame-pointer -fwrapv -fPIC -fPIE avr_lowsize
gcc -march=native -mtune=native -Os -fomit-frame-pointer -fwrapv -fPIC -fPIE avr_lowsize

Compiler output

Implementation: T:esp32
Security model: timingleaks
Compiler: clang -march=native -O2 -fomit-frame-pointer -fwrapv -Qunused-arguments -fPIC -fPIE
try.c: /usr/bin/ld: /tmp/try-small-97b4ac.o: in function `doit':
try.c: try-small.c:(.text+0x...): undefined reference to `crypto_hash_asconxofav12_esp32_timingleaks'
try.c: /usr/bin/ld: /tmp/try-small-97b4ac.o: in function `test':
try.c: try-small.c:(.text+0x...): undefined reference to `crypto_hash_asconxofav12_esp32_timingleaks'
try.c: /usr/bin/ld: try-small.c:(.text+0x...): undefined reference to `crypto_hash_asconxofav12_esp32_timingleaks'
try.c: /usr/bin/ld: try-small.c:(.text+0x...): undefined reference to `crypto_hash_asconxofav12_esp32_timingleaks'
try.c: clang: error: linker command failed with exit code 1 (use -v to see invocation)

Number of similar (compiler,implementation) pairs: 1, namely:
CompilerImplementations
clang -march=native -O2 -fomit-frame-pointer -fwrapv -Qunused-arguments -fPIC -fPIE T:esp32

Compiler output

Implementation: T:esp32
Security model: timingleaks
Compiler: clang -march=native -O3 -fomit-frame-pointer -fwrapv -Qunused-arguments -fPIC -fPIE
try.c: /usr/bin/ld: /tmp/try-small-e28f71.o: in function `doit':
try.c: try-small.c:(.text+0x...): undefined reference to `crypto_hash_asconxofav12_esp32_timingleaks'
try.c: /usr/bin/ld: /tmp/try-small-e28f71.o: in function `test':
try.c: try-small.c:(.text+0x...): undefined reference to `crypto_hash_asconxofav12_esp32_timingleaks'
try.c: /usr/bin/ld: try-small.c:(.text+0x...): undefined reference to `crypto_hash_asconxofav12_esp32_timingleaks'
try.c: /usr/bin/ld: try-small.c:(.text+0x...): undefined reference to `crypto_hash_asconxofav12_esp32_timingleaks'
try.c: clang: error: linker command failed with exit code 1 (use -v to see invocation)

Number of similar (compiler,implementation) pairs: 1, namely:
CompilerImplementations
clang -march=native -O3 -fomit-frame-pointer -fwrapv -Qunused-arguments -fPIC -fPIE T:esp32

Compiler output

Implementation: T:esp32
Security model: timingleaks
Compiler: clang -march=native -O -fomit-frame-pointer -fwrapv -Qunused-arguments -fPIC -fPIE
try.c: /usr/bin/ld: /tmp/try-small-819007.o: in function `doit':
try.c: try-small.c:(.text+0x...): undefined reference to `crypto_hash_asconxofav12_esp32_timingleaks'
try.c: /usr/bin/ld: /tmp/try-small-819007.o: in function `test':
try.c: try-small.c:(.text+0x...): undefined reference to `crypto_hash_asconxofav12_esp32_timingleaks'
try.c: /usr/bin/ld: try-small.c:(.text+0x...): undefined reference to `crypto_hash_asconxofav12_esp32_timingleaks'
try.c: /usr/bin/ld: try-small.c:(.text+0x...): undefined reference to `crypto_hash_asconxofav12_esp32_timingleaks'
try.c: clang: error: linker command failed with exit code 1 (use -v to see invocation)

Number of similar (compiler,implementation) pairs: 1, namely:
CompilerImplementations
clang -march=native -O -fomit-frame-pointer -fwrapv -Qunused-arguments -fPIC -fPIE T:esp32

Compiler output

Implementation: T:esp32
Security model: timingleaks
Compiler: clang -march=native -Os -fomit-frame-pointer -fwrapv -Qunused-arguments -fPIC -fPIE
try.c: /usr/bin/ld: /tmp/try-small-b3b9f3.o: in function `doit':
try.c: try-small.c:(.text+0x...): undefined reference to `crypto_hash_asconxofav12_esp32_timingleaks'
try.c: /usr/bin/ld: /tmp/try-small-b3b9f3.o: in function `test':
try.c: try-small.c:(.text+0x...): undefined reference to `crypto_hash_asconxofav12_esp32_timingleaks'
try.c: /usr/bin/ld: try-small.c:(.text+0x...): undefined reference to `crypto_hash_asconxofav12_esp32_timingleaks'
try.c: /usr/bin/ld: try-small.c:(.text+0x...): undefined reference to `crypto_hash_asconxofav12_esp32_timingleaks'
try.c: clang: error: linker command failed with exit code 1 (use -v to see invocation)

Number of similar (compiler,implementation) pairs: 1, namely:
CompilerImplementations
clang -march=native -Os -fomit-frame-pointer -fwrapv -Qunused-arguments -fPIC -fPIE T:esp32

Compiler output

Implementation: T:esp32
Security model: timingleaks
Compiler: clang -mcpu=native -O3 -fomit-frame-pointer -fwrapv -Qunused-arguments -fPIC -fPIE
try.c: /usr/bin/ld: /tmp/try-small-042e96.o: in function `doit':
try.c: try-small.c:(.text+0x...): undefined reference to `crypto_hash_asconxofav12_esp32_timingleaks'
try.c: /usr/bin/ld: /tmp/try-small-042e96.o: in function `test':
try.c: try-small.c:(.text+0x...): undefined reference to `crypto_hash_asconxofav12_esp32_timingleaks'
try.c: /usr/bin/ld: try-small.c:(.text+0x...): undefined reference to `crypto_hash_asconxofav12_esp32_timingleaks'
try.c: /usr/bin/ld: try-small.c:(.text+0x...): undefined reference to `crypto_hash_asconxofav12_esp32_timingleaks'
try.c: clang: error: linker command failed with exit code 1 (use -v to see invocation)

Number of similar (compiler,implementation) pairs: 1, namely:
CompilerImplementations
clang -mcpu=native -O3 -fomit-frame-pointer -fwrapv -Qunused-arguments -fPIC -fPIE T:esp32

Compiler output

Implementation: T:esp32
Security model: timingleaks
Compiler: gcc -march=native -mtune=native -O2 -fomit-frame-pointer -fwrapv -fPIC -fPIE
try.c: /usr/bin/ld: /tmp/cczMIKJ6.o: in function `test':
try.c: try-small.c:(.text+0x...): undefined reference to `crypto_hash_asconxofav12_esp32_timingleaks'
try.c: /usr/bin/ld: try-small.c:(.text+0x...): undefined reference to `crypto_hash_asconxofav12_esp32_timingleaks'
try.c: /usr/bin/ld: try-small.c:(.text+0x...): undefined reference to `crypto_hash_asconxofav12_esp32_timingleaks'
try.c: /usr/bin/ld: /tmp/cczMIKJ6.o: in function `doit':
try.c: try-small.c:(.text+0x...): undefined reference to `crypto_hash_asconxofav12_esp32_timingleaks'
try.c: collect2: error: ld returned 1 exit status

Number of similar (compiler,implementation) pairs: 1, namely:
CompilerImplementations
gcc -march=native -mtune=native -O2 -fomit-frame-pointer -fwrapv -fPIC -fPIE T:esp32

Compiler output

Implementation: T:esp32
Security model: timingleaks
Compiler: gcc -march=native -mtune=native -O3 -fomit-frame-pointer -fwrapv -fPIC -fPIE
try.c: /usr/bin/ld: /tmp/ccaSciJd.o: in function `test':
try.c: try-small.c:(.text+0x...): undefined reference to `crypto_hash_asconxofav12_esp32_timingleaks'
try.c: /usr/bin/ld: try-small.c:(.text+0x...): undefined reference to `crypto_hash_asconxofav12_esp32_timingleaks'
try.c: /usr/bin/ld: try-small.c:(.text+0x...): undefined reference to `crypto_hash_asconxofav12_esp32_timingleaks'
try.c: /usr/bin/ld: /tmp/ccaSciJd.o: in function `doit':
try.c: try-small.c:(.text+0x...): undefined reference to `crypto_hash_asconxofav12_esp32_timingleaks'
try.c: collect2: error: ld returned 1 exit status

Number of similar (compiler,implementation) pairs: 1, namely:
CompilerImplementations
gcc -march=native -mtune=native -O3 -fomit-frame-pointer -fwrapv -fPIC -fPIE T:esp32

Compiler output

Implementation: T:esp32
Security model: timingleaks
Compiler: gcc -march=native -mtune=native -O -fomit-frame-pointer -fwrapv -fPIC -fPIE
try.c: /usr/bin/ld: /tmp/ccKnkMib.o: in function `doit':
try.c: try-small.c:(.text+0x...): undefined reference to `crypto_hash_asconxofav12_esp32_timingleaks'
try.c: /usr/bin/ld: /tmp/ccKnkMib.o: in function `test':
try.c: try-small.c:(.text+0x...): undefined reference to `crypto_hash_asconxofav12_esp32_timingleaks'
try.c: /usr/bin/ld: try-small.c:(.text+0x...): undefined reference to `crypto_hash_asconxofav12_esp32_timingleaks'
try.c: /usr/bin/ld: try-small.c:(.text+0x...): undefined reference to `crypto_hash_asconxofav12_esp32_timingleaks'
try.c: collect2: error: ld returned 1 exit status

Number of similar (compiler,implementation) pairs: 1, namely:
CompilerImplementations
gcc -march=native -mtune=native -O -fomit-frame-pointer -fwrapv -fPIC -fPIE T:esp32

Compiler output

Implementation: T:esp32
Security model: timingleaks
Compiler: gcc -march=native -mtune=native -Os -fomit-frame-pointer -fwrapv -fPIC -fPIE
try.c: /usr/bin/ld: /tmp/cc6oAci7.o: in function `test':
try.c: try-small.c:(.text+0x...): undefined reference to `crypto_hash_asconxofav12_esp32_timingleaks'
try.c: /usr/bin/ld: try-small.c:(.text+0x...): undefined reference to `crypto_hash_asconxofav12_esp32_timingleaks'
try.c: /usr/bin/ld: try-small.c:(.text+0x...): undefined reference to `crypto_hash_asconxofav12_esp32_timingleaks'
try.c: /usr/bin/ld: /tmp/cc6oAci7.o: in function `doit':
try.c: try-small.c:(.text+0x...): undefined reference to `crypto_hash_asconxofav12_esp32_timingleaks'
try.c: collect2: error: ld returned 1 exit status

Number of similar (compiler,implementation) pairs: 1, namely:
CompilerImplementations
gcc -march=native -mtune=native -Os -fomit-frame-pointer -fwrapv -fPIC -fPIE T:esp32