Implementation notes: amd64, rumba7, crypto_aead/omdsha256k256n248tau256v1

Computer: rumba7
Microarchitecture: amd64; Zen (800f11)
Architecture: amd64
CPU ID: AuthenticAMD-00800f11-178bfbff
SUPERCOP version: 20240625
Operation: crypto_aead
Primitive: omdsha256k256n248tau256v1
TimeObject sizeTest sizeImplementationCompilerBenchmark dateSUPERCOP version
14968815438 0 038996 812 1088T:refgcc_-march=native_-mtune=native_-O3_-fwrapv_-fPIC_-fPIE_-gdwarf-4_-Wall2024062620240625
15605210722 0 033627 844 1056T:refclang_-march=native_-O2_-fwrapv_-Qunused-arguments_-fPIC_-fPIE_-gdwarf-4_-Wall2024062620240625
16148510275 0 033499 844 1056T:refclang_-march=native_-O3_-fwrapv_-Qunused-arguments_-fPIC_-fPIE_-gdwarf-4_-Wall2024062620240625
1775474537 0 025253 836 1088T:refclang_-march=native_-Os_-fwrapv_-Qunused-arguments_-fPIC_-fPIE_-gdwarf-4_-Wall2024062620240625
1812226795 0 029100 812 1088T:refgcc_-march=native_-mtune=native_-O2_-fwrapv_-fPIC_-fPIE_-gdwarf-4_-Wall2024062620240625
18291411906 0 034227 844 1024T:refclang_-mcpu=native_-O3_-fwrapv_-Qunused-arguments_-fPIC_-fPIE_-gdwarf-4_-Wall2024062620240625
1880505633 0 025555 844 1024T:refclang_-march=native_-O_-fwrapv_-Qunused-arguments_-fPIC_-fPIE_-gdwarf-4_-Wall2024062620240625
1963066234 0 027531 804 1088T:refgcc_-march=native_-mtune=native_-O_-fwrapv_-fPIC_-fPIE_-gdwarf-4_-Wall2024062620240625
2087534607 0 024175 788 1056T:refgcc_-march=native_-mtune=native_-Os_-fwrapv_-fPIC_-fPIE_-gdwarf-4_-Wall2024062620240625

Compiler output


try.c: /usr/bin/ld: libcrypto_aead_omdsha256k256n248tau256v1.a(omdsha256.o):.../supercop-data/rumba7/amd64/try/c/clang_-march=native_-O2_-fwrapv_-Qunused-arguments_-fPIC_-fPIE_-gdwarf-4_-Wall/timingleaks/crypto_aead/omdsha256k256n248tau256v1/avx1/work/./omdsha256.h:137: multiple definition of `Hash'; libcrypto_aead_omdsha256k256n248tau256v1.a(encrypt.o):.../supercop-data/rumba7/amd64/try/c/clang_-march=native_-O2_-fwrapv_-Qunused-arguments_-fPIC_-fPIE_-gdwarf-4_-Wall/timingleaks/crypto_aead/omdsha256k256n248tau256v1/avx1/work/./omdsha256.h:137: first defined here
try.c: clang: error: linker command failed with exit code 1 (use -v to see invocation)

Number of similar (implementation,compiler) pairs: 1, namely:
ImplementationCompiler
T:avx1clang -march=native -O2 -fwrapv -Qunused-arguments -fPIC -fPIE -gdwarf-4 -Wall (Ubuntu_Clang_14.0.0)

Compiler output


try.c: /usr/bin/ld: libcrypto_aead_omdsha256k256n248tau256v1.a(omdsha256.o):.../supercop-data/rumba7/amd64/try/c/clang_-march=native_-O3_-fwrapv_-Qunused-arguments_-fPIC_-fPIE_-gdwarf-4_-Wall/timingleaks/crypto_aead/omdsha256k256n248tau256v1/avx1/work/./omdsha256.h:137: multiple definition of `Hash'; libcrypto_aead_omdsha256k256n248tau256v1.a(encrypt.o):.../supercop-data/rumba7/amd64/try/c/clang_-march=native_-O3_-fwrapv_-Qunused-arguments_-fPIC_-fPIE_-gdwarf-4_-Wall/timingleaks/crypto_aead/omdsha256k256n248tau256v1/avx1/work/./omdsha256.h:137: first defined here
try.c: clang: error: linker command failed with exit code 1 (use -v to see invocation)

Number of similar (implementation,compiler) pairs: 1, namely:
ImplementationCompiler
T:avx1clang -march=native -O3 -fwrapv -Qunused-arguments -fPIC -fPIE -gdwarf-4 -Wall (Ubuntu_Clang_14.0.0)

Compiler output


try.c: /usr/bin/ld: libcrypto_aead_omdsha256k256n248tau256v1.a(omdsha256.o):.../supercop-data/rumba7/amd64/try/c/clang_-march=native_-O_-fwrapv_-Qunused-arguments_-fPIC_-fPIE_-gdwarf-4_-Wall/timingleaks/crypto_aead/omdsha256k256n248tau256v1/avx1/work/./omdsha256.h:137: multiple definition of `Hash'; libcrypto_aead_omdsha256k256n248tau256v1.a(encrypt.o):.../supercop-data/rumba7/amd64/try/c/clang_-march=native_-O_-fwrapv_-Qunused-arguments_-fPIC_-fPIE_-gdwarf-4_-Wall/timingleaks/crypto_aead/omdsha256k256n248tau256v1/avx1/work/./omdsha256.h:137: first defined here
try.c: clang: error: linker command failed with exit code 1 (use -v to see invocation)

Number of similar (implementation,compiler) pairs: 1, namely:
ImplementationCompiler
T:avx1clang -march=native -O -fwrapv -Qunused-arguments -fPIC -fPIE -gdwarf-4 -Wall (Ubuntu_Clang_14.0.0)

Compiler output


try.c: /usr/bin/ld: libcrypto_aead_omdsha256k256n248tau256v1.a(omdsha256.o):.../supercop-data/rumba7/amd64/try/c/clang_-march=native_-Os_-fwrapv_-Qunused-arguments_-fPIC_-fPIE_-gdwarf-4_-Wall/timingleaks/crypto_aead/omdsha256k256n248tau256v1/avx1/work/./omdsha256.h:137: multiple definition of `Hash'; libcrypto_aead_omdsha256k256n248tau256v1.a(encrypt.o):.../supercop-data/rumba7/amd64/try/c/clang_-march=native_-Os_-fwrapv_-Qunused-arguments_-fPIC_-fPIE_-gdwarf-4_-Wall/timingleaks/crypto_aead/omdsha256k256n248tau256v1/avx1/work/./omdsha256.h:137: first defined here
try.c: clang: error: linker command failed with exit code 1 (use -v to see invocation)

Number of similar (implementation,compiler) pairs: 1, namely:
ImplementationCompiler
T:avx1clang -march=native -Os -fwrapv -Qunused-arguments -fPIC -fPIE -gdwarf-4 -Wall (Ubuntu_Clang_14.0.0)

Compiler output


try.c: /usr/bin/ld: libcrypto_aead_omdsha256k256n248tau256v1.a(omdsha256.o):.../supercop-data/rumba7/amd64/try/c/clang_-mcpu=native_-O3_-fwrapv_-Qunused-arguments_-fPIC_-fPIE_-gdwarf-4_-Wall/timingleaks/crypto_aead/omdsha256k256n248tau256v1/avx1/work/./omdsha256.h:137: multiple definition of `Hash'; libcrypto_aead_omdsha256k256n248tau256v1.a(encrypt.o):.../supercop-data/rumba7/amd64/try/c/clang_-mcpu=native_-O3_-fwrapv_-Qunused-arguments_-fPIC_-fPIE_-gdwarf-4_-Wall/timingleaks/crypto_aead/omdsha256k256n248tau256v1/avx1/work/./omdsha256.h:137: first defined here
try.c: clang: error: linker command failed with exit code 1 (use -v to see invocation)

Number of similar (implementation,compiler) pairs: 1, namely:
ImplementationCompiler
T:avx1clang -mcpu=native -O3 -fwrapv -Qunused-arguments -fPIC -fPIE -gdwarf-4 -Wall (Ubuntu_Clang_14.0.0)

Compiler output


encrypt.c: /tmp/ccPsP9Iz.s: Assembler messages:
encrypt.c: /tmp/ccPsP9Iz.s:922: Warning: dwarf line number information for .data ignored
encrypt.c: /tmp/ccPsP9Iz.s:924: Warning: dwarf line number information for .data ignored
encrypt.c: /tmp/ccPsP9Iz.s:926: Warning: dwarf line number information for .data ignored
encrypt.c: /tmp/ccPsP9Iz.s:927: Warning: dwarf line number information for .data ignored
encrypt.c: /tmp/ccPsP9Iz.s:928: Warning: dwarf line number information for .data ignored
encrypt.c: /tmp/ccPsP9Iz.s:939: Warning: dwarf line number information for .data ignored
encrypt.c: /tmp/ccPsP9Iz.s:946: Warning: dwarf line number information for .data ignored
encrypt.c: /tmp/ccPsP9Iz.s:949: Warning: dwarf line number information for .data ignored
encrypt.c: /tmp/ccPsP9Iz.s:950: Warning: dwarf line number information for .data ignored
encrypt.c: /tmp/ccPsP9Iz.s:957: Warning: dwarf line number information for .data ignored
encrypt.c: /tmp/ccPsP9Iz.s:958: Warning: dwarf line number information for .data ignored
encrypt.c: /tmp/ccPsP9Iz.s:961: Warning: dwarf line number information for .data ignored
encrypt.c: /tmp/ccPsP9Iz.s:963: Warning: dwarf line number information for .data ignored
encrypt.c: /tmp/ccPsP9Iz.s:966: Warning: dwarf line number information for .data ignored
encrypt.c: /tmp/ccPsP9Iz.s:974: Warning: dwarf line number information for .data ignored
encrypt.c: /tmp/ccPsP9Iz.s:985: Warning: dwarf line number information for .data ignored
encrypt.c: /tmp/ccPsP9Iz.s:987: Warning: dwarf line number information for .data ignored
encrypt.c: /tmp/ccPsP9Iz.s:989: Warning: dwarf line number information for .data ignored
encrypt.c: /tmp/ccPsP9Iz.s:990: Warning: dwarf line number information for .data ignored
encrypt.c: /tmp/ccPsP9Iz.s:991: Warning: dwarf line number information for .data ignored
encrypt.c: /tmp/ccPsP9Iz.s:1002: Warning: dwarf line number information for .data ignored
encrypt.c: /tmp/ccPsP9Iz.s:1005: Warning: dwarf line number information for .data ignored
encrypt.c: /tmp/ccPsP9Iz.s:1008: Warning: dwarf line number information for .data ignored
encrypt.c: /tmp/ccPsP9Iz.s:1011: Warning: dwarf line number information for .data ignored
encrypt.c: ...

Number of similar (implementation,compiler) pairs: 1, namely:
ImplementationCompiler
T:avx1gcc -march=native -mtune=native -O2 -fwrapv -fPIC -fPIE -gdwarf-4 -Wall (11.4.0)

Compiler output


encrypt.c: /tmp/cccubO0A.s: Assembler messages:
encrypt.c: /tmp/cccubO0A.s:922: Warning: dwarf line number information for .data ignored
encrypt.c: /tmp/cccubO0A.s:924: Warning: dwarf line number information for .data ignored
encrypt.c: /tmp/cccubO0A.s:926: Warning: dwarf line number information for .data ignored
encrypt.c: /tmp/cccubO0A.s:927: Warning: dwarf line number information for .data ignored
encrypt.c: /tmp/cccubO0A.s:928: Warning: dwarf line number information for .data ignored
encrypt.c: /tmp/cccubO0A.s:939: Warning: dwarf line number information for .data ignored
encrypt.c: /tmp/cccubO0A.s:946: Warning: dwarf line number information for .data ignored
encrypt.c: /tmp/cccubO0A.s:949: Warning: dwarf line number information for .data ignored
encrypt.c: /tmp/cccubO0A.s:950: Warning: dwarf line number information for .data ignored
encrypt.c: /tmp/cccubO0A.s:957: Warning: dwarf line number information for .data ignored
encrypt.c: /tmp/cccubO0A.s:958: Warning: dwarf line number information for .data ignored
encrypt.c: /tmp/cccubO0A.s:961: Warning: dwarf line number information for .data ignored
encrypt.c: /tmp/cccubO0A.s:963: Warning: dwarf line number information for .data ignored
encrypt.c: /tmp/cccubO0A.s:966: Warning: dwarf line number information for .data ignored
encrypt.c: /tmp/cccubO0A.s:974: Warning: dwarf line number information for .data ignored
encrypt.c: /tmp/cccubO0A.s:985: Warning: dwarf line number information for .data ignored
encrypt.c: /tmp/cccubO0A.s:987: Warning: dwarf line number information for .data ignored
encrypt.c: /tmp/cccubO0A.s:989: Warning: dwarf line number information for .data ignored
encrypt.c: /tmp/cccubO0A.s:990: Warning: dwarf line number information for .data ignored
encrypt.c: /tmp/cccubO0A.s:991: Warning: dwarf line number information for .data ignored
encrypt.c: /tmp/cccubO0A.s:1002: Warning: dwarf line number information for .data ignored
encrypt.c: /tmp/cccubO0A.s:1005: Warning: dwarf line number information for .data ignored
encrypt.c: /tmp/cccubO0A.s:1008: Warning: dwarf line number information for .data ignored
encrypt.c: /tmp/cccubO0A.s:1011: Warning: dwarf line number information for .data ignored
encrypt.c: ...

Number of similar (implementation,compiler) pairs: 1, namely:
ImplementationCompiler
T:avx1gcc -march=native -mtune=native -O3 -fwrapv -fPIC -fPIE -gdwarf-4 -Wall (11.4.0)

Compiler output


encrypt.c: /tmp/ccPDVS3D.s: Assembler messages:
encrypt.c: /tmp/ccPDVS3D.s:921: Warning: dwarf line number information for .data ignored
encrypt.c: /tmp/ccPDVS3D.s:923: Warning: dwarf line number information for .data ignored
encrypt.c: /tmp/ccPDVS3D.s:935: Warning: dwarf line number information for .data ignored
encrypt.c: /tmp/ccPDVS3D.s:936: Warning: dwarf line number information for .data ignored
encrypt.c: /tmp/ccPDVS3D.s:937: Warning: dwarf line number information for .data ignored
encrypt.c: /tmp/ccPDVS3D.s:944: Warning: dwarf line number information for .data ignored
encrypt.c: /tmp/ccPDVS3D.s:947: Warning: dwarf line number information for .data ignored
encrypt.c: /tmp/ccPDVS3D.s:948: Warning: dwarf line number information for .data ignored
encrypt.c: /tmp/ccPDVS3D.s:953: Warning: dwarf line number information for .data ignored
encrypt.c: /tmp/ccPDVS3D.s:954: Warning: dwarf line number information for .data ignored
encrypt.c: /tmp/ccPDVS3D.s:957: Warning: dwarf line number information for .data ignored
encrypt.c: /tmp/ccPDVS3D.s:959: Warning: dwarf line number information for .data ignored
encrypt.c: /tmp/ccPDVS3D.s:962: Warning: dwarf line number information for .data ignored
encrypt.c: /tmp/ccPDVS3D.s:970: Warning: dwarf line number information for .data ignored
encrypt.c: /tmp/ccPDVS3D.s:980: Warning: dwarf line number information for .data ignored
encrypt.c: /tmp/ccPDVS3D.s:982: Warning: dwarf line number information for .data ignored
encrypt.c: /tmp/ccPDVS3D.s:995: Warning: dwarf line number information for .data ignored
encrypt.c: /tmp/ccPDVS3D.s:999: Warning: dwarf line number information for .data ignored
encrypt.c: /tmp/ccPDVS3D.s:1000: Warning: dwarf line number information for .data ignored
encrypt.c: /tmp/ccPDVS3D.s:1001: Warning: dwarf line number information for .data ignored
encrypt.c: /tmp/ccPDVS3D.s:1008: Warning: dwarf line number information for .data ignored
encrypt.c: /tmp/ccPDVS3D.s:1011: Warning: dwarf line number information for .data ignored
encrypt.c: /tmp/ccPDVS3D.s:1014: Warning: dwarf line number information for .data ignored
encrypt.c: /tmp/ccPDVS3D.s:1017: Warning: dwarf line number information for .data ignored
encrypt.c: ...

Number of similar (implementation,compiler) pairs: 1, namely:
ImplementationCompiler
T:avx1gcc -march=native -mtune=native -O -fwrapv -fPIC -fPIE -gdwarf-4 -Wall (11.4.0)

Compiler output


encrypt.c: /tmp/cclSHFnF.s: Assembler messages:
encrypt.c: /tmp/cclSHFnF.s:921: Warning: dwarf line number information for .data ignored
encrypt.c: /tmp/cclSHFnF.s:923: Warning: dwarf line number information for .data ignored
encrypt.c: /tmp/cclSHFnF.s:925: Warning: dwarf line number information for .data ignored
encrypt.c: /tmp/cclSHFnF.s:926: Warning: dwarf line number information for .data ignored
encrypt.c: /tmp/cclSHFnF.s:927: Warning: dwarf line number information for .data ignored
encrypt.c: /tmp/cclSHFnF.s:938: Warning: dwarf line number information for .data ignored
encrypt.c: /tmp/cclSHFnF.s:945: Warning: dwarf line number information for .data ignored
encrypt.c: /tmp/cclSHFnF.s:948: Warning: dwarf line number information for .data ignored
encrypt.c: /tmp/cclSHFnF.s:949: Warning: dwarf line number information for .data ignored
encrypt.c: /tmp/cclSHFnF.s:956: Warning: dwarf line number information for .data ignored
encrypt.c: /tmp/cclSHFnF.s:957: Warning: dwarf line number information for .data ignored
encrypt.c: /tmp/cclSHFnF.s:960: Warning: dwarf line number information for .data ignored
encrypt.c: /tmp/cclSHFnF.s:962: Warning: dwarf line number information for .data ignored
encrypt.c: /tmp/cclSHFnF.s:965: Warning: dwarf line number information for .data ignored
encrypt.c: /tmp/cclSHFnF.s:973: Warning: dwarf line number information for .data ignored
encrypt.c: /tmp/cclSHFnF.s:983: Warning: dwarf line number information for .data ignored
encrypt.c: /tmp/cclSHFnF.s:985: Warning: dwarf line number information for .data ignored
encrypt.c: /tmp/cclSHFnF.s:987: Warning: dwarf line number information for .data ignored
encrypt.c: /tmp/cclSHFnF.s:988: Warning: dwarf line number information for .data ignored
encrypt.c: /tmp/cclSHFnF.s:989: Warning: dwarf line number information for .data ignored
encrypt.c: /tmp/cclSHFnF.s:1000: Warning: dwarf line number information for .data ignored
encrypt.c: /tmp/cclSHFnF.s:1003: Warning: dwarf line number information for .data ignored
encrypt.c: /tmp/cclSHFnF.s:1006: Warning: dwarf line number information for .data ignored
encrypt.c: /tmp/cclSHFnF.s:1009: Warning: dwarf line number information for .data ignored
encrypt.c: ...

Number of similar (implementation,compiler) pairs: 1, namely:
ImplementationCompiler
T:avx1gcc -march=native -mtune=native -Os -fwrapv -fPIC -fPIE -gdwarf-4 -Wall (11.4.0)

Compiler output


try.c: /usr/bin/ld: libcrypto_aead_omdsha256k256n248tau256v1.a(omdsha256.o):.../supercop-data/rumba7/amd64/try/c/clang_-march=native_-O2_-fwrapv_-Qunused-arguments_-fPIC_-fPIE_-gdwarf-4_-Wall/timingleaks/crypto_aead/omdsha256k256n248tau256v1/sse4/work/./omdsha256.h:137: multiple definition of `Hash'; libcrypto_aead_omdsha256k256n248tau256v1.a(encrypt.o):.../supercop-data/rumba7/amd64/try/c/clang_-march=native_-O2_-fwrapv_-Qunused-arguments_-fPIC_-fPIE_-gdwarf-4_-Wall/timingleaks/crypto_aead/omdsha256k256n248tau256v1/sse4/work/./omdsha256.h:137: first defined here
try.c: clang: error: linker command failed with exit code 1 (use -v to see invocation)

Number of similar (implementation,compiler) pairs: 1, namely:
ImplementationCompiler
T:sse4clang -march=native -O2 -fwrapv -Qunused-arguments -fPIC -fPIE -gdwarf-4 -Wall (Ubuntu_Clang_14.0.0)

Compiler output


try.c: /usr/bin/ld: libcrypto_aead_omdsha256k256n248tau256v1.a(omdsha256.o):.../supercop-data/rumba7/amd64/try/c/clang_-march=native_-O3_-fwrapv_-Qunused-arguments_-fPIC_-fPIE_-gdwarf-4_-Wall/timingleaks/crypto_aead/omdsha256k256n248tau256v1/sse4/work/./omdsha256.h:137: multiple definition of `Hash'; libcrypto_aead_omdsha256k256n248tau256v1.a(encrypt.o):.../supercop-data/rumba7/amd64/try/c/clang_-march=native_-O3_-fwrapv_-Qunused-arguments_-fPIC_-fPIE_-gdwarf-4_-Wall/timingleaks/crypto_aead/omdsha256k256n248tau256v1/sse4/work/./omdsha256.h:137: first defined here
try.c: clang: error: linker command failed with exit code 1 (use -v to see invocation)

Number of similar (implementation,compiler) pairs: 1, namely:
ImplementationCompiler
T:sse4clang -march=native -O3 -fwrapv -Qunused-arguments -fPIC -fPIE -gdwarf-4 -Wall (Ubuntu_Clang_14.0.0)

Compiler output


try.c: /usr/bin/ld: libcrypto_aead_omdsha256k256n248tau256v1.a(omdsha256.o):.../supercop-data/rumba7/amd64/try/c/clang_-march=native_-O_-fwrapv_-Qunused-arguments_-fPIC_-fPIE_-gdwarf-4_-Wall/timingleaks/crypto_aead/omdsha256k256n248tau256v1/sse4/work/./omdsha256.h:137: multiple definition of `Hash'; libcrypto_aead_omdsha256k256n248tau256v1.a(encrypt.o):.../supercop-data/rumba7/amd64/try/c/clang_-march=native_-O_-fwrapv_-Qunused-arguments_-fPIC_-fPIE_-gdwarf-4_-Wall/timingleaks/crypto_aead/omdsha256k256n248tau256v1/sse4/work/./omdsha256.h:137: first defined here
try.c: clang: error: linker command failed with exit code 1 (use -v to see invocation)

Number of similar (implementation,compiler) pairs: 1, namely:
ImplementationCompiler
T:sse4clang -march=native -O -fwrapv -Qunused-arguments -fPIC -fPIE -gdwarf-4 -Wall (Ubuntu_Clang_14.0.0)

Compiler output


try.c: /usr/bin/ld: libcrypto_aead_omdsha256k256n248tau256v1.a(omdsha256.o):.../supercop-data/rumba7/amd64/try/c/clang_-march=native_-Os_-fwrapv_-Qunused-arguments_-fPIC_-fPIE_-gdwarf-4_-Wall/timingleaks/crypto_aead/omdsha256k256n248tau256v1/sse4/work/./omdsha256.h:137: multiple definition of `Hash'; libcrypto_aead_omdsha256k256n248tau256v1.a(encrypt.o):.../supercop-data/rumba7/amd64/try/c/clang_-march=native_-Os_-fwrapv_-Qunused-arguments_-fPIC_-fPIE_-gdwarf-4_-Wall/timingleaks/crypto_aead/omdsha256k256n248tau256v1/sse4/work/./omdsha256.h:137: first defined here
try.c: clang: error: linker command failed with exit code 1 (use -v to see invocation)

Number of similar (implementation,compiler) pairs: 1, namely:
ImplementationCompiler
T:sse4clang -march=native -Os -fwrapv -Qunused-arguments -fPIC -fPIE -gdwarf-4 -Wall (Ubuntu_Clang_14.0.0)

Compiler output


try.c: /usr/bin/ld: libcrypto_aead_omdsha256k256n248tau256v1.a(omdsha256.o):.../supercop-data/rumba7/amd64/try/c/clang_-mcpu=native_-O3_-fwrapv_-Qunused-arguments_-fPIC_-fPIE_-gdwarf-4_-Wall/timingleaks/crypto_aead/omdsha256k256n248tau256v1/sse4/work/./omdsha256.h:137: multiple definition of `Hash'; libcrypto_aead_omdsha256k256n248tau256v1.a(encrypt.o):.../supercop-data/rumba7/amd64/try/c/clang_-mcpu=native_-O3_-fwrapv_-Qunused-arguments_-fPIC_-fPIE_-gdwarf-4_-Wall/timingleaks/crypto_aead/omdsha256k256n248tau256v1/sse4/work/./omdsha256.h:137: first defined here
try.c: clang: error: linker command failed with exit code 1 (use -v to see invocation)

Number of similar (implementation,compiler) pairs: 1, namely:
ImplementationCompiler
T:sse4clang -mcpu=native -O3 -fwrapv -Qunused-arguments -fPIC -fPIE -gdwarf-4 -Wall (Ubuntu_Clang_14.0.0)

Compiler output


encrypt.c: /tmp/ccaVAlLB.s: Assembler messages:
encrypt.c: /tmp/ccaVAlLB.s:961: Warning: dwarf line number information for .data ignored
encrypt.c: /tmp/ccaVAlLB.s:963: Warning: dwarf line number information for .data ignored
encrypt.c: /tmp/ccaVAlLB.s:965: Warning: dwarf line number information for .data ignored
encrypt.c: /tmp/ccaVAlLB.s:966: Warning: dwarf line number information for .data ignored
encrypt.c: /tmp/ccaVAlLB.s:967: Warning: dwarf line number information for .data ignored
encrypt.c: /tmp/ccaVAlLB.s:978: Warning: dwarf line number information for .data ignored
encrypt.c: /tmp/ccaVAlLB.s:985: Warning: dwarf line number information for .data ignored
encrypt.c: /tmp/ccaVAlLB.s:988: Warning: dwarf line number information for .data ignored
encrypt.c: /tmp/ccaVAlLB.s:989: Warning: dwarf line number information for .data ignored
encrypt.c: /tmp/ccaVAlLB.s:996: Warning: dwarf line number information for .data ignored
encrypt.c: /tmp/ccaVAlLB.s:997: Warning: dwarf line number information for .data ignored
encrypt.c: /tmp/ccaVAlLB.s:1000: Warning: dwarf line number information for .data ignored
encrypt.c: /tmp/ccaVAlLB.s:1002: Warning: dwarf line number information for .data ignored
encrypt.c: /tmp/ccaVAlLB.s:1005: Warning: dwarf line number information for .data ignored
encrypt.c: /tmp/ccaVAlLB.s:1013: Warning: dwarf line number information for .data ignored
encrypt.c: /tmp/ccaVAlLB.s:1024: Warning: dwarf line number information for .data ignored
encrypt.c: /tmp/ccaVAlLB.s:1026: Warning: dwarf line number information for .data ignored
encrypt.c: /tmp/ccaVAlLB.s:1028: Warning: dwarf line number information for .data ignored
encrypt.c: /tmp/ccaVAlLB.s:1029: Warning: dwarf line number information for .data ignored
encrypt.c: /tmp/ccaVAlLB.s:1030: Warning: dwarf line number information for .data ignored
encrypt.c: /tmp/ccaVAlLB.s:1041: Warning: dwarf line number information for .data ignored
encrypt.c: /tmp/ccaVAlLB.s:1044: Warning: dwarf line number information for .data ignored
encrypt.c: /tmp/ccaVAlLB.s:1047: Warning: dwarf line number information for .data ignored
encrypt.c: /tmp/ccaVAlLB.s:1050: Warning: dwarf line number information for .data ignored
encrypt.c: ...

Number of similar (implementation,compiler) pairs: 1, namely:
ImplementationCompiler
T:sse4gcc -march=native -mtune=native -O2 -fwrapv -fPIC -fPIE -gdwarf-4 -Wall (11.4.0)

Compiler output


encrypt.c: /tmp/ccw37XEU.s: Assembler messages:
encrypt.c: /tmp/ccw37XEU.s:961: Warning: dwarf line number information for .data ignored
encrypt.c: /tmp/ccw37XEU.s:963: Warning: dwarf line number information for .data ignored
encrypt.c: /tmp/ccw37XEU.s:965: Warning: dwarf line number information for .data ignored
encrypt.c: /tmp/ccw37XEU.s:966: Warning: dwarf line number information for .data ignored
encrypt.c: /tmp/ccw37XEU.s:967: Warning: dwarf line number information for .data ignored
encrypt.c: /tmp/ccw37XEU.s:978: Warning: dwarf line number information for .data ignored
encrypt.c: /tmp/ccw37XEU.s:985: Warning: dwarf line number information for .data ignored
encrypt.c: /tmp/ccw37XEU.s:988: Warning: dwarf line number information for .data ignored
encrypt.c: /tmp/ccw37XEU.s:989: Warning: dwarf line number information for .data ignored
encrypt.c: /tmp/ccw37XEU.s:996: Warning: dwarf line number information for .data ignored
encrypt.c: /tmp/ccw37XEU.s:997: Warning: dwarf line number information for .data ignored
encrypt.c: /tmp/ccw37XEU.s:1000: Warning: dwarf line number information for .data ignored
encrypt.c: /tmp/ccw37XEU.s:1002: Warning: dwarf line number information for .data ignored
encrypt.c: /tmp/ccw37XEU.s:1005: Warning: dwarf line number information for .data ignored
encrypt.c: /tmp/ccw37XEU.s:1013: Warning: dwarf line number information for .data ignored
encrypt.c: /tmp/ccw37XEU.s:1024: Warning: dwarf line number information for .data ignored
encrypt.c: /tmp/ccw37XEU.s:1026: Warning: dwarf line number information for .data ignored
encrypt.c: /tmp/ccw37XEU.s:1028: Warning: dwarf line number information for .data ignored
encrypt.c: /tmp/ccw37XEU.s:1029: Warning: dwarf line number information for .data ignored
encrypt.c: /tmp/ccw37XEU.s:1030: Warning: dwarf line number information for .data ignored
encrypt.c: /tmp/ccw37XEU.s:1041: Warning: dwarf line number information for .data ignored
encrypt.c: /tmp/ccw37XEU.s:1044: Warning: dwarf line number information for .data ignored
encrypt.c: /tmp/ccw37XEU.s:1047: Warning: dwarf line number information for .data ignored
encrypt.c: /tmp/ccw37XEU.s:1050: Warning: dwarf line number information for .data ignored
encrypt.c: ...

Number of similar (implementation,compiler) pairs: 1, namely:
ImplementationCompiler
T:sse4gcc -march=native -mtune=native -O3 -fwrapv -fPIC -fPIE -gdwarf-4 -Wall (11.4.0)

Compiler output


encrypt.c: /tmp/ccsUBYn0.s: Assembler messages:
encrypt.c: /tmp/ccsUBYn0.s:960: Warning: dwarf line number information for .data ignored
encrypt.c: /tmp/ccsUBYn0.s:962: Warning: dwarf line number information for .data ignored
encrypt.c: /tmp/ccsUBYn0.s:974: Warning: dwarf line number information for .data ignored
encrypt.c: /tmp/ccsUBYn0.s:975: Warning: dwarf line number information for .data ignored
encrypt.c: /tmp/ccsUBYn0.s:976: Warning: dwarf line number information for .data ignored
encrypt.c: /tmp/ccsUBYn0.s:983: Warning: dwarf line number information for .data ignored
encrypt.c: /tmp/ccsUBYn0.s:986: Warning: dwarf line number information for .data ignored
encrypt.c: /tmp/ccsUBYn0.s:987: Warning: dwarf line number information for .data ignored
encrypt.c: /tmp/ccsUBYn0.s:992: Warning: dwarf line number information for .data ignored
encrypt.c: /tmp/ccsUBYn0.s:993: Warning: dwarf line number information for .data ignored
encrypt.c: /tmp/ccsUBYn0.s:996: Warning: dwarf line number information for .data ignored
encrypt.c: /tmp/ccsUBYn0.s:998: Warning: dwarf line number information for .data ignored
encrypt.c: /tmp/ccsUBYn0.s:1001: Warning: dwarf line number information for .data ignored
encrypt.c: /tmp/ccsUBYn0.s:1009: Warning: dwarf line number information for .data ignored
encrypt.c: /tmp/ccsUBYn0.s:1019: Warning: dwarf line number information for .data ignored
encrypt.c: /tmp/ccsUBYn0.s:1021: Warning: dwarf line number information for .data ignored
encrypt.c: /tmp/ccsUBYn0.s:1034: Warning: dwarf line number information for .data ignored
encrypt.c: /tmp/ccsUBYn0.s:1038: Warning: dwarf line number information for .data ignored
encrypt.c: /tmp/ccsUBYn0.s:1039: Warning: dwarf line number information for .data ignored
encrypt.c: /tmp/ccsUBYn0.s:1040: Warning: dwarf line number information for .data ignored
encrypt.c: /tmp/ccsUBYn0.s:1047: Warning: dwarf line number information for .data ignored
encrypt.c: /tmp/ccsUBYn0.s:1050: Warning: dwarf line number information for .data ignored
encrypt.c: /tmp/ccsUBYn0.s:1053: Warning: dwarf line number information for .data ignored
encrypt.c: /tmp/ccsUBYn0.s:1056: Warning: dwarf line number information for .data ignored
encrypt.c: ...

Number of similar (implementation,compiler) pairs: 1, namely:
ImplementationCompiler
T:sse4gcc -march=native -mtune=native -O -fwrapv -fPIC -fPIE -gdwarf-4 -Wall (11.4.0)

Compiler output


encrypt.c: /tmp/cc8qesx1.s: Assembler messages:
encrypt.c: /tmp/cc8qesx1.s:960: Warning: dwarf line number information for .data ignored
encrypt.c: /tmp/cc8qesx1.s:962: Warning: dwarf line number information for .data ignored
encrypt.c: /tmp/cc8qesx1.s:964: Warning: dwarf line number information for .data ignored
encrypt.c: /tmp/cc8qesx1.s:965: Warning: dwarf line number information for .data ignored
encrypt.c: /tmp/cc8qesx1.s:966: Warning: dwarf line number information for .data ignored
encrypt.c: /tmp/cc8qesx1.s:977: Warning: dwarf line number information for .data ignored
encrypt.c: /tmp/cc8qesx1.s:984: Warning: dwarf line number information for .data ignored
encrypt.c: /tmp/cc8qesx1.s:987: Warning: dwarf line number information for .data ignored
encrypt.c: /tmp/cc8qesx1.s:988: Warning: dwarf line number information for .data ignored
encrypt.c: /tmp/cc8qesx1.s:995: Warning: dwarf line number information for .data ignored
encrypt.c: /tmp/cc8qesx1.s:996: Warning: dwarf line number information for .data ignored
encrypt.c: /tmp/cc8qesx1.s:999: Warning: dwarf line number information for .data ignored
encrypt.c: /tmp/cc8qesx1.s:1001: Warning: dwarf line number information for .data ignored
encrypt.c: /tmp/cc8qesx1.s:1004: Warning: dwarf line number information for .data ignored
encrypt.c: /tmp/cc8qesx1.s:1012: Warning: dwarf line number information for .data ignored
encrypt.c: /tmp/cc8qesx1.s:1022: Warning: dwarf line number information for .data ignored
encrypt.c: /tmp/cc8qesx1.s:1024: Warning: dwarf line number information for .data ignored
encrypt.c: /tmp/cc8qesx1.s:1026: Warning: dwarf line number information for .data ignored
encrypt.c: /tmp/cc8qesx1.s:1027: Warning: dwarf line number information for .data ignored
encrypt.c: /tmp/cc8qesx1.s:1028: Warning: dwarf line number information for .data ignored
encrypt.c: /tmp/cc8qesx1.s:1039: Warning: dwarf line number information for .data ignored
encrypt.c: /tmp/cc8qesx1.s:1042: Warning: dwarf line number information for .data ignored
encrypt.c: /tmp/cc8qesx1.s:1045: Warning: dwarf line number information for .data ignored
encrypt.c: /tmp/cc8qesx1.s:1048: Warning: dwarf line number information for .data ignored
encrypt.c: ...

Number of similar (implementation,compiler) pairs: 1, namely:
ImplementationCompiler
T:sse4gcc -march=native -mtune=native -Os -fwrapv -fPIC -fPIE -gdwarf-4 -Wall (11.4.0)