Implementation notes: amd64, rumba7, crypto_aead/aegis128l

Computer: rumba7
Microarchitecture: amd64; Zen (800f11)
Architecture: amd64
CPU ID: AuthenticAMD-00800f11-178bfbff
SUPERCOP version: 20240425
Operation: crypto_aead
Primitive: aegis128l
TimeObject sizeTest sizeImplementationCompilerBenchmark dateSUPERCOP version
14583652 0 018197 836 1088T:aesnibclang_-march=native_-Os_-fomit-frame-pointer_-fwrapv_-Qunused-arguments_-fPIC_-fPIE2024042620240425
14663236 0 023877 836 1088sodium-aesniclang_-march=native_-Os_-fomit-frame-pointer_-fwrapv_-Qunused-arguments_-fPIC_-fPIE2024042620240425
14745754 0 023043 844 1056T:aesnibclang_-march=native_-O3_-fomit-frame-pointer_-fwrapv_-Qunused-arguments_-fPIC_-fPIE2024042620240425
14794253 32 024813 876 1088jasmin-aesniclang_-march=native_-Os_-fomit-frame-pointer_-fwrapv_-Qunused-arguments_-fPIC_-fPIE2024042620240425
14824308 32 024075 884 1024jasmin-aesniclang_-march=native_-O_-fomit-frame-pointer_-fwrapv_-Qunused-arguments_-fPIC_-fPIE2024042620240425
14864308 32 027243 884 1056jasmin-aesniclang_-march=native_-O2_-fomit-frame-pointer_-fwrapv_-Qunused-arguments_-fPIC_-fPIE2024042620240425
14864529 32 026117 844 1088jasmin-aesnigcc_-march=native_-mtune=native_-O2_-fomit-frame-pointer_-fwrapv_-fPIC_-fPIE2024042620240425
14875197 0 028204 812 1088sodium-aesnigcc_-march=native_-mtune=native_-O3_-fomit-frame-pointer_-fwrapv_-fPIC_-fPIE2024042620240425
14895754 0 022667 844 1056T:aesnibclang_-march=native_-O2_-fomit-frame-pointer_-fwrapv_-Qunused-arguments_-fPIC_-fPIE2024042620240425
14934311 32 026659 884 1024jasmin-aesniclang_-mcpu=native_-O3_-fomit-frame-pointer_-fwrapv_-Qunused-arguments_-fPIC_-fPIE2024042620240425
14983007 0 022851 844 1024sodium-aesniclang_-march=native_-O_-fomit-frame-pointer_-fwrapv_-Qunused-arguments_-fPIC_-fPIE2024042620240425
15034368 32 025004 836 1088jasmin-aesnigcc_-march=native_-mtune=native_-O_-fomit-frame-pointer_-fwrapv_-fPIC_-fPIE2024042620240425
15044467 0 019029 836 1088T:aesnicclang_-march=native_-Os_-fomit-frame-pointer_-fwrapv_-Qunused-arguments_-fPIC_-fPIE2024042620240425
15084308 32 027619 884 1056jasmin-aesniclang_-march=native_-O3_-fomit-frame-pointer_-fwrapv_-Qunused-arguments_-fPIC_-fPIE2024042620240425
15105944 0 022779 820 1088T:aesniagcc_-march=native_-mtune=native_-O3_-fomit-frame-pointer_-fwrapv_-fPIC_-fPIE2024042620240425
15104344 32 023344 820 1056jasmin-aesnigcc_-march=native_-mtune=native_-Os_-fomit-frame-pointer_-fwrapv_-fPIC_-fPIE2024042620240425
15224611 0 027995 844 1056sodium-aesniclang_-march=native_-O3_-fomit-frame-pointer_-fwrapv_-Qunused-arguments_-fPIC_-fPIE2024042620240425
15274611 0 027619 844 1056sodium-aesniclang_-march=native_-O2_-fomit-frame-pointer_-fwrapv_-Qunused-arguments_-fPIC_-fPIE2024042620240425
15393867 0 017731 844 1024T:aesnibclang_-march=native_-O_-fomit-frame-pointer_-fwrapv_-Qunused-arguments_-fPIC_-fPIE2024042620240425
15464607 0 027019 844 1024sodium-aesniclang_-mcpu=native_-O3_-fomit-frame-pointer_-fwrapv_-Qunused-arguments_-fPIC_-fPIE2024042620240425
15607462 0 024339 820 1088T:aesnicgcc_-march=native_-mtune=native_-O3_-fomit-frame-pointer_-fwrapv_-fPIC_-fPIE2024042620240425
15626224 0 023075 820 1088T:aesnibgcc_-march=native_-mtune=native_-O3_-fomit-frame-pointer_-fwrapv_-fPIC_-fPIE2024042620240425
15696918 0 020795 844 1024T:aesnicclang_-march=native_-O_-fomit-frame-pointer_-fwrapv_-Qunused-arguments_-fPIC_-fPIE2024042620240425
15979066 0 026011 844 1056T:aesnicclang_-march=native_-O2_-fomit-frame-pointer_-fwrapv_-Qunused-arguments_-fPIC_-fPIE2024042620240425
15983820 0 025604 812 1088sodium-aesnigcc_-march=native_-mtune=native_-O2_-fomit-frame-pointer_-fwrapv_-fPIC_-fPIE2024042620240425
16079066 0 026387 844 1056T:aesnicclang_-march=native_-O3_-fomit-frame-pointer_-fwrapv_-Qunused-arguments_-fPIC_-fPIE2024042620240425
16103994 0 019611 820 1088T:aesniagcc_-march=native_-mtune=native_-O2_-fomit-frame-pointer_-fwrapv_-fPIC_-fPIE2024042620240425
16225441 0 021091 820 1088T:aesnicgcc_-march=native_-mtune=native_-O2_-fomit-frame-pointer_-fwrapv_-fPIC_-fPIE2024042620240425
16473324 0 018947 820 1088T:aesnibgcc_-march=native_-mtune=native_-O2_-fomit-frame-pointer_-fwrapv_-fPIC_-fPIE2024042620240425
16643385 0 018394 812 1088T:aesnibgcc_-march=native_-mtune=native_-O_-fomit-frame-pointer_-fwrapv_-fPIC_-fPIE2024042620240425
17013981 0 018978 812 1088T:aesniagcc_-march=native_-mtune=native_-O_-fomit-frame-pointer_-fwrapv_-fPIC_-fPIE2024042620240425
17024727 0 019762 812 1088T:aesnicgcc_-march=native_-mtune=native_-O_-fomit-frame-pointer_-fwrapv_-fPIC_-fPIE2024042620240425
17144157 0 017974 796 1056T:aesnicgcc_-march=native_-mtune=native_-Os_-fomit-frame-pointer_-fwrapv_-fPIC_-fPIE2024042620240425
17282750 0 016534 796 1056T:aesnibgcc_-march=native_-mtune=native_-Os_-fomit-frame-pointer_-fwrapv_-fPIC_-fPIE2024042620240425
17973335 0 017869 836 1088T:aesniaclang_-march=native_-Os_-fomit-frame-pointer_-fwrapv_-Qunused-arguments_-fPIC_-fPIE2024042620240425
21345483 0 022763 844 1056T:aesniaclang_-march=native_-O3_-fomit-frame-pointer_-fwrapv_-Qunused-arguments_-fPIC_-fPIE2024042620240425
21385483 0 022387 844 1056T:aesniaclang_-march=native_-O2_-fomit-frame-pointer_-fwrapv_-Qunused-arguments_-fPIC_-fPIE2024042620240425
21603619 0 017467 844 1024T:aesniaclang_-march=native_-O_-fomit-frame-pointer_-fwrapv_-Qunused-arguments_-fPIC_-fPIE2024042620240425
25623490 0 024404 812 1088sodium-aesnigcc_-march=native_-mtune=native_-O_-fomit-frame-pointer_-fwrapv_-fPIC_-fPIE2024042620240425
31904529 32 027349 844 1088jasmin-aesnigcc_-march=native_-mtune=native_-O3_-fomit-frame-pointer_-fwrapv_-fPIC_-fPIE2024042620240425
35912133 0 021375 788 1056sodium-aesnigcc_-march=native_-mtune=native_-Os_-fomit-frame-pointer_-fwrapv_-fPIC_-fPIE2024042620240425
475146346 4096 023235 4924 1088T:refgcc_-march=native_-mtune=native_-O3_-fomit-frame-pointer_-fwrapv_-fPIC_-fPIE2024042620240425
6358708305 0 031379 844 1056T:sodium-softaesclang_-march=native_-O2_-fomit-frame-pointer_-fwrapv_-Qunused-arguments_-fPIC_-fPIE2024042620240425
6370588305 0 031755 844 1056T:sodium-softaesclang_-march=native_-O3_-fomit-frame-pointer_-fwrapv_-Qunused-arguments_-fPIC_-fPIE2024042620240425
6430928321 0 030811 844 1024T:sodium-softaesclang_-mcpu=native_-O3_-fomit-frame-pointer_-fwrapv_-Qunused-arguments_-fPIC_-fPIE2024042620240425
7265979659 1024 032700 1844 1088T:sodium-softaesgcc_-march=native_-mtune=native_-O3_-fomit-frame-pointer_-fwrapv_-fPIC_-fPIE2024042620240425
8321149914 0 029835 844 1024T:sodium-softaesclang_-march=native_-O_-fomit-frame-pointer_-fwrapv_-Qunused-arguments_-fPIC_-fPIE2024042620240425
8379206154 0 026893 836 1088T:sodium-softaesclang_-march=native_-Os_-fomit-frame-pointer_-fwrapv_-Qunused-arguments_-fPIC_-fPIE2024042620240425
8655789123 1024 030028 1844 1088T:sodium-softaesgcc_-march=native_-mtune=native_-O_-fomit-frame-pointer_-fwrapv_-fPIC_-fPIE2024042620240425
8656028267 1024 030076 1844 1088T:sodium-softaesgcc_-march=native_-mtune=native_-O2_-fomit-frame-pointer_-fwrapv_-fPIC_-fPIE2024042620240425
9257214556 1024 023847 1820 1056T:sodium-softaesgcc_-march=native_-mtune=native_-Os_-fomit-frame-pointer_-fwrapv_-fPIC_-fPIE2024042620240425

Compiler output

Implementation: T:aesnia
Security model: timingleaks
Compiler: clang -mcpu=native -O3 -fomit-frame-pointer -fwrapv -Qunused-arguments -fPIC -fPIE
encrypt.c: encrypt.c:34:25: error: always_inline function '_mm_aesenc_si128' requires target feature 'aes', but would be inlined into function 'aegis128L_initialization' that is compiled without support for 'aes'
encrypt.c: state[7] = _mm_aesenc_si128(state[6],state[7]);
encrypt.c: ^
encrypt.c: encrypt.c:35:25: error: always_inline function '_mm_aesenc_si128' requires target feature 'aes', but would be inlined into function 'aegis128L_initialization' that is compiled without support for 'aes'
encrypt.c: state[6] = _mm_aesenc_si128(state[5],state[6]);
encrypt.c: ^
encrypt.c: encrypt.c:36:25: error: always_inline function '_mm_aesenc_si128' requires target feature 'aes', but would be inlined into function 'aegis128L_initialization' that is compiled without support for 'aes'
encrypt.c: state[5] = _mm_aesenc_si128(state[4],state[5]);
encrypt.c: ^
encrypt.c: encrypt.c:37:25: error: always_inline function '_mm_aesenc_si128' requires target feature 'aes', but would be inlined into function 'aegis128L_initialization' that is compiled without support for 'aes'
encrypt.c: state[4] = _mm_aesenc_si128(state[3],state[4]);
encrypt.c: ^
encrypt.c: encrypt.c:38:25: error: always_inline function '_mm_aesenc_si128' requires target feature 'aes', but would be inlined into function 'aegis128L_initialization' that is compiled without support for 'aes'
encrypt.c: state[3] = _mm_aesenc_si128(state[2],state[3]);
encrypt.c: ^
encrypt.c: encrypt.c:39:25: error: always_inline function '_mm_aesenc_si128' requires target feature 'aes', but would be inlined into function 'aegis128L_initialization' that is compiled without support for 'aes'
encrypt.c: state[2] = _mm_aesenc_si128(state[1],state[2]);
encrypt.c: ^
encrypt.c: encrypt.c:40:25: error: always_inline function '_mm_aesenc_si128' requires target feature 'aes', but would be inlined into function 'aegis128L_initialization' that is compiled without support for 'aes'
encrypt.c: state[1] = _mm_aesenc_si128(state[0],state[1]);
encrypt.c: ^
encrypt.c: encrypt.c:41:25: error: always_inline function '_mm_aesenc_si128' requires target feature 'aes', but would be inlined into function 'aegis128L_initialization' that is compiled without support for 'aes'
encrypt.c: state[0] = _mm_aesenc_si128(tmp,state[0]);
encrypt.c: ^
encrypt.c: 8 errors generated.

Number of similar (compiler,implementation) pairs: 3, namely:
CompilerImplementations
clang -mcpu=native -O3 -fomit-frame-pointer -fwrapv -Qunused-arguments -fPIC -fPIE T:aesnia T:aesnib T:aesnic

Compiler output

Implementation: T:aesnia
Security model: timingleaks
Compiler: gcc -march=native -mtune=native -Os -fomit-frame-pointer -fwrapv -fPIC -fPIE
try.c: /usr/bin/ld: libcrypto_aead_aegis128l.a(encrypt.o): in function `crypto_aead_aegis128l_aesnia_timingleaks_encrypt':
try.c: encrypt.c:(.text+0x...): undefined reference to `aegis128L_enc_aut_step'
try.c: /usr/bin/ld: encrypt.c:(.text+0x...): undefined reference to `aegis128L_enc_aut_step'
try.c: /usr/bin/ld: encrypt.c:(.text+0x...): undefined reference to `aegis128L_enc_aut_step'
try.c: /usr/bin/ld: encrypt.c:(.text+0x...): undefined reference to `aegis128L_enc_aut_step'
try.c: /usr/bin/ld: libcrypto_aead_aegis128l.a(encrypt.o): in function `crypto_aead_aegis128l_aesnia_timingleaks_decrypt':
try.c: encrypt.c:(.text+0x...): undefined reference to `aegis128L_enc_aut_step'
try.c: /usr/bin/ld: libcrypto_aead_aegis128l.a(encrypt.o):encrypt.c:(.text+0x...): more undefined references to `aegis128L_enc_aut_step' follow
try.c: /usr/bin/ld: libcrypto_aead_aegis128l.a(encrypt.o): in function `crypto_aead_aegis128l_aesnia_timingleaks_decrypt':
try.c: encrypt.c:(.text+0x...): undefined reference to `aegis128L_dec_aut_step'
try.c: /usr/bin/ld: encrypt.c:(.text+0x...): undefined reference to `aegis128L_dec_aut_step'
try.c: collect2: error: ld returned 1 exit status

Number of similar (compiler,implementation) pairs: 1, namely:
CompilerImplementations
gcc -march=native -mtune=native -Os -fomit-frame-pointer -fwrapv -fPIC -fPIE T:aesnia

Compiler output

Implementation: T:ref
Security model: timingleaks
Compiler: clang -march=native -O2 -fomit-frame-pointer -fwrapv -Qunused-arguments -fPIC -fPIE
try.c: /usr/bin/ld: libcrypto_aead_aegis128l.a(ecrypt.o): in function `crypto_aead_aegis128l_ref_timingleaks_encrypt':
try.c: ecrypt.c:(.text+0x...): undefined reference to `aegis128L_enc_aut_step'
try.c: /usr/bin/ld: ecrypt.c:(.text+0x...): undefined reference to `aegis128L_enc_aut_step'
try.c: /usr/bin/ld: ecrypt.c:(.text+0x...): undefined reference to `aegis128L_enc_aut_step'
try.c: /usr/bin/ld: ecrypt.c:(.text+0x...): undefined reference to `aegis128L_enc_aut_step'
try.c: /usr/bin/ld: libcrypto_aead_aegis128l.a(ecrypt.o): in function `crypto_aead_aegis128l_ref_timingleaks_decrypt':
try.c: ecrypt.c:(.text+0x...): undefined reference to `aegis128L_enc_aut_step'
try.c: /usr/bin/ld: libcrypto_aead_aegis128l.a(ecrypt.o):ecrypt.c:(.text+0x...): more undefined references to `aegis128L_enc_aut_step' follow
try.c: /usr/bin/ld: libcrypto_aead_aegis128l.a(ecrypt.o): in function `crypto_aead_aegis128l_ref_timingleaks_decrypt':
try.c: ecrypt.c:(.text+0x...): undefined reference to `aegis128L_dec_aut_step'
try.c: /usr/bin/ld: ecrypt.c:(.text+0x...): undefined reference to `aegis128L_dec_aut_step'
try.c: clang: error: linker command failed with exit code 1 (use -v to see invocation)

Number of similar (compiler,implementation) pairs: 5, namely:
CompilerImplementations
clang -march=native -O2 -fomit-frame-pointer -fwrapv -Qunused-arguments -fPIC -fPIE T:ref
clang -march=native -O3 -fomit-frame-pointer -fwrapv -Qunused-arguments -fPIC -fPIE T:ref
clang -march=native -O -fomit-frame-pointer -fwrapv -Qunused-arguments -fPIC -fPIE T:ref
clang -march=native -Os -fomit-frame-pointer -fwrapv -Qunused-arguments -fPIC -fPIE T:ref
clang -mcpu=native -O3 -fomit-frame-pointer -fwrapv -Qunused-arguments -fPIC -fPIE T:ref

Compiler output

Implementation: T:ref
Security model: timingleaks
Compiler: gcc -march=native -mtune=native -O2 -fomit-frame-pointer -fwrapv -fPIC -fPIE
try.c: /usr/bin/ld: libcrypto_aead_aegis128l.a(ecrypt.o): in function `crypto_aead_aegis128l_ref_timingleaks_encrypt':
try.c: ecrypt.c:(.text+0x...): undefined reference to `aegis128L_enc_aut_step'
try.c: /usr/bin/ld: ecrypt.c:(.text+0x...): undefined reference to `aegis128L_enc_aut_step'
try.c: /usr/bin/ld: ecrypt.c:(.text+0x...): undefined reference to `aegis128L_enc_aut_step'
try.c: /usr/bin/ld: ecrypt.c:(.text+0x...): undefined reference to `aegis128L_enc_aut_step'
try.c: /usr/bin/ld: libcrypto_aead_aegis128l.a(ecrypt.o): in function `crypto_aead_aegis128l_ref_timingleaks_decrypt':
try.c: ecrypt.c:(.text+0x...): undefined reference to `aegis128L_enc_aut_step'
try.c: /usr/bin/ld: ecrypt.c:(.text+0x...): undefined reference to `aegis128L_dec_aut_step'
try.c: /usr/bin/ld: ecrypt.c:(.text+0x...): undefined reference to `aegis128L_enc_aut_step'
try.c: /usr/bin/ld: ecrypt.c:(.text+0x...): undefined reference to `aegis128L_dec_aut_step'
try.c: collect2: error: ld returned 1 exit status

Number of similar (compiler,implementation) pairs: 2, namely:
CompilerImplementations
gcc -march=native -mtune=native -O2 -fomit-frame-pointer -fwrapv -fPIC -fPIE T:ref
gcc -march=native -mtune=native -O -fomit-frame-pointer -fwrapv -fPIC -fPIE T:ref

Compiler output

Implementation: T:ref
Security model: timingleaks
Compiler: gcc -march=native -mtune=native -Os -fomit-frame-pointer -fwrapv -fPIC -fPIE
try.c: /usr/bin/ld: libcrypto_aead_aegis128l.a(ecrypt.o): in function `crypto_aead_aegis128l_ref_timingleaks_encrypt':
try.c: ecrypt.c:(.text+0x...): undefined reference to `aegis128L_enc_aut_step'
try.c: /usr/bin/ld: ecrypt.c:(.text+0x...): undefined reference to `aegis128L_enc_aut_step'
try.c: /usr/bin/ld: ecrypt.c:(.text+0x...): undefined reference to `aegis128L_enc_aut_step'
try.c: /usr/bin/ld: ecrypt.c:(.text+0x...): undefined reference to `aegis128L_enc_aut_step'
try.c: /usr/bin/ld: libcrypto_aead_aegis128l.a(ecrypt.o): in function `crypto_aead_aegis128l_ref_timingleaks_decrypt':
try.c: ecrypt.c:(.text+0x...): undefined reference to `aegis128L_enc_aut_step'
try.c: /usr/bin/ld: libcrypto_aead_aegis128l.a(ecrypt.o):ecrypt.c:(.text+0x...): more undefined references to `aegis128L_enc_aut_step' follow
try.c: /usr/bin/ld: libcrypto_aead_aegis128l.a(ecrypt.o): in function `crypto_aead_aegis128l_ref_timingleaks_decrypt':
try.c: ecrypt.c:(.text+0x...): undefined reference to `aegis128L_dec_aut_step'
try.c: /usr/bin/ld: ecrypt.c:(.text+0x...): undefined reference to `aegis128L_dec_aut_step'
try.c: collect2: error: ld returned 1 exit status

Number of similar (compiler,implementation) pairs: 1, namely:
CompilerImplementations
gcc -march=native -mtune=native -Os -fomit-frame-pointer -fwrapv -fPIC -fPIE T:ref