Implementation notes: amd64, rumba5, crypto_stream/simon64128ctr

Computer: rumba5
Architecture: amd64
CPU ID: AuthenticAMD-00800f11-178bfbff
SUPERCOP version: 20220506
Operation: crypto_stream
Primitive: simon64128ctr
TimeObject sizeTest sizeImplementationCompilerBenchmark dateSUPERCOP version
605887847 0 0102644 804 968T:sse4clang_-march=native_-O_-fomit-frame-pointer_-fwrapv_-Qunused-arguments_-fPIC_-fPIE2021011420210114
606187847 0 0102644 804 968T:sse4clang_-march=native_-O2_-fomit-frame-pointer_-fwrapv_-Qunused-arguments_-fPIC_-fPIE2021011420210114
606487847 0 0102692 804 968T:sse4clang_-march=native_-O3_-fomit-frame-pointer_-fwrapv_-Qunused-arguments_-fPIC_-fPIE2021011420210114
631392262 0 0108281 804 1000T:sse4gcc_-march=native_-mtune=native_-O3_-fomit-frame-pointer_-fwrapv_-fPIC_-fPIE2021011420210114
6728101663 0 0116380 804 968T:avx2clang_-march=native_-O_-fomit-frame-pointer_-fwrapv_-Qunused-arguments_-fPIC_-fPIE2021011420210114
6731101663 0 0116380 804 968T:avx2clang_-march=native_-O2_-fomit-frame-pointer_-fwrapv_-Qunused-arguments_-fPIC_-fPIE2021011420210114
6745101663 0 0116444 804 968T:avx2clang_-march=native_-O3_-fomit-frame-pointer_-fwrapv_-Qunused-arguments_-fPIC_-fPIE2021011420210114
812491744 0 0105496 796 1000T:sse4gcc_-march=native_-mtune=native_-O2_-fomit-frame-pointer_-fwrapv_-fPIC_-fPIE2021011420210114
815492648 0 0104546 796 968T:sse4clang_-march=native_-Os_-fomit-frame-pointer_-fwrapv_-Qunused-arguments_-fPIC_-fPIE2021011420210114
864792130 0 0105536 796 1000T:sse4gcc_-march=native_-mtune=native_-O_-fomit-frame-pointer_-fwrapv_-fPIC_-fPIE2021011420210114
8686100779 0 0112538 796 968T:avx2clang_-march=native_-Os_-fomit-frame-pointer_-fwrapv_-Qunused-arguments_-fPIC_-fPIE2021011420210114
896299092 0 0112888 796 1000T:avx2gcc_-march=native_-mtune=native_-O2_-fomit-frame-pointer_-fwrapv_-fPIC_-fPIE2021011420210114
927398307 0 0111744 796 1000T:avx2gcc_-march=native_-mtune=native_-O_-fomit-frame-pointer_-fwrapv_-fPIC_-fPIE2021011420210114
955993059 0 0105468 780 968T:sse4gcc_-march=native_-mtune=native_-Os_-fomit-frame-pointer_-fwrapv_-fPIC_-fPIE2021011420210114

Compiler output

Implementation: T:avx2
Security model: timingleaks
Compiler: clang -mcpu=native -O3 -fomit-frame-pointer -fwrapv -Qunused-arguments -fPIC -fPIE
stream.c: stream.c:147:3: error: always_inline function '_mm256_set_epi32' requires target feature 'sse4.2', but would be inlined into function 'Encrypt' that is compiled without support for 'sse4.2'
stream.c: SET1(X[0],nonce[1]); SET8(Y[0],nonce[0]);
stream.c: ^
stream.c: ./Intrinsics_AVX2_64block.h:24:22: note: expanded from macro 'SET1'
stream.c: #define SET1(X,c) (X=SET(c,c,c,c,c,c,c,c))
stream.c: ^
stream.c: ./Intrinsics_AVX2_64block.h:23:13: note: expanded from macro 'SET'
stream.c: #define SET _mm256_set_epi32
stream.c: ^
stream.c: stream.c:147:24: error: always_inline function '_mm256_set_epi32' requires target feature 'sse4.2', but would be inlined into function 'Encrypt' that is compiled without support for 'sse4.2'
stream.c: SET1(X[0],nonce[1]); SET8(Y[0],nonce[0]);
stream.c: ^
stream.c: ./Intrinsics_AVX2_64block.h:25:22: note: expanded from macro 'SET8'
stream.c: #define SET8(X,c) (X=SET(c,c,c,c,c,c,c,c), X=ADD(X,_q))
stream.c: ^
stream.c: ./Intrinsics_AVX2_64block.h:23:13: note: expanded from macro 'SET'
stream.c: #define SET _mm256_set_epi32
stream.c: ^
stream.c: stream.c:147:24: error: always_inline function '_mm256_add_epi32' requires target feature 'avx2', but would be inlined into function 'Encrypt' that is compiled without support for 'avx2'
stream.c: ./Intrinsics_AVX2_64block.h:25:46: note: expanded from macro 'SET8'
stream.c: #define SET8(X,c) (X=SET(c,c,c,c,c,c,c,c), X=ADD(X,_q))
stream.c: ^
stream.c: ./Intrinsics_AVX2_64block.h:16:13: note: expanded from macro 'ADD'
stream.c: #define ADD _mm256_add_epi32
stream.c: ^
stream.c: ...

Number of similar (compiler,implementation) pairs: 1, namely:
CompilerImplementations
clang -mcpu=native -O3 -fomit-frame-pointer -fwrapv -Qunused-arguments -fPIC -fPIE T:avx2

Compiler output

Implementation: T:avx2
Security model: timingleaks
Compiler: gcc -march=native -mtune=native -O3 -fomit-frame-pointer -fwrapv -fPIC -fPIE
try.c: crypto_stream_simon64128ctr.a(stream.o): In function `Encrypt':
try.c: stream.c:(.text+0x...): undefined reference to `Transpose'
try.c: stream.c:(.text+0x...): undefined reference to `Transpose'
try.c: stream.c:(.text+0x...): undefined reference to `Transpose'
try.c: stream.c:(.text+0x...): undefined reference to `Transpose'
try.c: crypto_stream_simon64128ctr.a(stream.o): In function `Encrypt_Xor':
try.c: stream.c:(.text+0x...): undefined reference to `Transpose'
try.c: crypto_stream_simon64128ctr.a(stream.o):stream.c:(.text+0x...): more undefined references to `Transpose' follow
try.c: collect2: error: ld returned 1 exit status

Number of similar (compiler,implementation) pairs: 2, namely:
CompilerImplementations
gcc -march=native -mtune=native -O3 -fomit-frame-pointer -fwrapv -fPIC -fPIE T:avx2
gcc -march=native -mtune=native -Os -fomit-frame-pointer -fwrapv -fPIC -fPIE T:avx2

Compiler output

Implementation: T:sse4
Security model: timingleaks
Compiler: clang -mcpu=native -O3 -fomit-frame-pointer -fwrapv -Qunused-arguments -fPIC -fPIE
stream.c: stream.c:340:3: error: always_inline function '_mm_shuffle_epi8' requires target feature 'ssse3', but would be inlined into function 'ExpandKeyBS' that is compiled without support for 'ssse3'
stream.c: EKBS(rk);
stream.c: ^
stream.c: ./Simon64128SSE4.h:64:19: note: expanded from macro 'EKBS'
stream.c: #define EKBS(rk) (RKBS(rk,4,_D), RKBS(rk,5,_D), RKBS(rk,6,_C), RKBS(rk,7,_D), RKBS(rk,8,_D), RKBS(rk,9,_C), RKBS(rk,10,_D), RKBS(rk,11,_D), \
stream.c: ^
stream.c: ./Simon64128SSE4.h:53:52: note: expanded from macro 'RKBS'
stream.c: #define RKBS(rk,r,_V) (rk[r][7]= _D ^ rk[r-4][7] ^ ROR8(rk[r-1][2]) ^ rk[r-3][7] ^ ROR8(rk[r-1][3]) ^ ROR8(rk[r-3][0]), \
stream.c: ^
stream.c: ./Intrinsics_SSE4_64block.h:39:19: note: expanded from macro 'ROR8'
stream.c: #define ROR8(X) (SHFL(X,R8))
stream.c: ^
stream.c: ./Intrinsics_SSE4_64block.h:34:14: note: expanded from macro 'SHFL'
stream.c: #define SHFL _mm_shuffle_epi8
stream.c: ^
stream.c: stream.c:340:3: error: always_inline function '_mm_shuffle_epi8' requires target feature 'ssse3', but would be inlined into function 'ExpandKeyBS' that is compiled without support for 'ssse3'
stream.c: ./Simon64128SSE4.h:64:19: note: expanded from macro 'EKBS'
stream.c: #define EKBS(rk) (RKBS(rk,4,_D), RKBS(rk,5,_D), RKBS(rk,6,_C), RKBS(rk,7,_D), RKBS(rk,8,_D), RKBS(rk,9,_C), RKBS(rk,10,_D), RKBS(rk,11,_D), \
stream.c: ^
stream.c: ./Simon64128SSE4.h:53:85: note: expanded from macro 'RKBS'
stream.c: #define RKBS(rk,r,_V) (rk[r][7]= _D ^ rk[r-4][7] ^ ROR8(rk[r-1][2]) ^ rk[r-3][7] ^ ROR8(rk[r-1][3]) ^ ROR8(rk[r-3][0]), \
stream.c: ^
stream.c: ./Intrinsics_SSE4_64block.h:39:19: note: expanded from macro 'ROR8'
stream.c: #define ROR8(X) (SHFL(X,R8))
stream.c: ^
stream.c: ...

Number of similar (compiler,implementation) pairs: 1, namely:
CompilerImplementations
clang -mcpu=native -O3 -fomit-frame-pointer -fwrapv -Qunused-arguments -fPIC -fPIE T:sse4

Namespace violations

Implementation: T:avx2
Security model: timingleaks
Compiler: clang -march=native -O2 -fomit-frame-pointer -fwrapv -Qunused-arguments -fPIC -fPIE
stream.o Encrypt T
stream.o Encrypt_Xor T
stream.o ExpandKeyBS T
stream.o ExpandKeyNBS T

Number of similar (compiler,implementation) pairs: 6, namely:
CompilerImplementations
clang -march=native -O2 -fomit-frame-pointer -fwrapv -Qunused-arguments -fPIC -fPIE T:avx2
clang -march=native -O3 -fomit-frame-pointer -fwrapv -Qunused-arguments -fPIC -fPIE T:avx2
clang -march=native -O -fomit-frame-pointer -fwrapv -Qunused-arguments -fPIC -fPIE T:avx2
clang -march=native -Os -fomit-frame-pointer -fwrapv -Qunused-arguments -fPIC -fPIE T:avx2
gcc -march=native -mtune=native -O2 -fomit-frame-pointer -fwrapv -fPIC -fPIE T:avx2
gcc -march=native -mtune=native -O -fomit-frame-pointer -fwrapv -fPIC -fPIE T:avx2

Namespace violations

Implementation: T:sse4
Security model: timingleaks
Compiler: clang -march=native -O2 -fomit-frame-pointer -fwrapv -Qunused-arguments -fPIC -fPIE
stream.o ExpandKeyBS T
stream.o ExpandKeyNBS T

Number of similar (compiler,implementation) pairs: 8, namely:
CompilerImplementations
clang -march=native -O2 -fomit-frame-pointer -fwrapv -Qunused-arguments -fPIC -fPIE T:sse4
clang -march=native -O3 -fomit-frame-pointer -fwrapv -Qunused-arguments -fPIC -fPIE T:sse4
clang -march=native -O -fomit-frame-pointer -fwrapv -Qunused-arguments -fPIC -fPIE T:sse4
clang -march=native -Os -fomit-frame-pointer -fwrapv -Qunused-arguments -fPIC -fPIE T:sse4
gcc -march=native -mtune=native -O2 -fomit-frame-pointer -fwrapv -fPIC -fPIE T:sse4
gcc -march=native -mtune=native -O3 -fomit-frame-pointer -fwrapv -fPIC -fPIE T:sse4
gcc -march=native -mtune=native -O -fomit-frame-pointer -fwrapv -fPIC -fPIE T:sse4
gcc -march=native -mtune=native -Os -fomit-frame-pointer -fwrapv -fPIC -fPIE T:sse4