Implementation notes: amd64, rumba5, crypto_sign/bluegemss192

Computer: rumba5
Microarchitecture: amd64; Zen (800f11)
Architecture: amd64
CPU ID: AuthenticAMD-00800f11-178bfbff
SUPERCOP version: 20240625
Operation: crypto_sign
Primitive: bluegemss192
TimeObject sizeTest sizeImplementationCompilerBenchmark dateSUPERCOP version
446901305103239 0 099933 828 1792T:optgcc_-march=native_-mtune=native_-O2_-fwrapv_-fPIC_-fPIE_-gdwarf-4_-Wall2024062620240625
447307850103468 0 0100157 828 1792T:skylakegcc_-march=native_-mtune=native_-O2_-fwrapv_-fPIC_-fPIE_-gdwarf-4_-Wall2024062620240625
45646239890907 0 088605 820 1760T:optgcc_-march=native_-mtune=native_-Os_-fwrapv_-fPIC_-fPIE_-gdwarf-4_-Wall2024062620240625
45683535399174 0 096173 828 1792T:optgcc_-march=native_-mtune=native_-O_-fwrapv_-fPIC_-fPIE_-gdwarf-4_-Wall2024062620240625
46068513191089 0 088797 820 1760T:skylakegcc_-march=native_-mtune=native_-Os_-fwrapv_-fPIC_-fPIE_-gdwarf-4_-Wall2024062620240625
46147787299380 0 096397 828 1792T:skylakegcc_-march=native_-mtune=native_-O_-fwrapv_-fPIC_-fPIE_-gdwarf-4_-Wall2024062620240625
476049015120087 0 0114469 828 1792T:skylakegcc_-march=native_-mtune=native_-O3_-fwrapv_-fPIC_-fPIE_-gdwarf-4_-Wall2024062620240625
478760843119858 0 0114245 828 1792T:optgcc_-march=native_-mtune=native_-O3_-fwrapv_-fPIC_-fPIE_-gdwarf-4_-Wall2024062620240625
123304536747598 112 71746082 4148 6880T:refclang++_-march=native_-O2_-fwrapv_-Qunused-arguments_-fPIC_-fPIE_-gdwarf-4_-Wall2024062620240625
123313071145091 112 71740822 4148 6880T:refclang++_-march=native_-O_-fwrapv_-Qunused-arguments_-fPIC_-fPIE_-gdwarf-4_-Wall2024062620240625
123463332766341 112 71755450 4148 6880T:refclang++_-march=native_-O3_-fwrapv_-Qunused-arguments_-fPIC_-fPIE_-gdwarf-4_-Wall2024062620240625
126699645445257 112 71739727 4108 6944T:refg++_-march=native_-mtune=native_-O_-fwrapv_-fPIC_-fPIE_-gdwarf-4_-Wall2024062620240625
127953974641349 112 71735720 4140 6944T:refclang++_-march=native_-Os_-fwrapv_-Qunused-arguments_-fPIC_-fPIE_-gdwarf-4_-Wall2024062620240625
128506507753721 112 71748563 4108 6944T:refg++_-march=native_-mtune=native_-O2_-fwrapv_-fPIC_-fPIE_-gdwarf-4_-Wall2024062620240625
129181529458715 112 71755615 4108 6944T:refg++_-march=native_-mtune=native_-O3_-fwrapv_-fPIC_-fPIE_-gdwarf-4_-Wall2024062620240625
130272950539816 112 71734751 4100 6912T:refg++_-march=native_-mtune=native_-Os_-fwrapv_-fPIC_-fPIE_-gdwarf-4_-Wall2024062620240625

Compiler output


mul_gf2x.c: mul_gf2x.c:13:12: warning: implicit declaration of function '_mm_cvtsi128_si64x' is invalid in C99 [-Wimplicit-function-declaration]
mul_gf2x.c:     return MUL64LOW(x,y,0);
mul_gf2x.c:            ^
mul_gf2x.c: ./mul_gf2x.h:905:27: note: expanded from macro 'MUL64LOW'
mul_gf2x.c: #define MUL64LOW(x,y,pos) _mm_cvtsi128_si64x(_mm_clmulepi64_si128(x, y, pos))
mul_gf2x.c:                           ^
mul_gf2x.c: 1 warning generated.
sqr_gf2x.c: sqr_gf2x.c:27:12: warning: implicit declaration of function '_mm_cvtsi128_si64x' is invalid in C99 [-Wimplicit-function-declaration]
sqr_gf2x.c:     return _mm_cvtsi128_si64x(_mm_clmulepi64_si128(x,x,0));
sqr_gf2x.c:            ^
sqr_gf2x.c: sqr_gf2x.c:316:12: warning: implicit declaration of function '_mm_cvtsi128_si64x' is invalid in C99 [-Wimplicit-function-declaration]
sqr_gf2x.c:     return SQR64LOW(x,0);
sqr_gf2x.c:            ^
sqr_gf2x.c: ./sqr_gf2x.h:250:25: note: expanded from macro 'SQR64LOW'
sqr_gf2x.c: #define SQR64LOW(x,pos) _mm_cvtsi128_si64x(_mm_clmulepi64_si128(x, x, pos))
sqr_gf2x.c:                         ^
sqr_gf2x.c: 2 warnings generated.
try.c: /usr/bin/ld: libcrypto_sign_bluegemss192.a(mul_gf2x.o): in function `BlueGeMSS_192U_mul64low':
try.c: .../supercop-data/rumba5/amd64/try/c/clang_-march=native_-O2_-fwrapv_-Qunused-arguments_-fPIC_-fPIE_-gdwarf-4_-Wall/timingleaks/crypto_sign/bluegemss192/opt/work/mul_gf2x.c:13: undefined reference to `_mm_cvtsi128_si64x'
try.c: /usr/bin/ld: libcrypto_sign_bluegemss192.a(sqr_gf2x.o): in function `BlueGeMSS_192U_sqr64low':
try.c: .../supercop-data/rumba5/amd64/try/c/clang_-march=native_-O2_-fwrapv_-Qunused-arguments_-fPIC_-fPIE_-gdwarf-4_-Wall/timingleaks/crypto_sign/bluegemss192/opt/work/sqr_gf2x.c:27: undefined reference to `_mm_cvtsi128_si64x'
try.c: /usr/bin/ld: libcrypto_sign_bluegemss192.a(sqr_gf2x.o): in function `BlueGeMSS_192U_old_square64low':
try.c: .../supercop-data/rumba5/amd64/try/c/clang_-march=native_-O2_-fwrapv_-Qunused-arguments_-fPIC_-fPIE_-gdwarf-4_-Wall/timingleaks/crypto_sign/bluegemss192/opt/work/sqr_gf2x.c:316: undefined reference to `_mm_cvtsi128_si64x'
try.c: clang: error: linker command failed with exit code 1 (use -v to see invocation)

Number of similar (implementation,compiler) pairs: 1, namely:
ImplementationCompiler
T:optclang -march=native -O2 -fwrapv -Qunused-arguments -fPIC -fPIE -gdwarf-4 -Wall (Ubuntu_Clang_14.0.0)

Compiler output


mul_gf2x.c: mul_gf2x.c:13:12: warning: implicit declaration of function '_mm_cvtsi128_si64x' is invalid in C99 [-Wimplicit-function-declaration]
mul_gf2x.c:     return MUL64LOW(x,y,0);
mul_gf2x.c:            ^
mul_gf2x.c: ./mul_gf2x.h:905:27: note: expanded from macro 'MUL64LOW'
mul_gf2x.c: #define MUL64LOW(x,y,pos) _mm_cvtsi128_si64x(_mm_clmulepi64_si128(x, y, pos))
mul_gf2x.c:                           ^
mul_gf2x.c: 1 warning generated.
sqr_gf2x.c: sqr_gf2x.c:27:12: warning: implicit declaration of function '_mm_cvtsi128_si64x' is invalid in C99 [-Wimplicit-function-declaration]
sqr_gf2x.c:     return _mm_cvtsi128_si64x(_mm_clmulepi64_si128(x,x,0));
sqr_gf2x.c:            ^
sqr_gf2x.c: sqr_gf2x.c:316:12: warning: implicit declaration of function '_mm_cvtsi128_si64x' is invalid in C99 [-Wimplicit-function-declaration]
sqr_gf2x.c:     return SQR64LOW(x,0);
sqr_gf2x.c:            ^
sqr_gf2x.c: ./sqr_gf2x.h:250:25: note: expanded from macro 'SQR64LOW'
sqr_gf2x.c: #define SQR64LOW(x,pos) _mm_cvtsi128_si64x(_mm_clmulepi64_si128(x, x, pos))
sqr_gf2x.c:                         ^
sqr_gf2x.c: 2 warnings generated.
try.c: /usr/bin/ld: libcrypto_sign_bluegemss192.a(mul_gf2x.o): in function `BlueGeMSS_192U_mul64low':
try.c: .../supercop-data/rumba5/amd64/try/c/clang_-march=native_-O3_-fwrapv_-Qunused-arguments_-fPIC_-fPIE_-gdwarf-4_-Wall/timingleaks/crypto_sign/bluegemss192/opt/work/mul_gf2x.c:13: undefined reference to `_mm_cvtsi128_si64x'
try.c: /usr/bin/ld: libcrypto_sign_bluegemss192.a(sqr_gf2x.o): in function `BlueGeMSS_192U_sqr64low':
try.c: .../supercop-data/rumba5/amd64/try/c/clang_-march=native_-O3_-fwrapv_-Qunused-arguments_-fPIC_-fPIE_-gdwarf-4_-Wall/timingleaks/crypto_sign/bluegemss192/opt/work/sqr_gf2x.c:27: undefined reference to `_mm_cvtsi128_si64x'
try.c: /usr/bin/ld: libcrypto_sign_bluegemss192.a(sqr_gf2x.o): in function `BlueGeMSS_192U_old_square64low':
try.c: .../supercop-data/rumba5/amd64/try/c/clang_-march=native_-O3_-fwrapv_-Qunused-arguments_-fPIC_-fPIE_-gdwarf-4_-Wall/timingleaks/crypto_sign/bluegemss192/opt/work/sqr_gf2x.c:316: undefined reference to `_mm_cvtsi128_si64x'
try.c: clang: error: linker command failed with exit code 1 (use -v to see invocation)

Number of similar (implementation,compiler) pairs: 1, namely:
ImplementationCompiler
T:optclang -march=native -O3 -fwrapv -Qunused-arguments -fPIC -fPIE -gdwarf-4 -Wall (Ubuntu_Clang_14.0.0)

Compiler output


mul_gf2x.c: mul_gf2x.c:13:12: warning: implicit declaration of function '_mm_cvtsi128_si64x' is invalid in C99 [-Wimplicit-function-declaration]
mul_gf2x.c:     return MUL64LOW(x,y,0);
mul_gf2x.c:            ^
mul_gf2x.c: ./mul_gf2x.h:905:27: note: expanded from macro 'MUL64LOW'
mul_gf2x.c: #define MUL64LOW(x,y,pos) _mm_cvtsi128_si64x(_mm_clmulepi64_si128(x, y, pos))
mul_gf2x.c:                           ^
mul_gf2x.c: 1 warning generated.
sqr_gf2x.c: sqr_gf2x.c:27:12: warning: implicit declaration of function '_mm_cvtsi128_si64x' is invalid in C99 [-Wimplicit-function-declaration]
sqr_gf2x.c:     return _mm_cvtsi128_si64x(_mm_clmulepi64_si128(x,x,0));
sqr_gf2x.c:            ^
sqr_gf2x.c: sqr_gf2x.c:316:12: warning: implicit declaration of function '_mm_cvtsi128_si64x' is invalid in C99 [-Wimplicit-function-declaration]
sqr_gf2x.c:     return SQR64LOW(x,0);
sqr_gf2x.c:            ^
sqr_gf2x.c: ./sqr_gf2x.h:250:25: note: expanded from macro 'SQR64LOW'
sqr_gf2x.c: #define SQR64LOW(x,pos) _mm_cvtsi128_si64x(_mm_clmulepi64_si128(x, x, pos))
sqr_gf2x.c:                         ^
sqr_gf2x.c: 2 warnings generated.
try.c: /usr/bin/ld: libcrypto_sign_bluegemss192.a(mul_gf2x.o): in function `BlueGeMSS_192U_mul64low':
try.c: .../supercop-data/rumba5/amd64/try/c/clang_-march=native_-O_-fwrapv_-Qunused-arguments_-fPIC_-fPIE_-gdwarf-4_-Wall/timingleaks/crypto_sign/bluegemss192/opt/work/mul_gf2x.c:13: undefined reference to `_mm_cvtsi128_si64x'
try.c: /usr/bin/ld: libcrypto_sign_bluegemss192.a(sqr_gf2x.o): in function `BlueGeMSS_192U_sqr64low':
try.c: .../supercop-data/rumba5/amd64/try/c/clang_-march=native_-O_-fwrapv_-Qunused-arguments_-fPIC_-fPIE_-gdwarf-4_-Wall/timingleaks/crypto_sign/bluegemss192/opt/work/sqr_gf2x.c:27: undefined reference to `_mm_cvtsi128_si64x'
try.c: /usr/bin/ld: libcrypto_sign_bluegemss192.a(sqr_gf2x.o): in function `BlueGeMSS_192U_old_square64low':
try.c: .../supercop-data/rumba5/amd64/try/c/clang_-march=native_-O_-fwrapv_-Qunused-arguments_-fPIC_-fPIE_-gdwarf-4_-Wall/timingleaks/crypto_sign/bluegemss192/opt/work/sqr_gf2x.c:316: undefined reference to `_mm_cvtsi128_si64x'
try.c: clang: error: linker command failed with exit code 1 (use -v to see invocation)

Number of similar (implementation,compiler) pairs: 1, namely:
ImplementationCompiler
T:optclang -march=native -O -fwrapv -Qunused-arguments -fPIC -fPIE -gdwarf-4 -Wall (Ubuntu_Clang_14.0.0)

Compiler output


mul_gf2x.c: mul_gf2x.c:13:12: warning: implicit declaration of function '_mm_cvtsi128_si64x' is invalid in C99 [-Wimplicit-function-declaration]
mul_gf2x.c:     return MUL64LOW(x,y,0);
mul_gf2x.c:            ^
mul_gf2x.c: ./mul_gf2x.h:905:27: note: expanded from macro 'MUL64LOW'
mul_gf2x.c: #define MUL64LOW(x,y,pos) _mm_cvtsi128_si64x(_mm_clmulepi64_si128(x, y, pos))
mul_gf2x.c:                           ^
mul_gf2x.c: 1 warning generated.
sqr_gf2x.c: sqr_gf2x.c:27:12: warning: implicit declaration of function '_mm_cvtsi128_si64x' is invalid in C99 [-Wimplicit-function-declaration]
sqr_gf2x.c:     return _mm_cvtsi128_si64x(_mm_clmulepi64_si128(x,x,0));
sqr_gf2x.c:            ^
sqr_gf2x.c: sqr_gf2x.c:316:12: warning: implicit declaration of function '_mm_cvtsi128_si64x' is invalid in C99 [-Wimplicit-function-declaration]
sqr_gf2x.c:     return SQR64LOW(x,0);
sqr_gf2x.c:            ^
sqr_gf2x.c: ./sqr_gf2x.h:250:25: note: expanded from macro 'SQR64LOW'
sqr_gf2x.c: #define SQR64LOW(x,pos) _mm_cvtsi128_si64x(_mm_clmulepi64_si128(x, x, pos))
sqr_gf2x.c:                         ^
sqr_gf2x.c: 2 warnings generated.
try.c: /usr/bin/ld: libcrypto_sign_bluegemss192.a(mul_gf2x.o): in function `BlueGeMSS_192U_mul64low':
try.c: .../supercop-data/rumba5/amd64/try/c/clang_-march=native_-Os_-fwrapv_-Qunused-arguments_-fPIC_-fPIE_-gdwarf-4_-Wall/timingleaks/crypto_sign/bluegemss192/opt/work/mul_gf2x.c:13: undefined reference to `_mm_cvtsi128_si64x'
try.c: /usr/bin/ld: libcrypto_sign_bluegemss192.a(sqr_gf2x.o): in function `BlueGeMSS_192U_sqr64low':
try.c: .../supercop-data/rumba5/amd64/try/c/clang_-march=native_-Os_-fwrapv_-Qunused-arguments_-fPIC_-fPIE_-gdwarf-4_-Wall/timingleaks/crypto_sign/bluegemss192/opt/work/sqr_gf2x.c:27: undefined reference to `_mm_cvtsi128_si64x'
try.c: /usr/bin/ld: libcrypto_sign_bluegemss192.a(sqr_gf2x.o): in function `BlueGeMSS_192U_old_square64low':
try.c: .../supercop-data/rumba5/amd64/try/c/clang_-march=native_-Os_-fwrapv_-Qunused-arguments_-fPIC_-fPIE_-gdwarf-4_-Wall/timingleaks/crypto_sign/bluegemss192/opt/work/sqr_gf2x.c:316: undefined reference to `_mm_cvtsi128_si64x'
try.c: clang: error: linker command failed with exit code 1 (use -v to see invocation)

Number of similar (implementation,compiler) pairs: 1, namely:
ImplementationCompiler
T:optclang -march=native -Os -fwrapv -Qunused-arguments -fPIC -fPIE -gdwarf-4 -Wall (Ubuntu_Clang_14.0.0)

Compiler output


arith_gf2n.c: In file included from arith_gf2n.c:1:
arith_gf2n.c: In file included from ./arith_gf2n.h:9:
arith_gf2n.c: In file included from ./tools_gf2n.h:162:
arith_gf2n.c: ./mul_gf2x.h:17:14: fatal error: 'gf2x/gf2x_mul1.h' file not found
arith_gf2n.c:     #include <gf2x/gf2x_mul1.h>
arith_gf2n.c:              ^~~~~~~~~~~~~~~~~~
arith_gf2n.c: 1 error generated.

Number of similar (implementation,compiler) pairs: 2, namely:
ImplementationCompiler
T:optclang -mcpu=native -O3 -fwrapv -Qunused-arguments -fPIC -fPIE -gdwarf-4 -Wall (Ubuntu_Clang_14.0.0)
T:skylakeclang -mcpu=native -O3 -fwrapv -Qunused-arguments -fPIC -fPIE -gdwarf-4 -Wall (Ubuntu_Clang_14.0.0)

Compiler output


KAT_int.c: clang: warning: treating 'c' input as 'c++' when in C++ mode, this behavior is deprecated [-Wdeprecated]
bit.c: clang: warning: treating 'c' input as 'c++' when in C++ mode, this behavior is deprecated [-Wdeprecated]
convMQS_gf2.c: clang: warning: treating 'c' input as 'c++' when in C++ mode, this behavior is deprecated [-Wdeprecated]
evalMQnocst_gf2.c: clang: warning: treating 'c' input as 'c++' when in C++ mode, this behavior is deprecated [-Wdeprecated]
printgf2x.c: clang: warning: treating 'c' input as 'c++' when in C++ mode, this behavior is deprecated [-Wdeprecated]
sign.c: clang: warning: treating 'c' input as 'c++' when in C++ mode, this behavior is deprecated [-Wdeprecated]
sign_openHFE.c: clang: warning: treating 'c' input as 'c++' when in C++ mode, this behavior is deprecated [-Wdeprecated]

Number of similar (implementation,compiler) pairs: 4, namely:
ImplementationCompiler
T:refclang++ -march=native -O2 -fwrapv -Qunused-arguments -fPIC -fPIE -gdwarf-4 -Wall (Ubuntu_Clang_14.0.0)
T:refclang++ -march=native -O3 -fwrapv -Qunused-arguments -fPIC -fPIE -gdwarf-4 -Wall (Ubuntu_Clang_14.0.0)
T:refclang++ -march=native -O -fwrapv -Qunused-arguments -fPIC -fPIE -gdwarf-4 -Wall (Ubuntu_Clang_14.0.0)
T:refclang++ -march=native -Os -fwrapv -Qunused-arguments -fPIC -fPIE -gdwarf-4 -Wall (Ubuntu_Clang_14.0.0)

Compiler output


mul_gf2x.c: mul_gf2x.c:13:12: warning: implicit declaration of function '_mm_cvtsi128_si64x' is invalid in C99 [-Wimplicit-function-declaration]
mul_gf2x.c:     return MUL64LOW(x,y,0);
mul_gf2x.c:            ^
mul_gf2x.c: ./mul_gf2x.h:905:27: note: expanded from macro 'MUL64LOW'
mul_gf2x.c: #define MUL64LOW(x,y,pos) _mm_cvtsi128_si64x(_mm_clmulepi64_si128(x, y, pos))
mul_gf2x.c:                           ^
mul_gf2x.c: 1 warning generated.
sqr_gf2x.c: sqr_gf2x.c:27:12: warning: implicit declaration of function '_mm_cvtsi128_si64x' is invalid in C99 [-Wimplicit-function-declaration]
sqr_gf2x.c:     return _mm_cvtsi128_si64x(_mm_clmulepi64_si128(x,x,0));
sqr_gf2x.c:            ^
sqr_gf2x.c: sqr_gf2x.c:316:12: warning: implicit declaration of function '_mm_cvtsi128_si64x' is invalid in C99 [-Wimplicit-function-declaration]
sqr_gf2x.c:     return SQR64LOW(x,0);
sqr_gf2x.c:            ^
sqr_gf2x.c: ./sqr_gf2x.h:250:25: note: expanded from macro 'SQR64LOW'
sqr_gf2x.c: #define SQR64LOW(x,pos) _mm_cvtsi128_si64x(_mm_clmulepi64_si128(x, x, pos))
sqr_gf2x.c:                         ^
sqr_gf2x.c: 2 warnings generated.
try.c: /usr/bin/ld: libcrypto_sign_bluegemss192.a(mul_gf2x.o): in function `BlueGeMSS_192U_mul64low':
try.c: .../supercop-data/rumba5/amd64/try/c/clang_-march=native_-O2_-fwrapv_-Qunused-arguments_-fPIC_-fPIE_-gdwarf-4_-Wall/timingleaks/crypto_sign/bluegemss192/skylake/work/mul_gf2x.c:13: undefined reference to `_mm_cvtsi128_si64x'
try.c: /usr/bin/ld: libcrypto_sign_bluegemss192.a(sqr_gf2x.o): in function `BlueGeMSS_192U_sqr64low':
try.c: .../supercop-data/rumba5/amd64/try/c/clang_-march=native_-O2_-fwrapv_-Qunused-arguments_-fPIC_-fPIE_-gdwarf-4_-Wall/timingleaks/crypto_sign/bluegemss192/skylake/work/sqr_gf2x.c:27: undefined reference to `_mm_cvtsi128_si64x'
try.c: /usr/bin/ld: libcrypto_sign_bluegemss192.a(sqr_gf2x.o): in function `BlueGeMSS_192U_old_square64low':
try.c: .../supercop-data/rumba5/amd64/try/c/clang_-march=native_-O2_-fwrapv_-Qunused-arguments_-fPIC_-fPIE_-gdwarf-4_-Wall/timingleaks/crypto_sign/bluegemss192/skylake/work/sqr_gf2x.c:316: undefined reference to `_mm_cvtsi128_si64x'
try.c: clang: error: linker command failed with exit code 1 (use -v to see invocation)

Number of similar (implementation,compiler) pairs: 1, namely:
ImplementationCompiler
T:skylakeclang -march=native -O2 -fwrapv -Qunused-arguments -fPIC -fPIE -gdwarf-4 -Wall (Ubuntu_Clang_14.0.0)

Compiler output


mul_gf2x.c: mul_gf2x.c:13:12: warning: implicit declaration of function '_mm_cvtsi128_si64x' is invalid in C99 [-Wimplicit-function-declaration]
mul_gf2x.c:     return MUL64LOW(x,y,0);
mul_gf2x.c:            ^
mul_gf2x.c: ./mul_gf2x.h:905:27: note: expanded from macro 'MUL64LOW'
mul_gf2x.c: #define MUL64LOW(x,y,pos) _mm_cvtsi128_si64x(_mm_clmulepi64_si128(x, y, pos))
mul_gf2x.c:                           ^
mul_gf2x.c: 1 warning generated.
sqr_gf2x.c: sqr_gf2x.c:27:12: warning: implicit declaration of function '_mm_cvtsi128_si64x' is invalid in C99 [-Wimplicit-function-declaration]
sqr_gf2x.c:     return _mm_cvtsi128_si64x(_mm_clmulepi64_si128(x,x,0));
sqr_gf2x.c:            ^
sqr_gf2x.c: sqr_gf2x.c:316:12: warning: implicit declaration of function '_mm_cvtsi128_si64x' is invalid in C99 [-Wimplicit-function-declaration]
sqr_gf2x.c:     return SQR64LOW(x,0);
sqr_gf2x.c:            ^
sqr_gf2x.c: ./sqr_gf2x.h:250:25: note: expanded from macro 'SQR64LOW'
sqr_gf2x.c: #define SQR64LOW(x,pos) _mm_cvtsi128_si64x(_mm_clmulepi64_si128(x, x, pos))
sqr_gf2x.c:                         ^
sqr_gf2x.c: 2 warnings generated.
try.c: /usr/bin/ld: libcrypto_sign_bluegemss192.a(mul_gf2x.o): in function `BlueGeMSS_192U_mul64low':
try.c: .../supercop-data/rumba5/amd64/try/c/clang_-march=native_-O3_-fwrapv_-Qunused-arguments_-fPIC_-fPIE_-gdwarf-4_-Wall/timingleaks/crypto_sign/bluegemss192/skylake/work/mul_gf2x.c:13: undefined reference to `_mm_cvtsi128_si64x'
try.c: /usr/bin/ld: libcrypto_sign_bluegemss192.a(sqr_gf2x.o): in function `BlueGeMSS_192U_sqr64low':
try.c: .../supercop-data/rumba5/amd64/try/c/clang_-march=native_-O3_-fwrapv_-Qunused-arguments_-fPIC_-fPIE_-gdwarf-4_-Wall/timingleaks/crypto_sign/bluegemss192/skylake/work/sqr_gf2x.c:27: undefined reference to `_mm_cvtsi128_si64x'
try.c: /usr/bin/ld: libcrypto_sign_bluegemss192.a(sqr_gf2x.o): in function `BlueGeMSS_192U_old_square64low':
try.c: .../supercop-data/rumba5/amd64/try/c/clang_-march=native_-O3_-fwrapv_-Qunused-arguments_-fPIC_-fPIE_-gdwarf-4_-Wall/timingleaks/crypto_sign/bluegemss192/skylake/work/sqr_gf2x.c:316: undefined reference to `_mm_cvtsi128_si64x'
try.c: clang: error: linker command failed with exit code 1 (use -v to see invocation)

Number of similar (implementation,compiler) pairs: 1, namely:
ImplementationCompiler
T:skylakeclang -march=native -O3 -fwrapv -Qunused-arguments -fPIC -fPIE -gdwarf-4 -Wall (Ubuntu_Clang_14.0.0)

Compiler output


mul_gf2x.c: mul_gf2x.c:13:12: warning: implicit declaration of function '_mm_cvtsi128_si64x' is invalid in C99 [-Wimplicit-function-declaration]
mul_gf2x.c:     return MUL64LOW(x,y,0);
mul_gf2x.c:            ^
mul_gf2x.c: ./mul_gf2x.h:905:27: note: expanded from macro 'MUL64LOW'
mul_gf2x.c: #define MUL64LOW(x,y,pos) _mm_cvtsi128_si64x(_mm_clmulepi64_si128(x, y, pos))
mul_gf2x.c:                           ^
mul_gf2x.c: 1 warning generated.
sqr_gf2x.c: sqr_gf2x.c:27:12: warning: implicit declaration of function '_mm_cvtsi128_si64x' is invalid in C99 [-Wimplicit-function-declaration]
sqr_gf2x.c:     return _mm_cvtsi128_si64x(_mm_clmulepi64_si128(x,x,0));
sqr_gf2x.c:            ^
sqr_gf2x.c: sqr_gf2x.c:316:12: warning: implicit declaration of function '_mm_cvtsi128_si64x' is invalid in C99 [-Wimplicit-function-declaration]
sqr_gf2x.c:     return SQR64LOW(x,0);
sqr_gf2x.c:            ^
sqr_gf2x.c: ./sqr_gf2x.h:250:25: note: expanded from macro 'SQR64LOW'
sqr_gf2x.c: #define SQR64LOW(x,pos) _mm_cvtsi128_si64x(_mm_clmulepi64_si128(x, x, pos))
sqr_gf2x.c:                         ^
sqr_gf2x.c: 2 warnings generated.
try.c: /usr/bin/ld: libcrypto_sign_bluegemss192.a(mul_gf2x.o): in function `BlueGeMSS_192U_mul64low':
try.c: .../supercop-data/rumba5/amd64/try/c/clang_-march=native_-O_-fwrapv_-Qunused-arguments_-fPIC_-fPIE_-gdwarf-4_-Wall/timingleaks/crypto_sign/bluegemss192/skylake/work/mul_gf2x.c:13: undefined reference to `_mm_cvtsi128_si64x'
try.c: /usr/bin/ld: libcrypto_sign_bluegemss192.a(sqr_gf2x.o): in function `BlueGeMSS_192U_sqr64low':
try.c: .../supercop-data/rumba5/amd64/try/c/clang_-march=native_-O_-fwrapv_-Qunused-arguments_-fPIC_-fPIE_-gdwarf-4_-Wall/timingleaks/crypto_sign/bluegemss192/skylake/work/sqr_gf2x.c:27: undefined reference to `_mm_cvtsi128_si64x'
try.c: /usr/bin/ld: libcrypto_sign_bluegemss192.a(sqr_gf2x.o): in function `BlueGeMSS_192U_old_square64low':
try.c: .../supercop-data/rumba5/amd64/try/c/clang_-march=native_-O_-fwrapv_-Qunused-arguments_-fPIC_-fPIE_-gdwarf-4_-Wall/timingleaks/crypto_sign/bluegemss192/skylake/work/sqr_gf2x.c:316: undefined reference to `_mm_cvtsi128_si64x'
try.c: clang: error: linker command failed with exit code 1 (use -v to see invocation)

Number of similar (implementation,compiler) pairs: 1, namely:
ImplementationCompiler
T:skylakeclang -march=native -O -fwrapv -Qunused-arguments -fPIC -fPIE -gdwarf-4 -Wall (Ubuntu_Clang_14.0.0)

Compiler output


mul_gf2x.c: mul_gf2x.c:13:12: warning: implicit declaration of function '_mm_cvtsi128_si64x' is invalid in C99 [-Wimplicit-function-declaration]
mul_gf2x.c:     return MUL64LOW(x,y,0);
mul_gf2x.c:            ^
mul_gf2x.c: ./mul_gf2x.h:905:27: note: expanded from macro 'MUL64LOW'
mul_gf2x.c: #define MUL64LOW(x,y,pos) _mm_cvtsi128_si64x(_mm_clmulepi64_si128(x, y, pos))
mul_gf2x.c:                           ^
mul_gf2x.c: 1 warning generated.
sqr_gf2x.c: sqr_gf2x.c:27:12: warning: implicit declaration of function '_mm_cvtsi128_si64x' is invalid in C99 [-Wimplicit-function-declaration]
sqr_gf2x.c:     return _mm_cvtsi128_si64x(_mm_clmulepi64_si128(x,x,0));
sqr_gf2x.c:            ^
sqr_gf2x.c: sqr_gf2x.c:316:12: warning: implicit declaration of function '_mm_cvtsi128_si64x' is invalid in C99 [-Wimplicit-function-declaration]
sqr_gf2x.c:     return SQR64LOW(x,0);
sqr_gf2x.c:            ^
sqr_gf2x.c: ./sqr_gf2x.h:250:25: note: expanded from macro 'SQR64LOW'
sqr_gf2x.c: #define SQR64LOW(x,pos) _mm_cvtsi128_si64x(_mm_clmulepi64_si128(x, x, pos))
sqr_gf2x.c:                         ^
sqr_gf2x.c: 2 warnings generated.
try.c: /usr/bin/ld: libcrypto_sign_bluegemss192.a(mul_gf2x.o): in function `BlueGeMSS_192U_mul64low':
try.c: .../supercop-data/rumba5/amd64/try/c/clang_-march=native_-Os_-fwrapv_-Qunused-arguments_-fPIC_-fPIE_-gdwarf-4_-Wall/timingleaks/crypto_sign/bluegemss192/skylake/work/mul_gf2x.c:13: undefined reference to `_mm_cvtsi128_si64x'
try.c: /usr/bin/ld: libcrypto_sign_bluegemss192.a(sqr_gf2x.o): in function `BlueGeMSS_192U_sqr64low':
try.c: .../supercop-data/rumba5/amd64/try/c/clang_-march=native_-Os_-fwrapv_-Qunused-arguments_-fPIC_-fPIE_-gdwarf-4_-Wall/timingleaks/crypto_sign/bluegemss192/skylake/work/sqr_gf2x.c:27: undefined reference to `_mm_cvtsi128_si64x'
try.c: /usr/bin/ld: libcrypto_sign_bluegemss192.a(sqr_gf2x.o): in function `BlueGeMSS_192U_old_square64low':
try.c: .../supercop-data/rumba5/amd64/try/c/clang_-march=native_-Os_-fwrapv_-Qunused-arguments_-fPIC_-fPIE_-gdwarf-4_-Wall/timingleaks/crypto_sign/bluegemss192/skylake/work/sqr_gf2x.c:316: undefined reference to `_mm_cvtsi128_si64x'
try.c: clang: error: linker command failed with exit code 1 (use -v to see invocation)

Number of similar (implementation,compiler) pairs: 1, namely:
ImplementationCompiler
T:skylakeclang -march=native -Os -fwrapv -Qunused-arguments -fPIC -fPIE -gdwarf-4 -Wall (Ubuntu_Clang_14.0.0)