Implementation notes: amd64, rumba5, crypto_kem/titaniumccastd

Computer: rumba5
Architecture: amd64
CPU ID: AuthenticAMD-00800f11-178bfbff
SUPERCOP version: 20210604
Operation: crypto_kem
Primitive: titaniumccastd
TimeObject sizeTest sizeImplementationCompilerBenchmark dateSUPERCOP version
369281591717 0 0250550 828 1752T:avx2clang_-march=native_-O_-fomit-frame-pointer_-fwrapv_-Qunused-arguments_-fPIC_-fPIE2021012920210114
369352191717 0 0250550 828 1752T:avx2clang_-march=native_-O2_-fomit-frame-pointer_-fwrapv_-Qunused-arguments_-fPIC_-fPIE2021012920210114
371676493412 0 0252310 828 1752T:avx2clang_-march=native_-O3_-fomit-frame-pointer_-fwrapv_-Qunused-arguments_-fPIC_-fPIE2021012920210114
379737683727 0 0239788 820 1752T:avx2clang_-march=native_-Os_-fomit-frame-pointer_-fwrapv_-Qunused-arguments_-fPIC_-fPIE2021012920210114
384785386927 0 0244911 828 1800T:avx2gcc_-march=native_-mtune=native_-O2_-fomit-frame-pointer_-fwrapv_-fPIC_-fPIE2021012920210114
3851150105723 0 0265687 828 1800T:avx2gcc_-march=native_-mtune=native_-O3_-fomit-frame-pointer_-fwrapv_-fPIC_-fPIE2021012920210114
405297086294 0 0243839 828 1800T:avx2gcc_-march=native_-mtune=native_-O_-fomit-frame-pointer_-fwrapv_-fPIC_-fPIE2021012920210114
441067289089 0 0247862 828 1752T:optclang_-march=native_-O3_-fomit-frame-pointer_-fwrapv_-Qunused-arguments_-fPIC_-fPIE2021012920210114
441195678954 0 0237654 828 1752T:optclang_-march=native_-O2_-fomit-frame-pointer_-fwrapv_-Qunused-arguments_-fPIC_-fPIE2021012920210114
441543078954 0 0237654 828 1752T:optclang_-march=native_-O_-fomit-frame-pointer_-fwrapv_-Qunused-arguments_-fPIC_-fPIE2021012920210114
447628284758 0 0244759 828 1800T:optgcc_-march=native_-mtune=native_-O3_-fomit-frame-pointer_-fwrapv_-fPIC_-fPIE2021012920210114
450841952278 0 0208476 820 1752T:optclang_-march=native_-Os_-fomit-frame-pointer_-fwrapv_-Qunused-arguments_-fPIC_-fPIE2021012920210114
457049973526 0 0232822 828 1752T:optclang_-mcpu=native_-O3_-fomit-frame-pointer_-fwrapv_-Qunused-arguments_-fPIC_-fPIE2021012920210114
473238350627 0 0208759 828 1800T:optgcc_-march=native_-mtune=native_-O2_-fomit-frame-pointer_-fwrapv_-fPIC_-fPIE2021012920210114
486712250372 0 0208143 828 1800T:optgcc_-march=native_-mtune=native_-O_-fomit-frame-pointer_-fwrapv_-fPIC_-fPIE2021012920210114
37535141861447 0 0220742 828 1752T:refclang_-mcpu=native_-O3_-fomit-frame-pointer_-fwrapv_-Qunused-arguments_-fPIC_-fPIE2021012920210114
37806910446971 0 0206927 828 1800T:refgcc_-march=native_-mtune=native_-O3_-fomit-frame-pointer_-fwrapv_-fPIC_-fPIE2021012920210114
37976340234389 0 0190468 820 1752T:refclang_-march=native_-Os_-fomit-frame-pointer_-fwrapv_-Qunused-arguments_-fPIC_-fPIE2021012920210114
37998526533149 0 0191215 828 1800T:refgcc_-march=native_-mtune=native_-O2_-fomit-frame-pointer_-fwrapv_-fPIC_-fPIE2021012920210114
40762214378141 0 0237278 828 1752T:refclang_-march=native_-O3_-fomit-frame-pointer_-fwrapv_-Qunused-arguments_-fPIC_-fPIE2021012920210114
40807926144499 0 0203518 828 1752T:refclang_-march=native_-O_-fomit-frame-pointer_-fwrapv_-Qunused-arguments_-fPIC_-fPIE2021012920210114
40808664444499 0 0203518 828 1752T:refclang_-march=native_-O2_-fomit-frame-pointer_-fwrapv_-Qunused-arguments_-fPIC_-fPIE2021012920210114
50068906833149 0 0190759 828 1800T:refgcc_-march=native_-mtune=native_-O_-fomit-frame-pointer_-fwrapv_-fPIC_-fPIE2021012920210114

Compiler output

Implementation: T:avx2
Security model: timingleaks
Compiler: clang -mcpu=native -O3 -fomit-frame-pointer -fwrapv -Qunused-arguments -fPIC -fPIE
encrypt.c: encrypt.c:67:8: error: always_inline function '_mm256_loadu_si256' requires target feature 'sse4.2', but would be inlined into function 'crypto_encrypt_keypair' that is compiled without support for 'sse4.2'
encrypt.c: u = _mm256_loadu_si256((__m256i *)(a[i] + j));
encrypt.c: ^
encrypt.c: encrypt.c:68:8: error: always_inline function '_mm256_loadu_si256' requires target feature 'sse4.2', but would be inlined into function 'crypto_encrypt_keypair' that is compiled without support for 'sse4.2'
encrypt.c: v = _mm256_loadu_si256((__m256i *)(s + j));
encrypt.c: ^
encrypt.c: encrypt.c:69:8: error: always_inline function '_mm256_mul_epu32' requires target feature 'avx2', but would be inlined into function 'crypto_encrypt_keypair' that is compiled without support for 'avx2'
encrypt.c: t = _mm256_mul_epu32(u, v);
encrypt.c: ^
encrypt.c: encrypt.c:70:4: error: always_inline function '_mm256_storeu_si256' requires target feature 'sse4.2', but would be inlined into function 'crypto_encrypt_keypair' that is compiled without support for 'sse4.2'
encrypt.c: _mm256_storeu_si256((__m256i *)(a[i] + j), t);
encrypt.c: ^
encrypt.c: encrypt.c:82:8: error: always_inline function '_mm256_loadu_si256' requires target feature 'sse4.2', but would be inlined into function 'crypto_encrypt_keypair' that is compiled without support for 'sse4.2'
encrypt.c: u = _mm256_loadu_si256((__m256i *)(a[i] + j));
encrypt.c: ^
encrypt.c: encrypt.c:83:8: error: always_inline function '_mm256_loadu_si256' requires target feature 'sse4.2', but would be inlined into function 'crypto_encrypt_keypair' that is compiled without support for 'sse4.2'
encrypt.c: v = _mm256_loadu_si256((__m256i *)(e[i] + j));
encrypt.c: ^
encrypt.c: encrypt.c:84:8: error: always_inline function '_mm256_add_epi64' requires target feature 'avx2', but would be inlined into function 'crypto_encrypt_keypair' that is compiled without support for 'avx2'
encrypt.c: t = _mm256_add_epi64(u, v);
encrypt.c: ^
encrypt.c: encrypt.c:85:9: error: always_inline function '_mm256_mul_epu32' requires target feature 'avx2', but would be inlined into function 'crypto_encrypt_keypair' that is compiled without support for 'avx2'
encrypt.c: t1 = _mm256_mul_epu32(t, V_B4Q_B4Q_B4Q_B4Q);
encrypt.c: ^
encrypt.c: encrypt.c:86:9: error: always_inline function '_mm256_srli_epi64' requires target feature 'avx2', but would be inlined into function 'crypto_encrypt_keypair' that is compiled without support for 'avx2'
encrypt.c: ...

Number of similar (compiler,implementation) pairs: 1, namely:
CompilerImplementations
clang -mcpu=native -O3 -fomit-frame-pointer -fwrapv -Qunused-arguments -fPIC -fPIE T:avx2

Compiler output

Implementation: T:avx2
Security model: timingleaks
Compiler: gcc -march=native -mtune=native -Os -fomit-frame-pointer -fwrapv -fPIC -fPIE
try.c: crypto_kem_titaniumccastd.a(sampler.o): In function `sampler_zq':
try.c: sampler.c:(.text+0x...): undefined reference to `load_24'
try.c: sampler.c:(.text+0x...): undefined reference to `barrett_zq'
try.c: collect2: error: ld returned 1 exit status

Number of similar (compiler,implementation) pairs: 1, namely:
CompilerImplementations
gcc -march=native -mtune=native -Os -fomit-frame-pointer -fwrapv -fPIC -fPIE T:avx2

Compiler output

Implementation: T:opt
Security model: timingleaks
Compiler: gcc -march=native -mtune=native -Os -fomit-frame-pointer -fwrapv -fPIC -fPIE
try.c: crypto_kem_titaniumccastd.a(encrypt.o): In function `crypto_encrypt_keypair':
try.c: encrypt.c:(.text+0x...): undefined reference to `barrett_4q2'
try.c: encrypt.c:(.text+0x...): undefined reference to `barrett_4q'
try.c: crypto_kem_titaniumccastd.a(encrypt.o): In function `crypto_encrypt':
try.c: encrypt.c:(.text+0x...): undefined reference to `barrett_4q2'
try.c: encrypt.c:(.text+0x...): undefined reference to `barrett_4q2'
try.c: crypto_kem_titaniumccastd.a(encrypt.o): In function `crypto_encrypt_open':
try.c: encrypt.c:(.text+0x...): undefined reference to `barrett_4q2'
try.c: crypto_kem_titaniumccastd.a(fastrandombytes.o): In function `fastrandombytes':
try.c: fastrandombytes.c:(.text+0x...): undefined reference to `load_32'
try.c: fastrandombytes.c:(.text+0x...): undefined reference to `store_32'
try.c: crypto_kem_titaniumccastd.a(ntt.o): In function `ntt_2':
try.c: ntt.c:(.text+0x...): undefined reference to `barrett_4q'
try.c: ntt.c:(.text+0x...): undefined reference to `barrett_4q'
try.c: ntt.c:(.text+0x...): undefined reference to `barrett_4q'
try.c: ntt.c:(.text+0x...): undefined reference to `barrett_4q2'
try.c: ntt.c:(.text+0x...): undefined reference to `barrett_4q'
try.c: ntt.c:(.text+0x...): undefined reference to `barrett_4q'
try.c: ntt.c:(.text+0x...): undefined reference to `barrett_4q'
try.c: ntt.c:(.text+0x...): undefined reference to `barrett_4q2'
try.c: ntt.c:(.text+0x...): undefined reference to `barrett_4q'
try.c: ntt.c:(.text+0x...): undefined reference to `barrett_4q'
try.c: crypto_kem_titaniumccastd.a(ntt.o): In function `ntt_core':
try.c: ntt.c:(.text+0x...): undefined reference to `barrett_2q2'
try.c: crypto_kem_titaniumccastd.a(ntt.o): In function `intt_core':
try.c: ...

Number of similar (compiler,implementation) pairs: 1, namely:
CompilerImplementations
gcc -march=native -mtune=native -Os -fomit-frame-pointer -fwrapv -fPIC -fPIE T:opt

Compiler output

Implementation: T:ref
Security model: timingleaks
Compiler: gcc -march=native -mtune=native -Os -fomit-frame-pointer -fwrapv -fPIC -fPIE
try.c: crypto_kem_titaniumccastd.a(fastrandombytes.o): In function `fastrandombytes':
try.c: fastrandombytes.c:(.text+0x...): undefined reference to `load_32'
try.c: fastrandombytes.c:(.text+0x...): undefined reference to `store_32'
try.c: crypto_kem_titaniumccastd.a(sampler.o): In function `sampler_zq':
try.c: sampler.c:(.text+0x...): undefined reference to `load_24'
try.c: collect2: error: ld returned 1 exit status

Number of similar (compiler,implementation) pairs: 1, namely:
CompilerImplementations
gcc -march=native -mtune=native -Os -fomit-frame-pointer -fwrapv -fPIC -fPIE T:ref

Namespace violations

Implementation: T:avx2
Security model: timingleaks
Compiler: clang -march=native -O2 -fomit-frame-pointer -fwrapv -Qunused-arguments -fPIC -fPIE
encrypt.o crypto_encrypt T
encrypt.o crypto_encrypt_keypair T
encrypt.o crypto_encrypt_open T
fastrandombytes.o fastrandombytes T
fastrandombytes.o fastrandombytes_setseed T
fastrandombytes.o iv C
fastrandombytes.o key C
ntt.o intt_1536_1536_inv T
ntt.o intt_1792_256 T
ntt.o intt_1792_768 T
ntt.o intt_768_256 T
ntt.o ntt_1024_1536 T
ntt.o ntt_1024_1792 T
ntt.o ntt_1536_1792 T
ntt.o ntt_512_1536 T
ntt.o ntt_768_768_inv T
pack.o poly_decode T
pack.o poly_decode_c2 T
pack.o poly_encode T
pack.o poly_encode_c2 T
sampler.o sampler_binomial T
sampler.o sampler_zb T
sampler.o sampler_zq T

Number of similar (compiler,implementation) pairs: 15, namely:
CompilerImplementations
clang -march=native -O2 -fomit-frame-pointer -fwrapv -Qunused-arguments -fPIC -fPIE T:avx2
clang -march=native -O3 -fomit-frame-pointer -fwrapv -Qunused-arguments -fPIC -fPIE T:avx2
clang -march=native -O -fomit-frame-pointer -fwrapv -Qunused-arguments -fPIC -fPIE T:avx2
clang -march=native -Os -fomit-frame-pointer -fwrapv -Qunused-arguments -fPIC -fPIE T:avx2
gcc -march=native -mtune=native -O2 -fomit-frame-pointer -fwrapv -fPIC -fPIE T:avx2
gcc -march=native -mtune=native -O3 -fomit-frame-pointer -fwrapv -fPIC -fPIE T:avx2
gcc -march=native -mtune=native -O -fomit-frame-pointer -fwrapv -fPIC -fPIE T:avx2
clang -march=native -O2 -fomit-frame-pointer -fwrapv -Qunused-arguments -fPIC -fPIE T:opt
clang -march=native -O3 -fomit-frame-pointer -fwrapv -Qunused-arguments -fPIC -fPIE T:opt
clang -march=native -O -fomit-frame-pointer -fwrapv -Qunused-arguments -fPIC -fPIE T:opt
clang -march=native -Os -fomit-frame-pointer -fwrapv -Qunused-arguments -fPIC -fPIE T:opt
clang -mcpu=native -O3 -fomit-frame-pointer -fwrapv -Qunused-arguments -fPIC -fPIE T:opt
gcc -march=native -mtune=native -O2 -fomit-frame-pointer -fwrapv -fPIC -fPIE T:opt
gcc -march=native -mtune=native -O3 -fomit-frame-pointer -fwrapv -fPIC -fPIE T:opt
gcc -march=native -mtune=native -O -fomit-frame-pointer -fwrapv -fPIC -fPIE T:opt

Namespace violations

Implementation: T:ref
Security model: timingleaks
Compiler: clang -march=native -O2 -fomit-frame-pointer -fwrapv -Qunused-arguments -fPIC -fPIE
encrypt.o crypto_encrypt T
encrypt.o crypto_encrypt_keypair T
encrypt.o crypto_encrypt_open T
fastrandombytes.o fastrandombytes T
fastrandombytes.o fastrandombytes_setseed T
fastrandombytes.o iv C
fastrandombytes.o key C
ntt.o intt_1536_1536_inv T
ntt.o intt_1792_1792 T
ntt.o intt_768_768 T
ntt.o ntt_1536_1536 T
ntt.o ntt_768_768_inv T
pack.o poly_decode T
pack.o poly_decode_c2 T
pack.o poly_encode T
pack.o poly_encode_c2 T
product.o mp T
product.o product T
sampler.o sampler_binomial T
sampler.o sampler_zb T
sampler.o sampler_zq T

Number of similar (compiler,implementation) pairs: 8, namely:
CompilerImplementations
clang -march=native -O2 -fomit-frame-pointer -fwrapv -Qunused-arguments -fPIC -fPIE T:ref
clang -march=native -O3 -fomit-frame-pointer -fwrapv -Qunused-arguments -fPIC -fPIE T:ref
clang -march=native -O -fomit-frame-pointer -fwrapv -Qunused-arguments -fPIC -fPIE T:ref
clang -march=native -Os -fomit-frame-pointer -fwrapv -Qunused-arguments -fPIC -fPIE T:ref
clang -mcpu=native -O3 -fomit-frame-pointer -fwrapv -Qunused-arguments -fPIC -fPIE T:ref
gcc -march=native -mtune=native -O2 -fomit-frame-pointer -fwrapv -fPIC -fPIE T:ref
gcc -march=native -mtune=native -O3 -fomit-frame-pointer -fwrapv -fPIC -fPIE T:ref
gcc -march=native -mtune=native -O -fomit-frame-pointer -fwrapv -fPIC -fPIE T:ref