Implementation notes: amd64, rumba5, crypto_hash/luffa512

Computer: rumba5
Microarchitecture: amd64; Zen (800f11)
Architecture: amd64
CPU ID: AuthenticAMD-00800f11-178bfbff
SUPERCOP version: 20240716
Operation: crypto_hash
Primitive: luffa512
TimeObject sizeTest sizeImplementationCompilerBenchmark dateSUPERCOP version
309408899 0 54422691 844 1472T:sse2clang_-march=native_-O3_-fwrapv_-Qunused-arguments_-fPIC_-fPIE_-gdwarf-4_-Wall2024071620240716
311918899 0 54422315 844 1472T:sse2clang_-march=native_-O2_-fwrapv_-Qunused-arguments_-fPIC_-fPIE_-gdwarf-4_-Wall2024071620240716
324317818 0 54419093 836 1504T:sse2clang_-march=native_-Os_-fwrapv_-Qunused-arguments_-fPIC_-fPIE_-gdwarf-4_-Wall2024071620240716
3247611296 0 54424027 844 1440T:sse2clang_-mcpu=native_-O3_-fwrapv_-Qunused-arguments_-fPIC_-fPIE_-gdwarf-4_-Wall2024071620240716
331419782 0 54423045 804 1504T:sse2gcc_-march=native_-mtune=native_-O3_-fwrapv_-fPIC_-fPIE_-gdwarf-4_-Wall2024071620240716
333768205 0 54418520 780 1472T:sse2gcc_-march=native_-mtune=native_-Os_-fwrapv_-fPIC_-fPIE_-gdwarf-4_-Wall2024071620240716
336719091 0 54421077 804 1504T:sse2gcc_-march=native_-mtune=native_-O2_-fwrapv_-fPIC_-fPIE_-gdwarf-4_-Wall2024071620240716
349939711 0 54421052 796 1504T:sse2gcc_-march=native_-mtune=native_-O_-fwrapv_-fPIC_-fPIE_-gdwarf-4_-Wall2024071620240716
373468954 0 54419539 844 1440T:sse2clang_-march=native_-O_-fwrapv_-Qunused-arguments_-fPIC_-fPIE_-gdwarf-4_-Wall2024071620240716
4897427775 0 039837 804 960T:sphlibgcc_-march=native_-mtune=native_-O2_-fwrapv_-fPIC_-fPIE_-gdwarf-4_-Wall2024071620240716
4920627919 0 041261 804 960T:sphlibgcc_-march=native_-mtune=native_-O3_-fwrapv_-fPIC_-fPIE_-gdwarf-4_-Wall2024071620240716
4984826869 0 038373 804 960T:sphlibgcc_-march=native_-mtune=native_-O_-fwrapv_-fPIC_-fPIE_-gdwarf-4_-Wall2024071620240716
5018417196 320 030883 1172 928T:opt32clang_-march=native_-O3_-fwrapv_-Qunused-arguments_-fPIC_-fPIE_-gdwarf-4_-Wall2024071620240716
5040725753 0 039459 844 928T:sphlibclang_-march=native_-O2_-fwrapv_-Qunused-arguments_-fPIC_-fPIE_-gdwarf-4_-Wall2024071620240716
5064525769 0 039851 844 928T:sphlibclang_-march=native_-O3_-fwrapv_-Qunused-arguments_-fPIC_-fPIE_-gdwarf-4_-Wall2024071620240716
5114025252 0 036629 836 960T:sphlibclang_-march=native_-Os_-fwrapv_-Qunused-arguments_-fPIC_-fPIE_-gdwarf-4_-Wall2024071620240716
5210425717 0 036395 844 896T:sphlibclang_-march=native_-O_-fwrapv_-Qunused-arguments_-fPIC_-fPIE_-gdwarf-4_-Wall2024071620240716
5323519235 320 032059 1172 896T:opt32clang_-mcpu=native_-O3_-fwrapv_-Qunused-arguments_-fPIC_-fPIE_-gdwarf-4_-Wall2024071620240716
5435125840 0 038835 844 896T:sphlibclang_-mcpu=native_-O3_-fwrapv_-Qunused-arguments_-fPIC_-fPIE_-gdwarf-4_-Wall2024071620240716
5569523099 0 033496 780 928T:sphlibgcc_-march=native_-mtune=native_-Os_-fwrapv_-fPIC_-fPIE_-gdwarf-4_-Wall2024071620240716
5894917703 320 031029 1132 960T:opt32gcc_-march=native_-mtune=native_-O3_-fwrapv_-fPIC_-fPIE_-gdwarf-4_-Wall2024071620240716
5906916236 320 029707 1172 928T:opt32clang_-march=native_-O2_-fwrapv_-Qunused-arguments_-fPIC_-fPIE_-gdwarf-4_-Wall2024071620240716
695979411 320 020597 1164 960T:opt32clang_-march=native_-Os_-fwrapv_-Qunused-arguments_-fPIC_-fPIE_-gdwarf-4_-Wall2024071620240716
7701511676 320 022347 1172 896T:opt32clang_-march=native_-O_-fwrapv_-Qunused-arguments_-fPIC_-fPIE_-gdwarf-4_-Wall2024071620240716
7985511331 320 023389 1132 960T:opt32gcc_-march=native_-mtune=native_-O2_-fwrapv_-fPIC_-fPIE_-gdwarf-4_-Wall2024071620240716
928559844 320 020232 1108 928T:opt32gcc_-march=native_-mtune=native_-Os_-fwrapv_-fPIC_-fPIE_-gdwarf-4_-Wall2024071620240716
9814411031 320 022436 1124 960T:opt32gcc_-march=native_-mtune=native_-O_-fwrapv_-fPIC_-fPIE_-gdwarf-4_-Wall2024071620240716

Compiler output


luffa.c: luffa.c:76:22: warning: unused variable 'RC00' [-Wunused-const-variable]
luffa.c: static const sph_u32 RC00[8] = {
luffa.c:                      ^
luffa.c: luffa.c:83:22: warning: unused variable 'RC04' [-Wunused-const-variable]
luffa.c: static const sph_u32 RC04[8] = {
luffa.c:                      ^
luffa.c: luffa.c:90:22: warning: unused variable 'RC10' [-Wunused-const-variable]
luffa.c: static const sph_u32 RC10[8] = {
luffa.c:                      ^
luffa.c: luffa.c:97:22: warning: unused variable 'RC14' [-Wunused-const-variable]
luffa.c: static const sph_u32 RC14[8] = {
luffa.c:                      ^
luffa.c: luffa.c:136:22: warning: unused variable 'RC30' [-Wunused-const-variable]
luffa.c: static const sph_u32 RC30[8] = {
luffa.c:                      ^
luffa.c: luffa.c:143:22: warning: unused variable 'RC34' [-Wunused-const-variable]
luffa.c: static const sph_u32 RC34[8] = {
luffa.c:                      ^
luffa.c: 6 warnings generated.

Number of similar (implementation,compiler) pairs: 5, namely:
ImplementationCompiler
T:sphlibclang -march=native -O2 -fwrapv -Qunused-arguments -fPIC -fPIE -gdwarf-4 -Wall (Ubuntu_Clang_14.0.0)
T:sphlibclang -march=native -O3 -fwrapv -Qunused-arguments -fPIC -fPIE -gdwarf-4 -Wall (Ubuntu_Clang_14.0.0)
T:sphlibclang -march=native -O -fwrapv -Qunused-arguments -fPIC -fPIE -gdwarf-4 -Wall (Ubuntu_Clang_14.0.0)
T:sphlibclang -march=native -Os -fwrapv -Qunused-arguments -fPIC -fPIE -gdwarf-4 -Wall (Ubuntu_Clang_14.0.0)
T:sphlibclang -mcpu=native -O3 -fwrapv -Qunused-arguments -fPIC -fPIE -gdwarf-4 -Wall (Ubuntu_Clang_14.0.0)

Compiler output


luffa.c: luffa.c:143:22: warning: 'RC34' defined but not used [-Wunused-const-variable=]
luffa.c:   143 | static const sph_u32 RC34[8] = {
luffa.c:       |                      ^~~~
luffa.c: luffa.c:136:22: warning: 'RC30' defined but not used [-Wunused-const-variable=]
luffa.c:   136 | static const sph_u32 RC30[8] = {
luffa.c:       |                      ^~~~
luffa.c: luffa.c:97:22: warning: 'RC14' defined but not used [-Wunused-const-variable=]
luffa.c:    97 | static const sph_u32 RC14[8] = {
luffa.c:       |                      ^~~~
luffa.c: luffa.c:90:22: warning: 'RC10' defined but not used [-Wunused-const-variable=]
luffa.c:    90 | static const sph_u32 RC10[8] = {
luffa.c:       |                      ^~~~
luffa.c: luffa.c:83:22: warning: 'RC04' defined but not used [-Wunused-const-variable=]
luffa.c:    83 | static const sph_u32 RC04[8] = {
luffa.c:       |                      ^~~~
luffa.c: luffa.c:76:22: warning: 'RC00' defined but not used [-Wunused-const-variable=]
luffa.c:    76 | static const sph_u32 RC00[8] = {
luffa.c:       |                      ^~~~

Number of similar (implementation,compiler) pairs: 4, namely:
ImplementationCompiler
T:sphlibgcc -march=native -mtune=native -O2 -fwrapv -fPIC -fPIE -gdwarf-4 -Wall (11.4.0)
T:sphlibgcc -march=native -mtune=native -O3 -fwrapv -fPIC -fPIE -gdwarf-4 -Wall (11.4.0)
T:sphlibgcc -march=native -mtune=native -O -fwrapv -fPIC -fPIE -gdwarf-4 -Wall (11.4.0)
T:sphlibgcc -march=native -mtune=native -Os -fwrapv -fPIC -fPIE -gdwarf-4 -Wall (11.4.0)

Compiler output


luffa_x64asm.s: luffa_x64asm.s:780:13: error: unknown token in expression
luffa_x64asm.s:     movaps  %xmm0, [IV   ]
luffa_x64asm.s:             ^
luffa_x64asm.s: luffa_x64asm.s:781:13: error: unknown token in expression
luffa_x64asm.s:     movaps  %xmm1, [IV+16]
luffa_x64asm.s:             ^
luffa_x64asm.s: luffa_x64asm.s:782:13: error: unknown token in expression
luffa_x64asm.s:     movaps  %xmm2, [IV+32]
luffa_x64asm.s:             ^
luffa_x64asm.s: luffa_x64asm.s:783:13: error: unknown token in expression
luffa_x64asm.s:     movaps  %xmm3, [IV+48]
luffa_x64asm.s:             ^
luffa_x64asm.s: luffa_x64asm.s:784:13: error: unknown token in expression
luffa_x64asm.s:     movaps  %xmm4, [IV+64]
luffa_x64asm.s:             ^
luffa_x64asm.s: luffa_x64asm.s:785:13: error: unknown token in expression
luffa_x64asm.s:     movaps  %xmm5, [IV+80]
luffa_x64asm.s:             ^
luffa_x64asm.s: luffa_x64asm.s:786:14: error: unknown token in expression
luffa_x64asm.s:     movups  [%rdi   ], %xmm0
luffa_x64asm.s:              ^
luffa_x64asm.s: luffa_x64asm.s:787:14: error: unknown token in expression
luffa_x64asm.s:     movups  [%rdi+16], %xmm1
luffa_x64asm.s:              ^
luffa_x64asm.s: luffa_x64asm.s:788:14: error: unknown token in expression
luffa_x64asm.s: ...

Number of similar (implementation,compiler) pairs: 10, namely:
ImplementationCompiler
T:sse2_x64asmclang -march=native -O2 -fwrapv -Qunused-arguments -fPIC -fPIE -gdwarf-4 -Wall (Ubuntu_Clang_14.0.0)
T:sse2_x64asmclang -march=native -O3 -fwrapv -Qunused-arguments -fPIC -fPIE -gdwarf-4 -Wall (Ubuntu_Clang_14.0.0)
T:sse2_x64asmclang -march=native -O -fwrapv -Qunused-arguments -fPIC -fPIE -gdwarf-4 -Wall (Ubuntu_Clang_14.0.0)
T:sse2_x64asmclang -march=native -Os -fwrapv -Qunused-arguments -fPIC -fPIE -gdwarf-4 -Wall (Ubuntu_Clang_14.0.0)
T:sse2_x64asmclang -mcpu=native -O3 -fwrapv -Qunused-arguments -fPIC -fPIE -gdwarf-4 -Wall (Ubuntu_Clang_14.0.0)
T:ssse3_x64asmclang -march=native -O2 -fwrapv -Qunused-arguments -fPIC -fPIE -gdwarf-4 -Wall (Ubuntu_Clang_14.0.0)
T:ssse3_x64asmclang -march=native -O3 -fwrapv -Qunused-arguments -fPIC -fPIE -gdwarf-4 -Wall (Ubuntu_Clang_14.0.0)
T:ssse3_x64asmclang -march=native -O -fwrapv -Qunused-arguments -fPIC -fPIE -gdwarf-4 -Wall (Ubuntu_Clang_14.0.0)
T:ssse3_x64asmclang -march=native -Os -fwrapv -Qunused-arguments -fPIC -fPIE -gdwarf-4 -Wall (Ubuntu_Clang_14.0.0)
T:ssse3_x64asmclang -mcpu=native -O3 -fwrapv -Qunused-arguments -fPIC -fPIE -gdwarf-4 -Wall (Ubuntu_Clang_14.0.0)

Compiler output


try.c: /usr/bin/ld: libcrypto_hash_luffa512.a(luffa_x64asm.o): relocation R_X86_64_32S against symbol `IV' can not be used when making a PIE object; recompile with -fPIE
try.c: /usr/bin/ld: failed to set dynamic section sizes: bad value
try.c: collect2: error: ld returned 1 exit status

Number of similar (implementation,compiler) pairs: 16, namely:
ImplementationCompiler
T:sse2_x64asmgcc -march=native -mtune=native -O2 -fwrapv -fPIC -fPIE -gdwarf-4 -Wall (11.4.0)
T:sse2_x64asmgcc -march=native -mtune=native -O3 -fwrapv -fPIC -fPIE -gdwarf-4 -Wall (11.4.0)
T:sse2_x64asmgcc -march=native -mtune=native -O -fwrapv -fPIC -fPIE -gdwarf-4 -Wall (11.4.0)
T:sse2_x64asmgcc -march=native -mtune=native -Os -fwrapv -fPIC -fPIE -gdwarf-4 -Wall (11.4.0)
T:sse2_x64asm-2gcc -march=native -mtune=native -O2 -fwrapv -fPIC -fPIE -gdwarf-4 -Wall (11.4.0)
T:sse2_x64asm-2gcc -march=native -mtune=native -O3 -fwrapv -fPIC -fPIE -gdwarf-4 -Wall (11.4.0)
T:sse2_x64asm-2gcc -march=native -mtune=native -O -fwrapv -fPIC -fPIE -gdwarf-4 -Wall (11.4.0)
T:sse2_x64asm-2gcc -march=native -mtune=native -Os -fwrapv -fPIC -fPIE -gdwarf-4 -Wall (11.4.0)
T:ssse3_x64asmgcc -march=native -mtune=native -O2 -fwrapv -fPIC -fPIE -gdwarf-4 -Wall (11.4.0)
T:ssse3_x64asmgcc -march=native -mtune=native -O3 -fwrapv -fPIC -fPIE -gdwarf-4 -Wall (11.4.0)
T:ssse3_x64asmgcc -march=native -mtune=native -O -fwrapv -fPIC -fPIE -gdwarf-4 -Wall (11.4.0)
T:ssse3_x64asmgcc -march=native -mtune=native -Os -fwrapv -fPIC -fPIE -gdwarf-4 -Wall (11.4.0)
T:ssse3_x64asm-2gcc -march=native -mtune=native -O2 -fwrapv -fPIC -fPIE -gdwarf-4 -Wall (11.4.0)
T:ssse3_x64asm-2gcc -march=native -mtune=native -O3 -fwrapv -fPIC -fPIE -gdwarf-4 -Wall (11.4.0)
T:ssse3_x64asm-2gcc -march=native -mtune=native -O -fwrapv -fPIC -fPIE -gdwarf-4 -Wall (11.4.0)
T:ssse3_x64asm-2gcc -march=native -mtune=native -Os -fwrapv -fPIC -fPIE -gdwarf-4 -Wall (11.4.0)

Compiler output


luffa_x64asm.s: luffa_x64asm.s:780:13: error: unknown token in expression
luffa_x64asm.s:     movdqa  %xmm0, [IV   ]
luffa_x64asm.s:             ^
luffa_x64asm.s: luffa_x64asm.s:781:13: error: unknown token in expression
luffa_x64asm.s:     movdqa  %xmm1, [IV+16]
luffa_x64asm.s:             ^
luffa_x64asm.s: luffa_x64asm.s:782:13: error: unknown token in expression
luffa_x64asm.s:     movdqa  %xmm2, [IV+32]
luffa_x64asm.s:             ^
luffa_x64asm.s: luffa_x64asm.s:783:13: error: unknown token in expression
luffa_x64asm.s:     movdqa  %xmm3, [IV+48]
luffa_x64asm.s:             ^
luffa_x64asm.s: luffa_x64asm.s:784:13: error: unknown token in expression
luffa_x64asm.s:     movdqa  %xmm4, [IV+64]
luffa_x64asm.s:             ^
luffa_x64asm.s: luffa_x64asm.s:785:13: error: unknown token in expression
luffa_x64asm.s:     movdqa  %xmm5, [IV+80]
luffa_x64asm.s:             ^
luffa_x64asm.s: luffa_x64asm.s:786:14: error: unknown token in expression
luffa_x64asm.s:     movups  [%rdi   ], %xmm0
luffa_x64asm.s:              ^
luffa_x64asm.s: luffa_x64asm.s:787:14: error: unknown token in expression
luffa_x64asm.s:     movups  [%rdi+16], %xmm1
luffa_x64asm.s:              ^
luffa_x64asm.s: luffa_x64asm.s:788:14: error: unknown token in expression
luffa_x64asm.s: ...

Number of similar (implementation,compiler) pairs: 10, namely:
ImplementationCompiler
T:sse2_x64asm-2clang -march=native -O2 -fwrapv -Qunused-arguments -fPIC -fPIE -gdwarf-4 -Wall (Ubuntu_Clang_14.0.0)
T:sse2_x64asm-2clang -march=native -O3 -fwrapv -Qunused-arguments -fPIC -fPIE -gdwarf-4 -Wall (Ubuntu_Clang_14.0.0)
T:sse2_x64asm-2clang -march=native -O -fwrapv -Qunused-arguments -fPIC -fPIE -gdwarf-4 -Wall (Ubuntu_Clang_14.0.0)
T:sse2_x64asm-2clang -march=native -Os -fwrapv -Qunused-arguments -fPIC -fPIE -gdwarf-4 -Wall (Ubuntu_Clang_14.0.0)
T:sse2_x64asm-2clang -mcpu=native -O3 -fwrapv -Qunused-arguments -fPIC -fPIE -gdwarf-4 -Wall (Ubuntu_Clang_14.0.0)
T:ssse3_x64asm-2clang -march=native -O2 -fwrapv -Qunused-arguments -fPIC -fPIE -gdwarf-4 -Wall (Ubuntu_Clang_14.0.0)
T:ssse3_x64asm-2clang -march=native -O3 -fwrapv -Qunused-arguments -fPIC -fPIE -gdwarf-4 -Wall (Ubuntu_Clang_14.0.0)
T:ssse3_x64asm-2clang -march=native -O -fwrapv -Qunused-arguments -fPIC -fPIE -gdwarf-4 -Wall (Ubuntu_Clang_14.0.0)
T:ssse3_x64asm-2clang -march=native -Os -fwrapv -Qunused-arguments -fPIC -fPIE -gdwarf-4 -Wall (Ubuntu_Clang_14.0.0)
T:ssse3_x64asm-2clang -mcpu=native -O3 -fwrapv -Qunused-arguments -fPIC -fPIE -gdwarf-4 -Wall (Ubuntu_Clang_14.0.0)

Compiler output


luffa256_x64asm.s: luffa256_x64asm.s:297:9: error: unknown token in expression
luffa256_x64asm.s:         movaps  %xmm0, [IV   ]
luffa256_x64asm.s:                 ^
luffa256_x64asm.s: luffa256_x64asm.s:298:9: error: unknown token in expression
luffa256_x64asm.s:         movaps  %xmm1, [IV+16]
luffa256_x64asm.s:                 ^
luffa256_x64asm.s: luffa256_x64asm.s:299:9: error: unknown token in expression
luffa256_x64asm.s:         movaps  %xmm2, [IV+32]
luffa256_x64asm.s:                 ^
luffa256_x64asm.s: luffa256_x64asm.s:300:9: error: unknown token in expression
luffa256_x64asm.s:         movaps  %xmm3, [IV+48]
luffa256_x64asm.s:                 ^
luffa256_x64asm.s: luffa256_x64asm.s:301:9: error: unknown token in expression
luffa256_x64asm.s:         movaps  %xmm4, [IV+64]
luffa256_x64asm.s:                 ^
luffa256_x64asm.s: luffa256_x64asm.s:302:9: error: unknown token in expression
luffa256_x64asm.s:         movaps  %xmm5, [IV+80]
luffa256_x64asm.s:                 ^
luffa256_x64asm.s: luffa256_x64asm.s:303:10: error: unknown token in expression
luffa256_x64asm.s:         movups  [%rdi   ], %xmm0
luffa256_x64asm.s:                  ^
luffa256_x64asm.s: luffa256_x64asm.s:304:10: error: unknown token in expression
luffa256_x64asm.s:         movups  [%rdi+16], %xmm1
luffa256_x64asm.s:                  ^
luffa256_x64asm.s: luffa256_x64asm.s:305:10: error: unknown token in expression
luffa256_x64asm.s: ...

Number of similar (implementation,compiler) pairs: 5, namely:
ImplementationCompiler
T:ssse3_x64asm-PSclang -march=native -O2 -fwrapv -Qunused-arguments -fPIC -fPIE -gdwarf-4 -Wall (Ubuntu_Clang_14.0.0)
T:ssse3_x64asm-PSclang -march=native -O3 -fwrapv -Qunused-arguments -fPIC -fPIE -gdwarf-4 -Wall (Ubuntu_Clang_14.0.0)
T:ssse3_x64asm-PSclang -march=native -O -fwrapv -Qunused-arguments -fPIC -fPIE -gdwarf-4 -Wall (Ubuntu_Clang_14.0.0)
T:ssse3_x64asm-PSclang -march=native -Os -fwrapv -Qunused-arguments -fPIC -fPIE -gdwarf-4 -Wall (Ubuntu_Clang_14.0.0)
T:ssse3_x64asm-PSclang -mcpu=native -O3 -fwrapv -Qunused-arguments -fPIC -fPIE -gdwarf-4 -Wall (Ubuntu_Clang_14.0.0)

Compiler output


try.c: /usr/bin/ld: libcrypto_hash_luffa512.a(luffa256_x64asm.o): relocation R_X86_64_32S against `.rodata' can not be used when making a PIE object; recompile with -fPIE
try.c: /usr/bin/ld: failed to set dynamic section sizes: bad value
try.c: collect2: error: ld returned 1 exit status

Number of similar (implementation,compiler) pairs: 8, namely:
ImplementationCompiler
T:ssse3_x64asm-PSgcc -march=native -mtune=native -O2 -fwrapv -fPIC -fPIE -gdwarf-4 -Wall (11.4.0)
T:ssse3_x64asm-PSgcc -march=native -mtune=native -O3 -fwrapv -fPIC -fPIE -gdwarf-4 -Wall (11.4.0)
T:ssse3_x64asm-PSgcc -march=native -mtune=native -O -fwrapv -fPIC -fPIE -gdwarf-4 -Wall (11.4.0)
T:ssse3_x64asm-PSgcc -march=native -mtune=native -Os -fwrapv -fPIC -fPIE -gdwarf-4 -Wall (11.4.0)
T:ssse3_x64asm-PS-2gcc -march=native -mtune=native -O2 -fwrapv -fPIC -fPIE -gdwarf-4 -Wall (11.4.0)
T:ssse3_x64asm-PS-2gcc -march=native -mtune=native -O3 -fwrapv -fPIC -fPIE -gdwarf-4 -Wall (11.4.0)
T:ssse3_x64asm-PS-2gcc -march=native -mtune=native -O -fwrapv -fPIC -fPIE -gdwarf-4 -Wall (11.4.0)
T:ssse3_x64asm-PS-2gcc -march=native -mtune=native -Os -fwrapv -fPIC -fPIE -gdwarf-4 -Wall (11.4.0)

Compiler output


luffa256_x64asm.s: luffa256_x64asm.s:297:9: error: unknown token in expression
luffa256_x64asm.s:         movdqa  %xmm0, [IV   ]
luffa256_x64asm.s:                 ^
luffa256_x64asm.s: luffa256_x64asm.s:298:9: error: unknown token in expression
luffa256_x64asm.s:         movdqa  %xmm1, [IV+16]
luffa256_x64asm.s:                 ^
luffa256_x64asm.s: luffa256_x64asm.s:299:9: error: unknown token in expression
luffa256_x64asm.s:         movdqa  %xmm2, [IV+32]
luffa256_x64asm.s:                 ^
luffa256_x64asm.s: luffa256_x64asm.s:300:9: error: unknown token in expression
luffa256_x64asm.s:         movdqa  %xmm3, [IV+48]
luffa256_x64asm.s:                 ^
luffa256_x64asm.s: luffa256_x64asm.s:301:9: error: unknown token in expression
luffa256_x64asm.s:         movdqa  %xmm4, [IV+64]
luffa256_x64asm.s:                 ^
luffa256_x64asm.s: luffa256_x64asm.s:302:9: error: unknown token in expression
luffa256_x64asm.s:         movdqa  %xmm5, [IV+80]
luffa256_x64asm.s:                 ^
luffa256_x64asm.s: luffa256_x64asm.s:303:10: error: unknown token in expression
luffa256_x64asm.s:         movdqu  [%rdi   ], %xmm0
luffa256_x64asm.s:                  ^
luffa256_x64asm.s: luffa256_x64asm.s:304:10: error: unknown token in expression
luffa256_x64asm.s:         movdqu  [%rdi+16], %xmm1
luffa256_x64asm.s:                  ^
luffa256_x64asm.s: luffa256_x64asm.s:305:10: error: unknown token in expression
luffa256_x64asm.s: ...

Number of similar (implementation,compiler) pairs: 5, namely:
ImplementationCompiler
T:ssse3_x64asm-PS-2clang -march=native -O2 -fwrapv -Qunused-arguments -fPIC -fPIE -gdwarf-4 -Wall (Ubuntu_Clang_14.0.0)
T:ssse3_x64asm-PS-2clang -march=native -O3 -fwrapv -Qunused-arguments -fPIC -fPIE -gdwarf-4 -Wall (Ubuntu_Clang_14.0.0)
T:ssse3_x64asm-PS-2clang -march=native -O -fwrapv -Qunused-arguments -fPIC -fPIE -gdwarf-4 -Wall (Ubuntu_Clang_14.0.0)
T:ssse3_x64asm-PS-2clang -march=native -Os -fwrapv -Qunused-arguments -fPIC -fPIE -gdwarf-4 -Wall (Ubuntu_Clang_14.0.0)
T:ssse3_x64asm-PS-2clang -mcpu=native -O3 -fwrapv -Qunused-arguments -fPIC -fPIE -gdwarf-4 -Wall (Ubuntu_Clang_14.0.0)

Compiler output


hash.c: hash.c:32:12: warning: passing 'const unsigned char *' to parameter of type 'unsigned char *' discards qualifiers [-Wincompatible-pointer-types-discards-qualifiers]
hash.c:         fLuffa512(in, out, inlen);
hash.c:                   ^~
hash.c: hash.c:29:31: note: passing argument to parameter 'input' here
hash.c: void fLuffa512(unsigned char *input, unsigned char *output, int len);
hash.c:                               ^
hash.c: 1 warning generated.
luffa_512.s: <instantiation>:1:8: error: unknown token in expression
luffa_512.s: pshufb %xmm10, maskShufLittleEndian
luffa_512.s:        ^
luffa_512.s: <instantiation>:1:1: note: while in macro instantiation
luffa_512.s: mPSSTEPI %xmm10, %xmm11, maskShufLittleEndian
luffa_512.s: ^
luffa_512.s: luffa_512.s:303:2: note: while in macro instantiation
luffa_512.s:         mPS %xmm10, %xmm11, %xmm12, %xmm13, %xmm14, %xmm15
luffa_512.s:         ^
luffa_512.s: <instantiation>:2:9: error: unknown token in expression
luffa_512.s:         pshufb %xmm11, maskShufLittleEndian
luffa_512.s:                ^
luffa_512.s: <instantiation>:1:1: note: while in macro instantiation
luffa_512.s: mPSSTEPI %xmm10, %xmm11, maskShufLittleEndian
luffa_512.s: ^
luffa_512.s: luffa_512.s:303:2: note: while in macro instantiation
luffa_512.s:         mPS %xmm10, %xmm11, %xmm12, %xmm13, %xmm14, %xmm15
luffa_512.s:         ^
luffa_512.s: <instantiation>:1:8: error: unknown token in expression
luffa_512.s: movaps %xmm12, %xmm10
luffa_512.s:        ^
luffa_512.s: <instantiation>:2:2: note: while in macro instantiation
luffa_512.s:         mPSSTEPII %xmm10, %xmm11, %xmm12, %xmm13, %xmm14, %xmm15
luffa_512.s:         ^
luffa_512.s: luffa_512.s:303:2: note: while in macro instantiation
luffa_512.s: ...

Number of similar (implementation,compiler) pairs: 5, namely:
ImplementationCompiler
T:thomaz/asm-PSclang -march=native -O2 -fwrapv -Qunused-arguments -fPIC -fPIE -gdwarf-4 -Wall (Ubuntu_Clang_14.0.0)
T:thomaz/asm-PSclang -march=native -O3 -fwrapv -Qunused-arguments -fPIC -fPIE -gdwarf-4 -Wall (Ubuntu_Clang_14.0.0)
T:thomaz/asm-PSclang -march=native -O -fwrapv -Qunused-arguments -fPIC -fPIE -gdwarf-4 -Wall (Ubuntu_Clang_14.0.0)
T:thomaz/asm-PSclang -march=native -Os -fwrapv -Qunused-arguments -fPIC -fPIE -gdwarf-4 -Wall (Ubuntu_Clang_14.0.0)
T:thomaz/asm-PSclang -mcpu=native -O3 -fwrapv -Qunused-arguments -fPIC -fPIE -gdwarf-4 -Wall (Ubuntu_Clang_14.0.0)

Compiler output


hash.c: hash.c: In function 'crypto_hash_luffa512_thomaz_asm_PS_timingleaks':
hash.c: hash.c:32:19: warning: passing argument 1 of 'fLuffa512' discards 'const' qualifier from pointer target type [-Wdiscarded-qualifiers]
hash.c:    32 |         fLuffa512(in, out, inlen);
hash.c:       |                   ^~
hash.c: hash.c:29:31: note: expected 'unsigned char *' but argument is of type 'const unsigned char *'
hash.c:    29 | void fLuffa512(unsigned char *input, unsigned char *output, int len);
hash.c:       |                ~~~~~~~~~~~~~~~^~~~~
try.c: /usr/bin/ld: libcrypto_hash_luffa512.a(luffa_512.o): relocation R_X86_64_32S against `.rodata' can not be used when making a PIE object; recompile with -fPIE
try.c: /usr/bin/ld: failed to set dynamic section sizes: bad value
try.c: collect2: error: ld returned 1 exit status

Number of similar (implementation,compiler) pairs: 4, namely:
ImplementationCompiler
T:thomaz/asm-PSgcc -march=native -mtune=native -O2 -fwrapv -fPIC -fPIE -gdwarf-4 -Wall (11.4.0)
T:thomaz/asm-PSgcc -march=native -mtune=native -O3 -fwrapv -fPIC -fPIE -gdwarf-4 -Wall (11.4.0)
T:thomaz/asm-PSgcc -march=native -mtune=native -O -fwrapv -fPIC -fPIE -gdwarf-4 -Wall (11.4.0)
T:thomaz/asm-PSgcc -march=native -mtune=native -Os -fwrapv -fPIC -fPIE -gdwarf-4 -Wall (11.4.0)

Compiler output


hash.c: hash.c:32:12: warning: passing 'const unsigned char *' to parameter of type 'unsigned char *' discards qualifiers [-Wincompatible-pointer-types-discards-qualifiers]
hash.c:         fLuffa512(in, out, inlen);
hash.c:                   ^~
hash.c: hash.c:29:31: note: passing argument to parameter 'input' here
hash.c: void fLuffa512(unsigned char *input, unsigned char *output, int len);
hash.c:                               ^
hash.c: 1 warning generated.
luffa_512.s: <instantiation>:1:8: error: unknown token in expression
luffa_512.s: pshufb %xmm10, maskShufLittleEndian
luffa_512.s:        ^
luffa_512.s: <instantiation>:1:1: note: while in macro instantiation
luffa_512.s: mPSSTEPI %xmm10, %xmm11, maskShufLittleEndian
luffa_512.s: ^
luffa_512.s: luffa_512.s:302:2: note: while in macro instantiation
luffa_512.s:         mPS %xmm10, %xmm11, %xmm12, %xmm13, %xmm14, %xmm15
luffa_512.s:         ^
luffa_512.s: <instantiation>:2:9: error: unknown token in expression
luffa_512.s:         pshufb %xmm11, maskShufLittleEndian
luffa_512.s:                ^
luffa_512.s: <instantiation>:1:1: note: while in macro instantiation
luffa_512.s: mPSSTEPI %xmm10, %xmm11, maskShufLittleEndian
luffa_512.s: ^
luffa_512.s: luffa_512.s:302:2: note: while in macro instantiation
luffa_512.s:         mPS %xmm10, %xmm11, %xmm12, %xmm13, %xmm14, %xmm15
luffa_512.s:         ^
luffa_512.s: <instantiation>:1:8: error: unknown token in expression
luffa_512.s: movaps %xmm12, %xmm10
luffa_512.s:        ^
luffa_512.s: <instantiation>:2:2: note: while in macro instantiation
luffa_512.s:         mPSSTEPII %xmm10, %xmm11, %xmm12, %xmm13, %xmm14, %xmm15
luffa_512.s:         ^
luffa_512.s: luffa_512.s:302:2: note: while in macro instantiation
luffa_512.s: ...

Number of similar (implementation,compiler) pairs: 5, namely:
ImplementationCompiler
T:thomaz/asm-PS-v2-FPclang -march=native -O2 -fwrapv -Qunused-arguments -fPIC -fPIE -gdwarf-4 -Wall (Ubuntu_Clang_14.0.0)
T:thomaz/asm-PS-v2-FPclang -march=native -O3 -fwrapv -Qunused-arguments -fPIC -fPIE -gdwarf-4 -Wall (Ubuntu_Clang_14.0.0)
T:thomaz/asm-PS-v2-FPclang -march=native -O -fwrapv -Qunused-arguments -fPIC -fPIE -gdwarf-4 -Wall (Ubuntu_Clang_14.0.0)
T:thomaz/asm-PS-v2-FPclang -march=native -Os -fwrapv -Qunused-arguments -fPIC -fPIE -gdwarf-4 -Wall (Ubuntu_Clang_14.0.0)
T:thomaz/asm-PS-v2-FPclang -mcpu=native -O3 -fwrapv -Qunused-arguments -fPIC -fPIE -gdwarf-4 -Wall (Ubuntu_Clang_14.0.0)

Compiler output


hash.c: hash.c: In function 'crypto_hash_luffa512_thomaz_asm_PS_v2_FP_timingleaks':
hash.c: hash.c:32:19: warning: passing argument 1 of 'fLuffa512' discards 'const' qualifier from pointer target type [-Wdiscarded-qualifiers]
hash.c:    32 |         fLuffa512(in, out, inlen);
hash.c:       |                   ^~
hash.c: hash.c:29:31: note: expected 'unsigned char *' but argument is of type 'const unsigned char *'
hash.c:    29 | void fLuffa512(unsigned char *input, unsigned char *output, int len);
hash.c:       |                ~~~~~~~~~~~~~~~^~~~~
try.c: /usr/bin/ld: libcrypto_hash_luffa512.a(luffa_512.o): relocation R_X86_64_32S against `.rodata' can not be used when making a PIE object; recompile with -fPIE
try.c: /usr/bin/ld: failed to set dynamic section sizes: bad value
try.c: collect2: error: ld returned 1 exit status

Number of similar (implementation,compiler) pairs: 4, namely:
ImplementationCompiler
T:thomaz/asm-PS-v2-FPgcc -march=native -mtune=native -O2 -fwrapv -fPIC -fPIE -gdwarf-4 -Wall (11.4.0)
T:thomaz/asm-PS-v2-FPgcc -march=native -mtune=native -O3 -fwrapv -fPIC -fPIE -gdwarf-4 -Wall (11.4.0)
T:thomaz/asm-PS-v2-FPgcc -march=native -mtune=native -O -fwrapv -fPIC -fPIE -gdwarf-4 -Wall (11.4.0)
T:thomaz/asm-PS-v2-FPgcc -march=native -mtune=native -Os -fwrapv -fPIC -fPIE -gdwarf-4 -Wall (11.4.0)

Compiler output


hash.c: hash.c:32:12: warning: passing 'const unsigned char *' to parameter of type 'unsigned char *' discards qualifiers [-Wincompatible-pointer-types-discards-qualifiers]
hash.c:         fLuffa512(in, out, inlen);
hash.c:                   ^~
hash.c: hash.c:29:31: note: passing argument to parameter 'input' here
hash.c: void fLuffa512(unsigned char *input, unsigned char *output, int len);
hash.c:                               ^
hash.c: 1 warning generated.
luffa_512.s: <instantiation>:1:8: error: unknown token in expression
luffa_512.s: pshufb %xmm10, maskShufLittleEndian
luffa_512.s:        ^
luffa_512.s: <instantiation>:1:1: note: while in macro instantiation
luffa_512.s: mPSSTEPI %xmm10, %xmm11, maskShufLittleEndian
luffa_512.s: ^
luffa_512.s: luffa_512.s:305:2: note: while in macro instantiation
luffa_512.s:         mPS %xmm10, %xmm11, %xmm12, %xmm13, %xmm14, %xmm15
luffa_512.s:         ^
luffa_512.s: <instantiation>:2:9: error: unknown token in expression
luffa_512.s:         pshufb %xmm11, maskShufLittleEndian
luffa_512.s:                ^
luffa_512.s: <instantiation>:1:1: note: while in macro instantiation
luffa_512.s: mPSSTEPI %xmm10, %xmm11, maskShufLittleEndian
luffa_512.s: ^
luffa_512.s: luffa_512.s:305:2: note: while in macro instantiation
luffa_512.s:         mPS %xmm10, %xmm11, %xmm12, %xmm13, %xmm14, %xmm15
luffa_512.s:         ^
luffa_512.s: <instantiation>:1:8: error: unknown token in expression
luffa_512.s: movdqa %xmm12, %xmm10
luffa_512.s:        ^
luffa_512.s: <instantiation>:2:2: note: while in macro instantiation
luffa_512.s:         mPSSTEPII %xmm10, %xmm11, %xmm12, %xmm13, %xmm14, %xmm15
luffa_512.s:         ^
luffa_512.s: luffa_512.s:305:2: note: while in macro instantiation
luffa_512.s: ...

Number of similar (implementation,compiler) pairs: 5, namely:
ImplementationCompiler
T:thomaz/asm-PS-v2-INTclang -march=native -O2 -fwrapv -Qunused-arguments -fPIC -fPIE -gdwarf-4 -Wall (Ubuntu_Clang_14.0.0)
T:thomaz/asm-PS-v2-INTclang -march=native -O3 -fwrapv -Qunused-arguments -fPIC -fPIE -gdwarf-4 -Wall (Ubuntu_Clang_14.0.0)
T:thomaz/asm-PS-v2-INTclang -march=native -O -fwrapv -Qunused-arguments -fPIC -fPIE -gdwarf-4 -Wall (Ubuntu_Clang_14.0.0)
T:thomaz/asm-PS-v2-INTclang -march=native -Os -fwrapv -Qunused-arguments -fPIC -fPIE -gdwarf-4 -Wall (Ubuntu_Clang_14.0.0)
T:thomaz/asm-PS-v2-INTclang -mcpu=native -O3 -fwrapv -Qunused-arguments -fPIC -fPIE -gdwarf-4 -Wall (Ubuntu_Clang_14.0.0)

Compiler output


hash.c: hash.c: In function 'crypto_hash_luffa512_thomaz_asm_PS_v2_INT_timingleaks':
hash.c: hash.c:32:19: warning: passing argument 1 of 'fLuffa512' discards 'const' qualifier from pointer target type [-Wdiscarded-qualifiers]
hash.c:    32 |         fLuffa512(in, out, inlen);
hash.c:       |                   ^~
hash.c: hash.c:29:31: note: expected 'unsigned char *' but argument is of type 'const unsigned char *'
hash.c:    29 | void fLuffa512(unsigned char *input, unsigned char *output, int len);
hash.c:       |                ~~~~~~~~~~~~~~~^~~~~
try.c: /usr/bin/ld: libcrypto_hash_luffa512.a(luffa_512.o): relocation R_X86_64_32S against `.rodata' can not be used when making a PIE object; recompile with -fPIE
try.c: /usr/bin/ld: failed to set dynamic section sizes: bad value
try.c: collect2: error: ld returned 1 exit status

Number of similar (implementation,compiler) pairs: 4, namely:
ImplementationCompiler
T:thomaz/asm-PS-v2-INTgcc -march=native -mtune=native -O2 -fwrapv -fPIC -fPIE -gdwarf-4 -Wall (11.4.0)
T:thomaz/asm-PS-v2-INTgcc -march=native -mtune=native -O3 -fwrapv -fPIC -fPIE -gdwarf-4 -Wall (11.4.0)
T:thomaz/asm-PS-v2-INTgcc -march=native -mtune=native -O -fwrapv -fPIC -fPIE -gdwarf-4 -Wall (11.4.0)
T:thomaz/asm-PS-v2-INTgcc -march=native -mtune=native -Os -fwrapv -fPIC -fPIE -gdwarf-4 -Wall (11.4.0)

Compiler output


hash.c: hash.c:32:12: warning: passing 'const unsigned char *' to parameter of type 'unsigned char *' discards qualifiers [-Wincompatible-pointer-types-discards-qualifiers]
hash.c:         fLuffa512(in, out, inlen);
hash.c:                   ^~
hash.c: hash.c:29:31: note: passing argument to parameter 'input' here
hash.c: void fLuffa512(unsigned char *input, unsigned char *output, int len);
hash.c:                               ^
hash.c: 1 warning generated.
luffa512.s: <instantiation>:1:8: error: unknown token in expression
luffa512.s: pshufb %xmm10, maskShufLittleEndian
luffa512.s:        ^
luffa512.s: <instantiation>:1:1: note: while in macro instantiation
luffa512.s: mPSSTEPI %xmm10, %xmm11, maskShufLittleEndian
luffa512.s: ^
luffa512.s: luffa512.s:449:2: note: while in macro instantiation
luffa512.s:         mPS %xmm10, %xmm11, %xmm12, %xmm13, %xmm14, %xmm15
luffa512.s:         ^
luffa512.s: <instantiation>:2:9: error: unknown token in expression
luffa512.s:         pshufb %xmm11, maskShufLittleEndian
luffa512.s:                ^
luffa512.s: <instantiation>:1:1: note: while in macro instantiation
luffa512.s: mPSSTEPI %xmm10, %xmm11, maskShufLittleEndian
luffa512.s: ^
luffa512.s: luffa512.s:449:2: note: while in macro instantiation
luffa512.s:         mPS %xmm10, %xmm11, %xmm12, %xmm13, %xmm14, %xmm15
luffa512.s:         ^
luffa512.s: <instantiation>:1:8: error: unknown token in expression
luffa512.s: movaps %xmm12, %xmm10
luffa512.s:        ^
luffa512.s: <instantiation>:2:2: note: while in macro instantiation
luffa512.s:         mPSSTEPII %xmm10, %xmm11, %xmm12, %xmm13, %xmm14, %xmm15
luffa512.s:         ^
luffa512.s: luffa512.s:449:2: note: while in macro instantiation
luffa512.s: ...

Number of similar (implementation,compiler) pairs: 5, namely:
ImplementationCompiler
T:thomaz/asm-PSPar-v2-FPclang -march=native -O2 -fwrapv -Qunused-arguments -fPIC -fPIE -gdwarf-4 -Wall (Ubuntu_Clang_14.0.0)
T:thomaz/asm-PSPar-v2-FPclang -march=native -O3 -fwrapv -Qunused-arguments -fPIC -fPIE -gdwarf-4 -Wall (Ubuntu_Clang_14.0.0)
T:thomaz/asm-PSPar-v2-FPclang -march=native -O -fwrapv -Qunused-arguments -fPIC -fPIE -gdwarf-4 -Wall (Ubuntu_Clang_14.0.0)
T:thomaz/asm-PSPar-v2-FPclang -march=native -Os -fwrapv -Qunused-arguments -fPIC -fPIE -gdwarf-4 -Wall (Ubuntu_Clang_14.0.0)
T:thomaz/asm-PSPar-v2-FPclang -mcpu=native -O3 -fwrapv -Qunused-arguments -fPIC -fPIE -gdwarf-4 -Wall (Ubuntu_Clang_14.0.0)

Compiler output


hash.c: hash.c: In function 'crypto_hash_luffa512_thomaz_asm_PSPar_v2_FP_timingleaks':
hash.c: hash.c:32:19: warning: passing argument 1 of 'fLuffa512' discards 'const' qualifier from pointer target type [-Wdiscarded-qualifiers]
hash.c:    32 |         fLuffa512(in, out, inlen);
hash.c:       |                   ^~
hash.c: hash.c:29:31: note: expected 'unsigned char *' but argument is of type 'const unsigned char *'
hash.c:    29 | void fLuffa512(unsigned char *input, unsigned char *output, int len);
hash.c:       |                ~~~~~~~~~~~~~~~^~~~~
try.c: /usr/bin/ld: libcrypto_hash_luffa512.a(luffa512.o): relocation R_X86_64_32S against `.rodata' can not be used when making a PIE object; recompile with -fPIE
try.c: /usr/bin/ld: failed to set dynamic section sizes: bad value
try.c: collect2: error: ld returned 1 exit status

Number of similar (implementation,compiler) pairs: 4, namely:
ImplementationCompiler
T:thomaz/asm-PSPar-v2-FPgcc -march=native -mtune=native -O2 -fwrapv -fPIC -fPIE -gdwarf-4 -Wall (11.4.0)
T:thomaz/asm-PSPar-v2-FPgcc -march=native -mtune=native -O3 -fwrapv -fPIC -fPIE -gdwarf-4 -Wall (11.4.0)
T:thomaz/asm-PSPar-v2-FPgcc -march=native -mtune=native -O -fwrapv -fPIC -fPIE -gdwarf-4 -Wall (11.4.0)
T:thomaz/asm-PSPar-v2-FPgcc -march=native -mtune=native -Os -fwrapv -fPIC -fPIE -gdwarf-4 -Wall (11.4.0)

Compiler output


hash.c: hash.c:32:12: warning: passing 'const unsigned char *' to parameter of type 'unsigned char *' discards qualifiers [-Wincompatible-pointer-types-discards-qualifiers]
hash.c:         fLuffa512(in, out, inlen);
hash.c:                   ^~
hash.c: hash.c:29:31: note: passing argument to parameter 'input' here
hash.c: void fLuffa512(unsigned char *input, unsigned char *output, int len);
hash.c:                               ^
hash.c: 1 warning generated.
luffa512.s: <instantiation>:1:8: error: unknown token in expression
luffa512.s: pshufb %xmm10, maskShufLittleEndian
luffa512.s:        ^
luffa512.s: <instantiation>:1:1: note: while in macro instantiation
luffa512.s: mPSSTEPI %xmm10, %xmm11, maskShufLittleEndian
luffa512.s: ^
luffa512.s: luffa512.s:449:2: note: while in macro instantiation
luffa512.s:         mPS %xmm10, %xmm11, %xmm12, %xmm13, %xmm14, %xmm15
luffa512.s:         ^
luffa512.s: <instantiation>:2:9: error: unknown token in expression
luffa512.s:         pshufb %xmm11, maskShufLittleEndian
luffa512.s:                ^
luffa512.s: <instantiation>:1:1: note: while in macro instantiation
luffa512.s: mPSSTEPI %xmm10, %xmm11, maskShufLittleEndian
luffa512.s: ^
luffa512.s: luffa512.s:449:2: note: while in macro instantiation
luffa512.s:         mPS %xmm10, %xmm11, %xmm12, %xmm13, %xmm14, %xmm15
luffa512.s:         ^
luffa512.s: <instantiation>:1:8: error: unknown token in expression
luffa512.s: movdqa %xmm12, %xmm10
luffa512.s:        ^
luffa512.s: <instantiation>:2:2: note: while in macro instantiation
luffa512.s:         mPSSTEPII %xmm10, %xmm11, %xmm12, %xmm13, %xmm14, %xmm15
luffa512.s:         ^
luffa512.s: luffa512.s:449:2: note: while in macro instantiation
luffa512.s: ...

Number of similar (implementation,compiler) pairs: 5, namely:
ImplementationCompiler
T:thomaz/asm-PSPar-v2-INTclang -march=native -O2 -fwrapv -Qunused-arguments -fPIC -fPIE -gdwarf-4 -Wall (Ubuntu_Clang_14.0.0)
T:thomaz/asm-PSPar-v2-INTclang -march=native -O3 -fwrapv -Qunused-arguments -fPIC -fPIE -gdwarf-4 -Wall (Ubuntu_Clang_14.0.0)
T:thomaz/asm-PSPar-v2-INTclang -march=native -O -fwrapv -Qunused-arguments -fPIC -fPIE -gdwarf-4 -Wall (Ubuntu_Clang_14.0.0)
T:thomaz/asm-PSPar-v2-INTclang -march=native -Os -fwrapv -Qunused-arguments -fPIC -fPIE -gdwarf-4 -Wall (Ubuntu_Clang_14.0.0)
T:thomaz/asm-PSPar-v2-INTclang -mcpu=native -O3 -fwrapv -Qunused-arguments -fPIC -fPIE -gdwarf-4 -Wall (Ubuntu_Clang_14.0.0)

Compiler output


hash.c: hash.c: In function 'crypto_hash_luffa512_thomaz_asm_PSPar_v2_INT_timingleaks':
hash.c: hash.c:32:19: warning: passing argument 1 of 'fLuffa512' discards 'const' qualifier from pointer target type [-Wdiscarded-qualifiers]
hash.c:    32 |         fLuffa512(in, out, inlen);
hash.c:       |                   ^~
hash.c: hash.c:29:31: note: expected 'unsigned char *' but argument is of type 'const unsigned char *'
hash.c:    29 | void fLuffa512(unsigned char *input, unsigned char *output, int len);
hash.c:       |                ~~~~~~~~~~~~~~~^~~~~
try.c: /usr/bin/ld: libcrypto_hash_luffa512.a(luffa512.o): relocation R_X86_64_32S against `.rodata' can not be used when making a PIE object; recompile with -fPIE
try.c: /usr/bin/ld: failed to set dynamic section sizes: bad value
try.c: collect2: error: ld returned 1 exit status

Number of similar (implementation,compiler) pairs: 4, namely:
ImplementationCompiler
T:thomaz/asm-PSPar-v2-INTgcc -march=native -mtune=native -O2 -fwrapv -fPIC -fPIE -gdwarf-4 -Wall (11.4.0)
T:thomaz/asm-PSPar-v2-INTgcc -march=native -mtune=native -O3 -fwrapv -fPIC -fPIE -gdwarf-4 -Wall (11.4.0)
T:thomaz/asm-PSPar-v2-INTgcc -march=native -mtune=native -O -fwrapv -fPIC -fPIE -gdwarf-4 -Wall (11.4.0)
T:thomaz/asm-PSPar-v2-INTgcc -march=native -mtune=native -Os -fwrapv -fPIC -fPIE -gdwarf-4 -Wall (11.4.0)

Namespace violations


luffa_for_32.o CNS D
luffa_for_32.o Final T
luffa_for_32.o Hash T
luffa_for_32.o IV R
luffa_for_32.o Init T
luffa_for_32.o Update T
luffa_for_32.o Update256 T
luffa_for_32.o Update384 T
luffa_for_32.o Update512 T
luffa_for_32.o finalization224 T
luffa_for_32.o finalization256 T
luffa_for_32.o finalization384 T
luffa_for_32.o finalization512 T
luffa_for_32.o process_last_msgs256 T
luffa_for_32.o process_last_msgs384 T
luffa_for_32.o process_last_msgs512 T
luffa_for_32.o rnd256 T
luffa_for_32.o rnd384 T
luffa_for_32.o rnd512 T

Number of similar (implementation,compiler) pairs: 9, namely:
ImplementationCompiler
T:opt32clang -march=native -O2 -fwrapv -Qunused-arguments -fPIC -fPIE -gdwarf-4 -Wall (Ubuntu_Clang_14.0.0)
T:opt32clang -march=native -O3 -fwrapv -Qunused-arguments -fPIC -fPIE -gdwarf-4 -Wall (Ubuntu_Clang_14.0.0)
T:opt32clang -march=native -O -fwrapv -Qunused-arguments -fPIC -fPIE -gdwarf-4 -Wall (Ubuntu_Clang_14.0.0)
T:opt32clang -march=native -Os -fwrapv -Qunused-arguments -fPIC -fPIE -gdwarf-4 -Wall (Ubuntu_Clang_14.0.0)
T:opt32clang -mcpu=native -O3 -fwrapv -Qunused-arguments -fPIC -fPIE -gdwarf-4 -Wall (Ubuntu_Clang_14.0.0)
T:opt32gcc -march=native -mtune=native -O2 -fwrapv -fPIC -fPIE -gdwarf-4 -Wall (11.4.0)
T:opt32gcc -march=native -mtune=native -O3 -fwrapv -fPIC -fPIE -gdwarf-4 -Wall (11.4.0)
T:opt32gcc -march=native -mtune=native -O -fwrapv -fPIC -fPIE -gdwarf-4 -Wall (11.4.0)
T:opt32gcc -march=native -mtune=native -Os -fwrapv -fPIC -fPIE -gdwarf-4 -Wall (11.4.0)

Namespace violations


luffa.o sph_luffa224 T
luffa.o sph_luffa224_addbits_and_close T
luffa.o sph_luffa224_close T
luffa.o sph_luffa224_init T
luffa.o sph_luffa256 T
luffa.o sph_luffa256_addbits_and_close T
luffa.o sph_luffa256_close T
luffa.o sph_luffa256_init T
luffa.o sph_luffa384 T
luffa.o sph_luffa384_addbits_and_close T
luffa.o sph_luffa384_close T
luffa.o sph_luffa384_init T
luffa.o sph_luffa512 T
luffa.o sph_luffa512_addbits_and_close T
luffa.o sph_luffa512_close T
luffa.o sph_luffa512_init T

Number of similar (implementation,compiler) pairs: 9, namely:
ImplementationCompiler
T:sphlibclang -march=native -O2 -fwrapv -Qunused-arguments -fPIC -fPIE -gdwarf-4 -Wall (Ubuntu_Clang_14.0.0)
T:sphlibclang -march=native -O3 -fwrapv -Qunused-arguments -fPIC -fPIE -gdwarf-4 -Wall (Ubuntu_Clang_14.0.0)
T:sphlibclang -march=native -O -fwrapv -Qunused-arguments -fPIC -fPIE -gdwarf-4 -Wall (Ubuntu_Clang_14.0.0)
T:sphlibclang -march=native -Os -fwrapv -Qunused-arguments -fPIC -fPIE -gdwarf-4 -Wall (Ubuntu_Clang_14.0.0)
T:sphlibclang -mcpu=native -O3 -fwrapv -Qunused-arguments -fPIC -fPIE -gdwarf-4 -Wall (Ubuntu_Clang_14.0.0)
T:sphlibgcc -march=native -mtune=native -O2 -fwrapv -fPIC -fPIE -gdwarf-4 -Wall (11.4.0)
T:sphlibgcc -march=native -mtune=native -O3 -fwrapv -fPIC -fPIE -gdwarf-4 -Wall (11.4.0)
T:sphlibgcc -march=native -mtune=native -O -fwrapv -fPIC -fPIE -gdwarf-4 -Wall (11.4.0)
T:sphlibgcc -march=native -mtune=native -Os -fwrapv -fPIC -fPIE -gdwarf-4 -Wall (11.4.0)

Namespace violations


luffa_for_sse2.o ALLONE B
luffa_for_sse2.o CNS128 B
luffa_for_sse2.o Final T
luffa_for_sse2.o Hash T
luffa_for_sse2.o Init T
luffa_for_sse2.o MASK B
luffa_for_sse2.o Update T

Number of similar (implementation,compiler) pairs: 9, namely:
ImplementationCompiler
T:sse2clang -march=native -O2 -fwrapv -Qunused-arguments -fPIC -fPIE -gdwarf-4 -Wall (Ubuntu_Clang_14.0.0)
T:sse2clang -march=native -O3 -fwrapv -Qunused-arguments -fPIC -fPIE -gdwarf-4 -Wall (Ubuntu_Clang_14.0.0)
T:sse2clang -march=native -O -fwrapv -Qunused-arguments -fPIC -fPIE -gdwarf-4 -Wall (Ubuntu_Clang_14.0.0)
T:sse2clang -march=native -Os -fwrapv -Qunused-arguments -fPIC -fPIE -gdwarf-4 -Wall (Ubuntu_Clang_14.0.0)
T:sse2clang -mcpu=native -O3 -fwrapv -Qunused-arguments -fPIC -fPIE -gdwarf-4 -Wall (Ubuntu_Clang_14.0.0)
T:sse2gcc -march=native -mtune=native -O2 -fwrapv -fPIC -fPIE -gdwarf-4 -Wall (11.4.0)
T:sse2gcc -march=native -mtune=native -O3 -fwrapv -fPIC -fPIE -gdwarf-4 -Wall (11.4.0)
T:sse2gcc -march=native -mtune=native -O -fwrapv -fPIC -fPIE -gdwarf-4 -Wall (11.4.0)
T:sse2gcc -march=native -mtune=native -Os -fwrapv -fPIC -fPIE -gdwarf-4 -Wall (11.4.0)