Implementation notes: amd64, rumba5, crypto_hash/k12

Computer: rumba5
Microarchitecture: amd64; Zen (800f11)
Architecture: amd64
CPU ID: AuthenticAMD-00800f11-178bfbff
SUPERCOP version: 20240425
Operation: crypto_hash
Primitive: k12
TimeObject sizeTest sizeImplementationCompilerBenchmark dateSUPERCOP version
684329379 0 040107 844 896T:kcp/optimized1600u6clang_-march=native_-O_-fomit-frame-pointer_-fwrapv_-Qunused-arguments_-fPIC_-fPIE2024042620240425
685629699 0 041117 836 960T:kcp/optimized1600u6clang_-march=native_-Os_-fomit-frame-pointer_-fwrapv_-Qunused-arguments_-fPIC_-fPIE2024042620240425
693764372 0 078171 844 928T:kcp/optimized1600ufullclang_-march=native_-O2_-fomit-frame-pointer_-fwrapv_-Qunused-arguments_-fPIC_-fPIE2024042620240425
693864508 0 078683 844 928T:kcp/optimized1600ufullclang_-march=native_-O3_-fomit-frame-pointer_-fwrapv_-Qunused-arguments_-fPIC_-fPIE2024042620240425
695462712 0 074141 836 960T:kcp/optimized1600ufullclang_-march=native_-Os_-fomit-frame-pointer_-fwrapv_-Qunused-arguments_-fPIC_-fPIE2024042620240425
696262288 0 073019 844 896T:kcp/optimized1600ufullclang_-march=native_-O_-fomit-frame-pointer_-fwrapv_-Qunused-arguments_-fPIC_-fPIE2024042620240425
702163080 0 075156 812 960T:kcp/optimized1600ufullgcc_-march=native_-mtune=native_-O2_-fomit-frame-pointer_-fwrapv_-fPIC_-fPIE2024042620240425
702261475 0 073092 812 960T:kcp/optimized1600ufullgcc_-march=native_-mtune=native_-O_-fomit-frame-pointer_-fwrapv_-fPIC_-fPIE2024042620240425
706131516 0 045691 844 928T:kcp/optimized1600u6clang_-march=native_-O3_-fomit-frame-pointer_-fwrapv_-Qunused-arguments_-fPIC_-fPIE2024042620240425
706931380 0 045179 844 928T:kcp/optimized1600u6clang_-march=native_-O2_-fomit-frame-pointer_-fwrapv_-Qunused-arguments_-fPIC_-fPIE2024042620240425
716858996 0 069495 788 928T:kcp/optimized1600ufullgcc_-march=native_-mtune=native_-Os_-fomit-frame-pointer_-fwrapv_-fPIC_-fPIE2024042620240425
716930361 0 042436 812 960T:kcp/optimized1600u6gcc_-march=native_-mtune=native_-O2_-fomit-frame-pointer_-fwrapv_-fPIC_-fPIE2024042620240425
716965080 0 078428 812 960T:kcp/optimized1600ufullgcc_-march=native_-mtune=native_-O3_-fomit-frame-pointer_-fwrapv_-fPIC_-fPIE2024042620240425
720567131 0 081307 844 928T:kcp/optimized1600lcufullclang_-march=native_-O3_-fomit-frame-pointer_-fwrapv_-Qunused-arguments_-fPIC_-fPIE2024042620240425
722066995 0 080795 844 928T:kcp/optimized1600lcufullclang_-march=native_-O2_-fomit-frame-pointer_-fwrapv_-Qunused-arguments_-fPIC_-fPIE2024042620240425
722864706 0 075435 844 896T:kcp/optimized1600lcufullclang_-march=native_-O_-fomit-frame-pointer_-fwrapv_-Qunused-arguments_-fPIC_-fPIE2024042620240425
724161179 0 071687 788 928T:kcp/optimized1600lcufullgcc_-march=native_-mtune=native_-Os_-fomit-frame-pointer_-fwrapv_-fPIC_-fPIE2024042620240425
727433470 0 047651 844 928T:kcp/optimized1600lcu6clang_-march=native_-O3_-fomit-frame-pointer_-fwrapv_-Qunused-arguments_-fPIC_-fPIE2024042620240425
729333334 0 047139 844 928T:kcp/optimized1600lcu6clang_-march=native_-O2_-fomit-frame-pointer_-fwrapv_-Qunused-arguments_-fPIC_-fPIE2024042620240425
732931013 0 041747 844 896T:kcp/optimized1600lcu6clang_-march=native_-O_-fomit-frame-pointer_-fwrapv_-Qunused-arguments_-fPIC_-fPIE2024042620240425
734169944 0 083051 844 896T:kcp/optimized1600lcufullclang_-mcpu=native_-O3_-fomit-frame-pointer_-fwrapv_-Qunused-arguments_-fPIC_-fPIE2024042620240425
734731965 0 045308 812 960T:kcp/optimized1600u6gcc_-march=native_-mtune=native_-O3_-fomit-frame-pointer_-fwrapv_-fPIC_-fPIE2024042620240425
734931251 0 042669 836 960T:kcp/optimized1600lcu6clang_-march=native_-Os_-fomit-frame-pointer_-fwrapv_-Qunused-arguments_-fPIC_-fPIE2024042620240425
744728868 0 040484 812 960T:kcp/optimized1600u6gcc_-march=native_-mtune=native_-O_-fomit-frame-pointer_-fwrapv_-fPIC_-fPIE2024042620240425
746663747 0 075364 812 960T:kcp/optimized1600lcufullgcc_-march=native_-mtune=native_-O_-fomit-frame-pointer_-fwrapv_-fPIC_-fPIE2024042620240425
747137729 0 050827 844 896T:kcp/optimized1600lcu6clang_-mcpu=native_-O3_-fomit-frame-pointer_-fwrapv_-Qunused-arguments_-fPIC_-fPIE2024042620240425
753128613 0 039111 788 928T:kcp/optimized1600lcu6gcc_-march=native_-mtune=native_-Os_-fomit-frame-pointer_-fwrapv_-fPIC_-fPIE2024042620240425
756264923 0 076349 836 960T:kcp/optimized1600lcufullclang_-march=native_-Os_-fomit-frame-pointer_-fwrapv_-Qunused-arguments_-fPIC_-fPIE2024042620240425
756927969 0 038471 788 928T:kcp/optimized1600u6gcc_-march=native_-mtune=native_-Os_-fomit-frame-pointer_-fwrapv_-fPIC_-fPIE2024042620240425
759265674 0 077748 812 960T:kcp/optimized1600lcufullgcc_-march=native_-mtune=native_-O2_-fomit-frame-pointer_-fwrapv_-fPIC_-fPIE2024042620240425
766868335 0 081684 812 960T:kcp/optimized1600lcufullgcc_-march=native_-mtune=native_-O3_-fomit-frame-pointer_-fwrapv_-fPIC_-fPIE2024042620240425
767731540 0 043620 812 960T:kcp/optimized1600lcu6gcc_-march=native_-mtune=native_-O2_-fomit-frame-pointer_-fwrapv_-fPIC_-fPIE2024042620240425
771429778 0 041396 812 960T:kcp/optimized1600lcu6gcc_-march=native_-mtune=native_-O_-fomit-frame-pointer_-fwrapv_-fPIC_-fPIE2024042620240425
793933858 0 047204 812 960T:kcp/optimized1600lcu6gcc_-march=native_-mtune=native_-O3_-fomit-frame-pointer_-fwrapv_-fPIC_-fPIE2024042620240425
810972831 0 085939 844 896T:kcp/optimized1600ufullclang_-mcpu=native_-O3_-fomit-frame-pointer_-fwrapv_-Qunused-arguments_-fPIC_-fPIE2024042620240425
817736984 0 050091 844 896T:kcp/optimized1600u6clang_-mcpu=native_-O3_-fomit-frame-pointer_-fwrapv_-Qunused-arguments_-fPIC_-fPIE2024042620240425
880110438 0 024619 844 928T:kcp/compact1600clang_-march=native_-O3_-fomit-frame-pointer_-fwrapv_-Qunused-arguments_-fPIC_-fPIE2024042620240425
882510620 0 024918 860 928T:kcp/reference1600clang_-march=native_-O3_-fomit-frame-pointer_-fwrapv_-Qunused-arguments_-fPIC_-fPIE2024042620240425
891110596 0 024518 860 928T:kcp/reference1600clang_-march=native_-O2_-fomit-frame-pointer_-fwrapv_-Qunused-arguments_-fPIC_-fPIE2024042620240425
964914097 0 027334 860 896T:kcp/reference1600clang_-mcpu=native_-O3_-fomit-frame-pointer_-fwrapv_-Qunused-arguments_-fPIC_-fPIE2024042620240425
1005915168 0 028275 844 896T:kcp/compact1600clang_-mcpu=native_-O3_-fomit-frame-pointer_-fwrapv_-Qunused-arguments_-fPIC_-fPIE2024042620240425
1358665684 0 079483 844 928T:kcp/optimized1600lcufullshldclang_-march=native_-O2_-fomit-frame-pointer_-fwrapv_-Qunused-arguments_-fPIC_-fPIE2024042620240425
1361565833 0 080011 844 928T:kcp/optimized1600lcufullshldclang_-march=native_-O3_-fomit-frame-pointer_-fwrapv_-Qunused-arguments_-fPIC_-fPIE2024042620240425
1362263860 0 075277 836 960T:kcp/optimized1600lcufullshldclang_-march=native_-Os_-fomit-frame-pointer_-fwrapv_-Qunused-arguments_-fPIC_-fPIE2024042620240425
1370259981 0 070487 788 928T:kcp/optimized1600lcufullshldgcc_-march=native_-mtune=native_-Os_-fomit-frame-pointer_-fwrapv_-fPIC_-fPIE2024042620240425
1402664884 0 076996 812 960T:kcp/optimized1600lcufullshldgcc_-march=native_-mtune=native_-O2_-fomit-frame-pointer_-fwrapv_-fPIC_-fPIE2024042620240425
1409763424 0 074155 844 896T:kcp/optimized1600lcufullshldclang_-march=native_-O_-fomit-frame-pointer_-fwrapv_-Qunused-arguments_-fPIC_-fPIE2024042620240425
1410467839 0 081220 812 960T:kcp/optimized1600lcufullshldgcc_-march=native_-mtune=native_-O3_-fomit-frame-pointer_-fwrapv_-fPIC_-fPIE2024042620240425
1413271823 0 084923 844 896T:kcp/optimized1600lcufullshldclang_-mcpu=native_-O3_-fomit-frame-pointer_-fwrapv_-Qunused-arguments_-fPIC_-fPIE2024042620240425
1477863549 0 075188 812 960T:kcp/optimized1600lcufullshldgcc_-march=native_-mtune=native_-O_-fomit-frame-pointer_-fwrapv_-fPIC_-fPIE2024042620240425
1869626220 0 039564 812 960T:kcp/inplace1600bigcc_-march=native_-mtune=native_-O3_-fomit-frame-pointer_-fwrapv_-fPIC_-fPIE2024042620240425
1869717223 0 028852 812 960T:kcp/inplace1600bigcc_-march=native_-mtune=native_-O_-fomit-frame-pointer_-fwrapv_-fPIC_-fPIE2024042620240425
1918924391 0 038531 844 928T:kcp/inplace1600biclang_-march=native_-O3_-fomit-frame-pointer_-fwrapv_-Qunused-arguments_-fPIC_-fPIE2024042620240425
1918917506 0 028023 788 928T:kcp/inplace1600bigcc_-march=native_-mtune=native_-Os_-fomit-frame-pointer_-fwrapv_-fPIC_-fPIE2024042620240425
1920324087 0 037851 844 928T:kcp/inplace1600biclang_-march=native_-O2_-fomit-frame-pointer_-fwrapv_-Qunused-arguments_-fPIC_-fPIE2024042620240425
2016415028 0 028277 804 960T:kcp/compact1600gcc_-march=native_-mtune=native_-O3_-fomit-frame-pointer_-fwrapv_-fPIC_-fPIE2024042620240425
2025526819 0 039643 844 896T:kcp/inplace1600biclang_-mcpu=native_-O3_-fomit-frame-pointer_-fwrapv_-Qunused-arguments_-fPIC_-fPIE2024042620240425
2108710022 0 023827 844 928T:kcp/compact1600clang_-march=native_-O2_-fomit-frame-pointer_-fwrapv_-Qunused-arguments_-fPIC_-fPIE2024042620240425
2110820551 0 032636 812 960T:kcp/inplace1600bigcc_-march=native_-mtune=native_-O2_-fomit-frame-pointer_-fwrapv_-fPIC_-fPIE2024042620240425
2140419169 0 029907 844 896T:kcp/inplace1600biclang_-march=native_-O_-fomit-frame-pointer_-fwrapv_-Qunused-arguments_-fPIC_-fPIE2024042620240425
2141710265 0 023664 820 960T:kcp/reference1600gcc_-march=native_-mtune=native_-O3_-fomit-frame-pointer_-fwrapv_-fPIC_-fPIE2024042620240425
2308119610 0 031045 836 960T:kcp/inplace1600biclang_-march=native_-Os_-fomit-frame-pointer_-fwrapv_-Qunused-arguments_-fPIC_-fPIE2024042620240425
309067330 0 018051 844 896T:kcp/compact1600clang_-march=native_-O_-fomit-frame-pointer_-fwrapv_-Qunused-arguments_-fPIC_-fPIE2024042620240425
329777706 0 019109 836 960T:kcp/compact1600clang_-march=native_-Os_-fomit-frame-pointer_-fwrapv_-Qunused-arguments_-fPIC_-fPIE2024042620240425
390007696 0 019221 804 960T:kcp/compact1600gcc_-march=native_-mtune=native_-O_-fomit-frame-pointer_-fwrapv_-fPIC_-fPIE2024042620240425
395968768 0 020741 804 960T:kcp/compact1600gcc_-march=native_-mtune=native_-O2_-fomit-frame-pointer_-fwrapv_-fPIC_-fPIE2024042620240425
426416880 0 017296 780 928T:kcp/compact1600gcc_-march=native_-mtune=native_-Os_-fomit-frame-pointer_-fwrapv_-fPIC_-fPIE2024042620240425
602018338 0 019190 860 896T:kcp/reference1600clang_-march=native_-O_-fomit-frame-pointer_-fwrapv_-Qunused-arguments_-fPIC_-fPIE2024042620240425
629828908 0 021008 820 960T:kcp/reference1600gcc_-march=native_-mtune=native_-O2_-fomit-frame-pointer_-fwrapv_-fPIC_-fPIE2024042620240425
1032318355 0 020000 820 960T:kcp/reference1600gcc_-march=native_-mtune=native_-O_-fomit-frame-pointer_-fwrapv_-fPIC_-fPIE2024042620240425
1125169029 0 020541 852 960T:kcp/reference1600clang_-march=native_-Os_-fomit-frame-pointer_-fwrapv_-Qunused-arguments_-fPIC_-fPIE2024042620240425
1716367278 0 017816 796 928T:kcp/reference1600gcc_-march=native_-mtune=native_-Os_-fomit-frame-pointer_-fwrapv_-fPIC_-fPIE2024042620240425
22723814818 0 028320 820 960T:kcp/reference1600-32bitsgcc_-march=native_-mtune=native_-O3_-fomit-frame-pointer_-fwrapv_-fPIC_-fPIE2024042620240425
27384915049 0 029398 860 928T:kcp/reference1600-32bitsclang_-march=native_-O3_-fomit-frame-pointer_-fwrapv_-Qunused-arguments_-fPIC_-fPIE2024042620240425
30370918686 0 031958 860 896T:kcp/reference1600-32bitsclang_-mcpu=native_-O3_-fomit-frame-pointer_-fwrapv_-Qunused-arguments_-fPIC_-fPIE2024042620240425
31058612601 0 026574 860 928T:kcp/reference1600-32bitsclang_-march=native_-O2_-fomit-frame-pointer_-fwrapv_-Qunused-arguments_-fPIC_-fPIE2024042620240425
31411912751 0 023638 860 896T:kcp/reference1600-32bitsclang_-march=native_-O_-fomit-frame-pointer_-fwrapv_-Qunused-arguments_-fPIC_-fPIE2024042620240425
33280311941 0 024120 820 960T:kcp/reference1600-32bitsgcc_-march=native_-mtune=native_-O2_-fomit-frame-pointer_-fwrapv_-fPIC_-fPIE2024042620240425
41936910854 0 022461 852 960T:kcp/reference1600-32bitsclang_-march=native_-Os_-fomit-frame-pointer_-fwrapv_-Qunused-arguments_-fPIC_-fPIE2024042620240425
43690710835 0 022552 820 960T:kcp/reference1600-32bitsgcc_-march=native_-mtune=native_-O_-fomit-frame-pointer_-fwrapv_-fPIC_-fPIE2024042620240425
4790799529 0 020128 796 928T:kcp/reference1600-32bitsgcc_-march=native_-mtune=native_-Os_-fomit-frame-pointer_-fwrapv_-fPIC_-fPIE2024042620240425

Compiler output

Implementation: T:kcp/inplace1600ARMv6M
Security model: timingleaks
Compiler: clang -march=native -O2 -fomit-frame-pointer -fwrapv -Qunused-arguments -fPIC -fPIE
keccak.s: keccak.s:1:1: error: unexpected token at start of statement
keccak.s: @
keccak.s: ^
keccak.s: keccak.s:2:1: error: unexpected token at start of statement
keccak.s: @ Implementation by the Keccak, Keyak and Ketje Teams, namely, Guido Bertoni,
keccak.s: ^
keccak.s: keccak.s:3:1: error: unexpected token at start of statement
keccak.s: @ Joan Daemen, Michaƫl Peeters, Gilles Van Assche and Ronny Van Keer, hereby
keccak.s: keccak.s:4:1: error: unexpected token at start of statement
keccak.s: @ denoted as "the implementer".
keccak.s: ^
keccak.s: keccak.s:5:1: error: unexpected token at start of statement
keccak.s: @
keccak.s: ^
keccak.s: keccak.s:6:1: error: unexpected token at start of statement
keccak.s: @ For more information, feedback or questions, please refer to our websites:
keccak.s: ^
keccak.s: keccak.s:7:1: error: unexpected token at start of statement
keccak.s: @ http://keccak.noekeon.org/
keccak.s: ^
keccak.s: keccak.s:8:1: error: unexpected token at start of statement
keccak.s: @ http://keyak.noekeon.org/
keccak.s: ^
keccak.s: keccak.s:9:1: error: unexpected token at start of statement
keccak.s: @ http://ketje.noekeon.org/
keccak.s: ...

Number of similar (compiler,implementation) pairs: 30, namely:
CompilerImplementations
clang -march=native -O2 -fomit-frame-pointer -fwrapv -Qunused-arguments -fPIC -fPIE T:kcp/inplace1600ARMv6M
clang -march=native -O3 -fomit-frame-pointer -fwrapv -Qunused-arguments -fPIC -fPIE T:kcp/inplace1600ARMv6M
clang -march=native -O -fomit-frame-pointer -fwrapv -Qunused-arguments -fPIC -fPIE T:kcp/inplace1600ARMv6M
clang -march=native -Os -fomit-frame-pointer -fwrapv -Qunused-arguments -fPIC -fPIE T:kcp/inplace1600ARMv6M
clang -mcpu=native -O3 -fomit-frame-pointer -fwrapv -Qunused-arguments -fPIC -fPIE T:kcp/inplace1600ARMv6M
clang -march=native -O2 -fomit-frame-pointer -fwrapv -Qunused-arguments -fPIC -fPIE T:kcp/inplace1600ARMv7A
clang -march=native -O3 -fomit-frame-pointer -fwrapv -Qunused-arguments -fPIC -fPIE T:kcp/inplace1600ARMv7A
clang -march=native -O -fomit-frame-pointer -fwrapv -Qunused-arguments -fPIC -fPIE T:kcp/inplace1600ARMv7A
clang -march=native -Os -fomit-frame-pointer -fwrapv -Qunused-arguments -fPIC -fPIE T:kcp/inplace1600ARMv7A
clang -mcpu=native -O3 -fomit-frame-pointer -fwrapv -Qunused-arguments -fPIC -fPIE T:kcp/inplace1600ARMv7A
clang -march=native -O2 -fomit-frame-pointer -fwrapv -Qunused-arguments -fPIC -fPIE T:kcp/inplace1600ARMv7M
clang -march=native -O3 -fomit-frame-pointer -fwrapv -Qunused-arguments -fPIC -fPIE T:kcp/inplace1600ARMv7M
clang -march=native -O -fomit-frame-pointer -fwrapv -Qunused-arguments -fPIC -fPIE T:kcp/inplace1600ARMv7M
clang -march=native -Os -fomit-frame-pointer -fwrapv -Qunused-arguments -fPIC -fPIE T:kcp/inplace1600ARMv7M
clang -mcpu=native -O3 -fomit-frame-pointer -fwrapv -Qunused-arguments -fPIC -fPIE T:kcp/inplace1600ARMv7M
clang -march=native -O2 -fomit-frame-pointer -fwrapv -Qunused-arguments -fPIC -fPIE T:kcp/optimized1600ARMv6Mu1
clang -march=native -O3 -fomit-frame-pointer -fwrapv -Qunused-arguments -fPIC -fPIE T:kcp/optimized1600ARMv6Mu1
clang -march=native -O -fomit-frame-pointer -fwrapv -Qunused-arguments -fPIC -fPIE T:kcp/optimized1600ARMv6Mu1
clang -march=native -Os -fomit-frame-pointer -fwrapv -Qunused-arguments -fPIC -fPIE T:kcp/optimized1600ARMv6Mu1
clang -mcpu=native -O3 -fomit-frame-pointer -fwrapv -Qunused-arguments -fPIC -fPIE T:kcp/optimized1600ARMv6Mu1
clang -march=native -O2 -fomit-frame-pointer -fwrapv -Qunused-arguments -fPIC -fPIE T:kcp/optimized1600ARMv6Mu2
clang -march=native -O3 -fomit-frame-pointer -fwrapv -Qunused-arguments -fPIC -fPIE T:kcp/optimized1600ARMv6Mu2
clang -march=native -O -fomit-frame-pointer -fwrapv -Qunused-arguments -fPIC -fPIE T:kcp/optimized1600ARMv6Mu2
clang -march=native -Os -fomit-frame-pointer -fwrapv -Qunused-arguments -fPIC -fPIE T:kcp/optimized1600ARMv6Mu2
clang -mcpu=native -O3 -fomit-frame-pointer -fwrapv -Qunused-arguments -fPIC -fPIE T:kcp/optimized1600ARMv6Mu2
clang -march=native -O2 -fomit-frame-pointer -fwrapv -Qunused-arguments -fPIC -fPIE T:kcp/optimized1600ARMv7A
clang -march=native -O3 -fomit-frame-pointer -fwrapv -Qunused-arguments -fPIC -fPIE T:kcp/optimized1600ARMv7A
clang -march=native -O -fomit-frame-pointer -fwrapv -Qunused-arguments -fPIC -fPIE T:kcp/optimized1600ARMv7A
clang -march=native -Os -fomit-frame-pointer -fwrapv -Qunused-arguments -fPIC -fPIE T:kcp/optimized1600ARMv7A
clang -mcpu=native -O3 -fomit-frame-pointer -fwrapv -Qunused-arguments -fPIC -fPIE T:kcp/optimized1600ARMv7A

Compiler output

Implementation: T:kcp/inplace1600ARMv6M
Security model: timingleaks
Compiler: gcc -march=native -mtune=native -O2 -fomit-frame-pointer -fwrapv -fPIC -fPIE
keccak.s: keccak.s: Assembler messages:
keccak.s: keccak.s:1: Error: junk at end of line, first unrecognized character is `@'
keccak.s: keccak.s:2: Error: junk at end of line, first unrecognized character is `@'
keccak.s: keccak.s:3: Error: junk at end of line, first unrecognized character is `@'
keccak.s: keccak.s:4: Error: junk at end of line, first unrecognized character is `@'
keccak.s: keccak.s:5: Error: junk at end of line, first unrecognized character is `@'
keccak.s: keccak.s:6: Error: junk at end of line, first unrecognized character is `@'
keccak.s: keccak.s:7: Error: junk at end of line, first unrecognized character is `@'
keccak.s: keccak.s:8: Error: junk at end of line, first unrecognized character is `@'
keccak.s: keccak.s:9: Error: junk at end of line, first unrecognized character is `@'
keccak.s: keccak.s:10: Error: junk at end of line, first unrecognized character is `@'
keccak.s: keccak.s:11: Error: junk at end of line, first unrecognized character is `@'
keccak.s: keccak.s:12: Error: junk at end of line, first unrecognized character is `@'
keccak.s: keccak.s:13: Error: junk at end of line, first unrecognized character is `@'
keccak.s: keccak.s:14: Error: junk at end of line, first unrecognized character is `@'
keccak.s: keccak.s:16: Error: junk at end of line, first unrecognized character is `@'
keccak.s: keccak.s:19: Error: unknown pseudo-op: `.thumb'
keccak.s: keccak.s:20: Error: unknown pseudo-op: `.syntax'
keccak.s: keccak.s:23: Error: junk at end of line, first unrecognized character is `@'
keccak.s: keccak.s:109: Error: junk at end of line, first unrecognized character is `@'
keccak.s: keccak.s:142: Error: junk at end of line, first unrecognized character is `@'
keccak.s: keccak.s:194: Error: junk at end of line, first unrecognized character is `@'
keccak.s: keccak.s:203: Error: junk at end of line, first unrecognized character is `@'
keccak.s: keccak.s:611: Error: junk at end of line, first unrecognized character is `@'
keccak.s: keccak.s:612: Error: junk at end of line, first unrecognized character is `@'
keccak.s: ...

Number of similar (compiler,implementation) pairs: 4, namely:
CompilerImplementations
gcc -march=native -mtune=native -O2 -fomit-frame-pointer -fwrapv -fPIC -fPIE T:kcp/inplace1600ARMv6M
gcc -march=native -mtune=native -O3 -fomit-frame-pointer -fwrapv -fPIC -fPIE T:kcp/inplace1600ARMv6M
gcc -march=native -mtune=native -O -fomit-frame-pointer -fwrapv -fPIC -fPIE T:kcp/inplace1600ARMv6M
gcc -march=native -mtune=native -Os -fomit-frame-pointer -fwrapv -fPIC -fPIE T:kcp/inplace1600ARMv6M

Compiler output

Implementation: T:kcp/inplace1600ARMv7A
Security model: timingleaks
Compiler: gcc -march=native -mtune=native -O2 -fomit-frame-pointer -fwrapv -fPIC -fPIE
keccak.s: keccak.s: Assembler messages:
keccak.s: keccak.s:1: Error: junk at end of line, first unrecognized character is `@'
keccak.s: keccak.s:2: Error: junk at end of line, first unrecognized character is `@'
keccak.s: keccak.s:3: Error: junk at end of line, first unrecognized character is `@'
keccak.s: keccak.s:4: Error: junk at end of line, first unrecognized character is `@'
keccak.s: keccak.s:5: Error: junk at end of line, first unrecognized character is `@'
keccak.s: keccak.s:6: Error: junk at end of line, first unrecognized character is `@'
keccak.s: keccak.s:7: Error: junk at end of line, first unrecognized character is `@'
keccak.s: keccak.s:8: Error: junk at end of line, first unrecognized character is `@'
keccak.s: keccak.s:9: Error: junk at end of line, first unrecognized character is `@'
keccak.s: keccak.s:10: Error: junk at end of line, first unrecognized character is `@'
keccak.s: keccak.s:11: Error: junk at end of line, first unrecognized character is `@'
keccak.s: keccak.s:12: Error: junk at end of line, first unrecognized character is `@'
keccak.s: keccak.s:13: Error: junk at end of line, first unrecognized character is `@'
keccak.s: keccak.s:14: Error: junk at end of line, first unrecognized character is `@'
keccak.s: keccak.s:16: Error: junk at end of line, first unrecognized character is `@'
keccak.s: keccak.s:18: Error: junk at end of line, first unrecognized character is `@'
keccak.s: keccak.s:21: Error: unknown pseudo-op: `.syntax'
keccak.s: keccak.s:22: Error: unknown pseudo-op: `.thumb'
keccak.s: keccak.s:25: Error: junk at end of line, first unrecognized character is `@'
keccak.s: keccak.s:78: Error: junk at end of line, first unrecognized character is `@'
keccak.s: keccak.s:127: Error: junk at end of line, first unrecognized character is `@'
keccak.s: keccak.s:179: Error: junk at end of line, first unrecognized character is `@'
keccak.s: keccak.s:471: Error: junk at end of line, first unrecognized character is `@'
keccak.s: keccak.s:472: Error: junk at end of line, first unrecognized character is `@'
keccak.s: ...

Number of similar (compiler,implementation) pairs: 4, namely:
CompilerImplementations
gcc -march=native -mtune=native -O2 -fomit-frame-pointer -fwrapv -fPIC -fPIE T:kcp/inplace1600ARMv7A
gcc -march=native -mtune=native -O3 -fomit-frame-pointer -fwrapv -fPIC -fPIE T:kcp/inplace1600ARMv7A
gcc -march=native -mtune=native -O -fomit-frame-pointer -fwrapv -fPIC -fPIE T:kcp/inplace1600ARMv7A
gcc -march=native -mtune=native -Os -fomit-frame-pointer -fwrapv -fPIC -fPIE T:kcp/inplace1600ARMv7A

Compiler output

Implementation: T:kcp/inplace1600ARMv7M
Security model: timingleaks
Compiler: gcc -march=native -mtune=native -O2 -fomit-frame-pointer -fwrapv -fPIC -fPIE
keccak.s: keccak.s: Assembler messages:
keccak.s: keccak.s:1: Error: junk at end of line, first unrecognized character is `@'
keccak.s: keccak.s:2: Error: junk at end of line, first unrecognized character is `@'
keccak.s: keccak.s:3: Error: junk at end of line, first unrecognized character is `@'
keccak.s: keccak.s:4: Error: junk at end of line, first unrecognized character is `@'
keccak.s: keccak.s:5: Error: junk at end of line, first unrecognized character is `@'
keccak.s: keccak.s:6: Error: junk at end of line, first unrecognized character is `@'
keccak.s: keccak.s:7: Error: junk at end of line, first unrecognized character is `@'
keccak.s: keccak.s:8: Error: junk at end of line, first unrecognized character is `@'
keccak.s: keccak.s:9: Error: junk at end of line, first unrecognized character is `@'
keccak.s: keccak.s:10: Error: junk at end of line, first unrecognized character is `@'
keccak.s: keccak.s:11: Error: junk at end of line, first unrecognized character is `@'
keccak.s: keccak.s:12: Error: junk at end of line, first unrecognized character is `@'
keccak.s: keccak.s:13: Error: junk at end of line, first unrecognized character is `@'
keccak.s: keccak.s:14: Error: junk at end of line, first unrecognized character is `@'
keccak.s: keccak.s:16: Error: junk at end of line, first unrecognized character is `@'
keccak.s: keccak.s:19: Error: unknown pseudo-op: `.thumb'
keccak.s: keccak.s:20: Error: unknown pseudo-op: `.syntax'
keccak.s: keccak.s:23: Error: junk at end of line, first unrecognized character is `@'
keccak.s: keccak.s:76: Error: junk at end of line, first unrecognized character is `@'
keccak.s: keccak.s:125: Error: junk at end of line, first unrecognized character is `@'
keccak.s: keccak.s:177: Error: junk at end of line, first unrecognized character is `@'
keccak.s: keccak.s:470: Error: junk at end of line, first unrecognized character is `@'
keccak.s: keccak.s:471: Error: junk at end of line, first unrecognized character is `@'
keccak.s: keccak.s:472: Error: junk at end of line, first unrecognized character is `@'
keccak.s: ...

Number of similar (compiler,implementation) pairs: 4, namely:
CompilerImplementations
gcc -march=native -mtune=native -O2 -fomit-frame-pointer -fwrapv -fPIC -fPIE T:kcp/inplace1600ARMv7M
gcc -march=native -mtune=native -O3 -fomit-frame-pointer -fwrapv -fPIC -fPIE T:kcp/inplace1600ARMv7M
gcc -march=native -mtune=native -O -fomit-frame-pointer -fwrapv -fPIC -fPIE T:kcp/inplace1600ARMv7M
gcc -march=native -mtune=native -Os -fomit-frame-pointer -fwrapv -fPIC -fPIE T:kcp/inplace1600ARMv7M

Compiler output

Implementation: T:kcp/optimized1600ARMv6Mu1
Security model: timingleaks
Compiler: gcc -march=native -mtune=native -O2 -fomit-frame-pointer -fwrapv -fPIC -fPIE
keccak.s: keccak.s: Assembler messages:
keccak.s: keccak.s:1: Error: junk at end of line, first unrecognized character is `@'
keccak.s: keccak.s:2: Error: junk at end of line, first unrecognized character is `@'
keccak.s: keccak.s:3: Error: junk at end of line, first unrecognized character is `@'
keccak.s: keccak.s:4: Error: junk at end of line, first unrecognized character is `@'
keccak.s: keccak.s:5: Error: junk at end of line, first unrecognized character is `@'
keccak.s: keccak.s:6: Error: junk at end of line, first unrecognized character is `@'
keccak.s: keccak.s:7: Error: junk at end of line, first unrecognized character is `@'
keccak.s: keccak.s:8: Error: junk at end of line, first unrecognized character is `@'
keccak.s: keccak.s:9: Error: junk at end of line, first unrecognized character is `@'
keccak.s: keccak.s:10: Error: junk at end of line, first unrecognized character is `@'
keccak.s: keccak.s:11: Error: junk at end of line, first unrecognized character is `@'
keccak.s: keccak.s:12: Error: junk at end of line, first unrecognized character is `@'
keccak.s: keccak.s:13: Error: junk at end of line, first unrecognized character is `@'
keccak.s: keccak.s:14: Error: junk at end of line, first unrecognized character is `@'
keccak.s: keccak.s:16: Error: junk at end of line, first unrecognized character is `@'
keccak.s: keccak.s:19: Error: unknown pseudo-op: `.thumb'
keccak.s: keccak.s:20: Error: unknown pseudo-op: `.syntax'
keccak.s: keccak.s:23: Error: junk at end of line, first unrecognized character is `@'
keccak.s: keccak.s:109: Error: junk at end of line, first unrecognized character is `@'
keccak.s: keccak.s:142: Error: junk at end of line, first unrecognized character is `@'
keccak.s: keccak.s:194: Error: junk at end of line, first unrecognized character is `@'
keccak.s: keccak.s:195: Error: junk at end of line, first unrecognized character is `@'
keccak.s: keccak.s:205: Error: junk at end of line, first unrecognized character is `@'
keccak.s: keccak.s:300: Error: junk at end of line, first unrecognized character is `@'
keccak.s: ...

Number of similar (compiler,implementation) pairs: 4, namely:
CompilerImplementations
gcc -march=native -mtune=native -O2 -fomit-frame-pointer -fwrapv -fPIC -fPIE T:kcp/optimized1600ARMv6Mu1
gcc -march=native -mtune=native -O3 -fomit-frame-pointer -fwrapv -fPIC -fPIE T:kcp/optimized1600ARMv6Mu1
gcc -march=native -mtune=native -O -fomit-frame-pointer -fwrapv -fPIC -fPIE T:kcp/optimized1600ARMv6Mu1
gcc -march=native -mtune=native -Os -fomit-frame-pointer -fwrapv -fPIC -fPIE T:kcp/optimized1600ARMv6Mu1

Compiler output

Implementation: T:kcp/optimized1600ARMv6Mu2
Security model: timingleaks
Compiler: gcc -march=native -mtune=native -O2 -fomit-frame-pointer -fwrapv -fPIC -fPIE
keccak.s: keccak.s: Assembler messages:
keccak.s: keccak.s:1: Error: junk at end of line, first unrecognized character is `@'
keccak.s: keccak.s:2: Error: junk at end of line, first unrecognized character is `@'
keccak.s: keccak.s:3: Error: junk at end of line, first unrecognized character is `@'
keccak.s: keccak.s:4: Error: junk at end of line, first unrecognized character is `@'
keccak.s: keccak.s:5: Error: junk at end of line, first unrecognized character is `@'
keccak.s: keccak.s:6: Error: junk at end of line, first unrecognized character is `@'
keccak.s: keccak.s:7: Error: junk at end of line, first unrecognized character is `@'
keccak.s: keccak.s:8: Error: junk at end of line, first unrecognized character is `@'
keccak.s: keccak.s:9: Error: junk at end of line, first unrecognized character is `@'
keccak.s: keccak.s:10: Error: junk at end of line, first unrecognized character is `@'
keccak.s: keccak.s:11: Error: junk at end of line, first unrecognized character is `@'
keccak.s: keccak.s:12: Error: junk at end of line, first unrecognized character is `@'
keccak.s: keccak.s:13: Error: junk at end of line, first unrecognized character is `@'
keccak.s: keccak.s:14: Error: junk at end of line, first unrecognized character is `@'
keccak.s: keccak.s:16: Error: junk at end of line, first unrecognized character is `@'
keccak.s: keccak.s:19: Error: unknown pseudo-op: `.thumb'
keccak.s: keccak.s:20: Error: unknown pseudo-op: `.syntax'
keccak.s: keccak.s:23: Error: junk at end of line, first unrecognized character is `@'
keccak.s: keccak.s:109: Error: junk at end of line, first unrecognized character is `@'
keccak.s: keccak.s:142: Error: junk at end of line, first unrecognized character is `@'
keccak.s: keccak.s:194: Error: junk at end of line, first unrecognized character is `@'
keccak.s: keccak.s:195: Error: junk at end of line, first unrecognized character is `@'
keccak.s: keccak.s:205: Error: junk at end of line, first unrecognized character is `@'
keccak.s: keccak.s:374: Error: junk at end of line, first unrecognized character is `@'
keccak.s: ...

Number of similar (compiler,implementation) pairs: 4, namely:
CompilerImplementations
gcc -march=native -mtune=native -O2 -fomit-frame-pointer -fwrapv -fPIC -fPIE T:kcp/optimized1600ARMv6Mu2
gcc -march=native -mtune=native -O3 -fomit-frame-pointer -fwrapv -fPIC -fPIE T:kcp/optimized1600ARMv6Mu2
gcc -march=native -mtune=native -O -fomit-frame-pointer -fwrapv -fPIC -fPIE T:kcp/optimized1600ARMv6Mu2
gcc -march=native -mtune=native -Os -fomit-frame-pointer -fwrapv -fPIC -fPIE T:kcp/optimized1600ARMv6Mu2

Compiler output

Implementation: T:kcp/optimized1600ARMv7A
Security model: timingleaks
Compiler: gcc -march=native -mtune=native -O2 -fomit-frame-pointer -fwrapv -fPIC -fPIE
keccak.s: keccak.s: Assembler messages:
keccak.s: keccak.s:1: Error: junk at end of line, first unrecognized character is `@'
keccak.s: keccak.s:2: Error: junk at end of line, first unrecognized character is `@'
keccak.s: keccak.s:3: Error: junk at end of line, first unrecognized character is `@'
keccak.s: keccak.s:4: Error: junk at end of line, first unrecognized character is `@'
keccak.s: keccak.s:5: Error: junk at end of line, first unrecognized character is `@'
keccak.s: keccak.s:6: Error: junk at end of line, first unrecognized character is `@'
keccak.s: keccak.s:7: Error: junk at end of line, first unrecognized character is `@'
keccak.s: keccak.s:8: Error: junk at end of line, first unrecognized character is `@'
keccak.s: keccak.s:9: Error: junk at end of line, first unrecognized character is `@'
keccak.s: keccak.s:10: Error: junk at end of line, first unrecognized character is `@'
keccak.s: keccak.s:11: Error: junk at end of line, first unrecognized character is `@'
keccak.s: keccak.s:12: Error: junk at end of line, first unrecognized character is `@'
keccak.s: keccak.s:13: Error: junk at end of line, first unrecognized character is `@'
keccak.s: keccak.s:14: Error: junk at end of line, first unrecognized character is `@'
keccak.s: keccak.s:16: Error: junk at end of line, first unrecognized character is `@'
keccak.s: keccak.s:17: Error: junk at end of line, first unrecognized character is `@'
keccak.s: keccak.s:18: Error: junk at end of line, first unrecognized character is `@'
keccak.s: keccak.s:21: Error: unknown pseudo-op: `.syntax'
keccak.s: keccak.s:22: Error: unknown pseudo-op: `.fpu'
keccak.s: keccak.s:23: Error: unknown pseudo-op: `.arm'
keccak.s: keccak.s:26: Error: junk at end of line, first unrecognized character is `@'
keccak.s: keccak.s:27: Error: junk at end of line, first unrecognized character is `@'
keccak.s: keccak.s:29: Error: junk at end of line, first unrecognized character is `@'
keccak.s: keccak.s:56: Error: junk at end of line, first unrecognized character is `@'
keccak.s: ...

Number of similar (compiler,implementation) pairs: 4, namely:
CompilerImplementations
gcc -march=native -mtune=native -O2 -fomit-frame-pointer -fwrapv -fPIC -fPIE T:kcp/optimized1600ARMv7A
gcc -march=native -mtune=native -O3 -fomit-frame-pointer -fwrapv -fPIC -fPIE T:kcp/optimized1600ARMv7A
gcc -march=native -mtune=native -O -fomit-frame-pointer -fwrapv -fPIC -fPIE T:kcp/optimized1600ARMv7A
gcc -march=native -mtune=native -Os -fomit-frame-pointer -fwrapv -fPIC -fPIE T:kcp/optimized1600ARMv7A

Compiler output

Implementation: T:kcp/optimized1600ARMv8A
Security model: timingleaks
Compiler: clang -march=native -O2 -fomit-frame-pointer -fwrapv -Qunused-arguments -fPIC -fPIE
keccak.s: keccak.s:258:20: error: unknown token in expression
keccak.s: movi v0.2d, #0
keccak.s: ^
keccak.s: keccak.s:259:20: error: unknown token in expression
keccak.s: movi v1.2d, #0
keccak.s: ^
keccak.s: keccak.s:260:20: error: unknown token in expression
keccak.s: movi v2.2d, #0
keccak.s: ^
keccak.s: keccak.s:261:20: error: unknown token in expression
keccak.s: movi v3.2d, #0
keccak.s: ^
keccak.s: keccak.s:262:15: error: unknown token in expression
keccak.s: st4 { v0.2d, v1.2d, v2.2d, v3.2d }, [x0], #64 // Clear 8lanes=64 bytes at a time
keccak.s: ^
keccak.s: keccak.s:263:15: error: unknown token in expression
keccak.s: st4 { v0.2d, v1.2d, v2.2d, v3.2d }, [x0], #64
keccak.s: ^
keccak.s: keccak.s:264:15: error: unknown token in expression
keccak.s: st4 { v0.2d, v1.2d, v2.2d, v3.2d }, [x0], #64
keccak.s: ^
keccak.s: keccak.s:265:15: error: unknown token in expression
keccak.s: st1 { v0.d }[0], [x0], #8
keccak.s: ^
keccak.s: keccak.s:276:20: error: expected ']' in brackets expression
keccak.s: ...

Number of similar (compiler,implementation) pairs: 5, namely:
CompilerImplementations
clang -march=native -O2 -fomit-frame-pointer -fwrapv -Qunused-arguments -fPIC -fPIE T:kcp/optimized1600ARMv8A
clang -march=native -O3 -fomit-frame-pointer -fwrapv -Qunused-arguments -fPIC -fPIE T:kcp/optimized1600ARMv8A
clang -march=native -O -fomit-frame-pointer -fwrapv -Qunused-arguments -fPIC -fPIE T:kcp/optimized1600ARMv8A
clang -march=native -Os -fomit-frame-pointer -fwrapv -Qunused-arguments -fPIC -fPIE T:kcp/optimized1600ARMv8A
clang -mcpu=native -O3 -fomit-frame-pointer -fwrapv -Qunused-arguments -fPIC -fPIE T:kcp/optimized1600ARMv8A

Compiler output

Implementation: T:kcp/optimized1600ARMv8A
Security model: timingleaks
Compiler: gcc -march=native -mtune=native -O2 -fomit-frame-pointer -fwrapv -fPIC -fPIE
keccak.s: keccak.s: Assembler messages:
keccak.s: keccak.s:258: Error: no such instruction: `movi v0.2d,'
keccak.s: keccak.s:259: Error: no such instruction: `movi v1.2d,'
keccak.s: keccak.s:260: Error: no such instruction: `movi v2.2d,'
keccak.s: keccak.s:261: Error: no such instruction: `movi v3.2d,'
keccak.s: keccak.s:262: Error: no such instruction: `st4 { v0.2d,v1.2d,v2.2d,v3.2d },[x0],'
keccak.s: keccak.s:263: Error: no such instruction: `st4 { v0.2d,v1.2d,v2.2d,v3.2d },[x0],'
keccak.s: keccak.s:264: Error: no such instruction: `st4 { v0.2d,v1.2d,v2.2d,v3.2d },[x0],'
keccak.s: keccak.s:265: Error: no such instruction: `st1 { v0.d }[0],[x0],'
keccak.s: keccak.s:276: Error: no such instruction: `ldrb w3,[x0,x2]'
keccak.s: keccak.s:277: Error: no such instruction: `eor w3,w3,w1'
keccak.s: keccak.s:278: Error: too many memory references for `str'
keccak.s: keccak.s:289: Error: too many memory references for `add'
keccak.s: keccak.s:290: Error: too many memory references for `sub'
keccak.s: keccak.s:291: Error: no such instruction: `b.cc KeccakP1600_AddBytes_Exit//length 0,move along'
keccak.s: keccak.s:293: Error: too many memory references for `sub'
keccak.s: keccak.s:294: Error: no such instruction: `b.cc KeccakP1600_AddBytes_Lanes//Jump if length is negative'
keccak.s: keccak.s:295: Error: no such instruction: `ld4 { v0.2d,v1.2d,v2.2d,v3.2d },[x0]'
keccak.s: keccak.s:296: Error: no such instruction: `ld4 { v4.2d,v5.2d,v6.2d,v7.2d },[x1],'
keccak.s: keccak.s:297: Error: no such instruction: `eor v0.16b,v0.16b,v4.16b'
keccak.s: keccak.s:298: Error: no such instruction: `eor v1.16b,v1.16b,v5.16b'
keccak.s: keccak.s:299: Error: no such instruction: `eor v2.16b,v2.16b,v6.16b'
keccak.s: keccak.s:300: Error: no such instruction: `eor v3.16b,v3.16b,v7.16b'
keccak.s: keccak.s:301: Error: no such instruction: `st4 { v0.2d,v1.2d,v2.2d,v3.2d },[x0],'
keccak.s: keccak.s:302: Error: no such instruction: `b KeccakP1600_AddBytes_8LanesLoop'
keccak.s: ...

Number of similar (compiler,implementation) pairs: 4, namely:
CompilerImplementations
gcc -march=native -mtune=native -O2 -fomit-frame-pointer -fwrapv -fPIC -fPIE T:kcp/optimized1600ARMv8A
gcc -march=native -mtune=native -O3 -fomit-frame-pointer -fwrapv -fPIC -fPIE T:kcp/optimized1600ARMv8A
gcc -march=native -mtune=native -O -fomit-frame-pointer -fwrapv -fPIC -fPIE T:kcp/optimized1600ARMv8A
gcc -march=native -mtune=native -Os -fomit-frame-pointer -fwrapv -fPIC -fPIE T:kcp/optimized1600ARMv8A

Compiler output

Implementation: T:kcp/optimized1600AVX2
Security model: timingleaks
Compiler: clang++ -march=native -O2 -fomit-frame-pointer -fwrapv -Qunused-arguments -fPIC -fPIE
K12.c: clang: warning: treating 'c' input as 'c++' when in C++ mode, this behavior is deprecated [-Wdeprecated]
KangarooTwelve.c: clang: warning: treating 'c' input as 'c++' when in C++ mode, this behavior is deprecated [-Wdeprecated]
KeccakSpongeWidth1600.c: clang: warning: treating 'c' input as 'c++' when in C++ mode, this behavior is deprecated [-Wdeprecated]
try.cpp: /usr/bin/ld: libcrypto_hash_k12.a(KeccakSpongeWidth1600.o): in function `KeccakWidth1600_Sponge(unsigned int, unsigned int, unsigned char const*, unsigned long, unsigned char, unsigned char*, unsigned long)':
try.cpp: KeccakSpongeWidth1600.c:(.text+0x...): undefined reference to `KeccakP1600_StaticInitialize()'
try.cpp: /usr/bin/ld: KeccakSpongeWidth1600.c:(.text+0x...): undefined reference to `KeccakP1600_Initialize(void*)'
try.cpp: /usr/bin/ld: KeccakSpongeWidth1600.c:(.text+0x...): undefined reference to `KeccakF1600_FastLoop_Absorb(void*, unsigned int, unsigned char const*, unsigned long)'
try.cpp: /usr/bin/ld: KeccakSpongeWidth1600.c:(.text+0x...): undefined reference to `KeccakP1600_AddBytes(void*, unsigned char const*, unsigned int, unsigned int)'
try.cpp: /usr/bin/ld: KeccakSpongeWidth1600.c:(.text+0x...): undefined reference to `KeccakP1600_Permute_24rounds(void*)'
try.cpp: /usr/bin/ld: KeccakSpongeWidth1600.c:(.text+0x...): undefined reference to `KeccakP1600_AddBytes(void*, unsigned char const*, unsigned int, unsigned int)'
try.cpp: /usr/bin/ld: KeccakSpongeWidth1600.c:(.text+0x...): undefined reference to `KeccakP1600_AddByte(void*, unsigned char, unsigned int)'
try.cpp: /usr/bin/ld: KeccakSpongeWidth1600.c:(.text+0x...): undefined reference to `KeccakP1600_Permute_24rounds(void*)'
try.cpp: /usr/bin/ld: KeccakSpongeWidth1600.c:(.text+0x...): undefined reference to `KeccakP1600_AddByte(void*, unsigned char, unsigned int)'
try.cpp: /usr/bin/ld: KeccakSpongeWidth1600.c:(.text+0x...): undefined reference to `KeccakP1600_Permute_24rounds(void*)'
try.cpp: /usr/bin/ld: KeccakSpongeWidth1600.c:(.text+0x...): undefined reference to `KeccakP1600_ExtractBytes(void const*, unsigned char*, unsigned int, unsigned int)'
try.cpp: /usr/bin/ld: KeccakSpongeWidth1600.c:(.text+0x...): undefined reference to `KeccakP1600_Permute_24rounds(void*)'
try.cpp: /usr/bin/ld: KeccakSpongeWidth1600.c:(.text+0x...): undefined reference to `KeccakP1600_ExtractBytes(void const*, unsigned char*, unsigned int, unsigned int)'
try.cpp: /usr/bin/ld: libcrypto_hash_k12.a(KeccakSpongeWidth1600.o): in function `KeccakWidth1600_SpongeInitialize(KeccakWidth1600_SpongeInstanceStruct*, unsigned int, unsigned int)':
try.cpp: KeccakSpongeWidth1600.c:(.text+0x...): undefined reference to `KeccakP1600_StaticInitialize()'
try.cpp: /usr/bin/ld: KeccakSpongeWidth1600.c:(.text+0x...): undefined reference to `KeccakP1600_Initialize(void*)'
try.cpp: /usr/bin/ld: libcrypto_hash_k12.a(KeccakSpongeWidth1600.o): in function `KeccakWidth1600_SpongeAbsorb(KeccakWidth1600_SpongeInstanceStruct*, unsigned char const*, unsigned long)':
try.cpp: KeccakSpongeWidth1600.c:(.text+0x...): undefined reference to `KeccakP1600_AddBytes(void*, unsigned char const*, unsigned int, unsigned int)'
try.cpp: /usr/bin/ld: KeccakSpongeWidth1600.c:(.text+0x...): undefined reference to `KeccakP1600_Permute_24rounds(void*)'
try.cpp: /usr/bin/ld: KeccakSpongeWidth1600.c:(.text+0x...): undefined reference to `KeccakP1600_AddBytes(void*, unsigned char const*, unsigned int, unsigned int)'
try.cpp: /usr/bin/ld: KeccakSpongeWidth1600.c:(.text+0x...): undefined reference to `KeccakP1600_Permute_24rounds(void*)'
try.cpp: /usr/bin/ld: KeccakSpongeWidth1600.c:(.text+0x...): undefined reference to `KeccakF1600_FastLoop_Absorb(void*, unsigned int, unsigned char const*, unsigned long)'
try.cpp: /usr/bin/ld: libcrypto_hash_k12.a(KeccakSpongeWidth1600.o): in function `KeccakWidth1600_SpongeAbsorbLastFewBits(KeccakWidth1600_SpongeInstanceStruct*, unsigned char)':
try.cpp: KeccakSpongeWidth1600.c:(.text+0x...): undefined reference to `KeccakP1600_AddByte(void*, unsigned char, unsigned int)'
try.cpp: ...

Number of similar (compiler,implementation) pairs: 3, namely:
CompilerImplementations
clang++ -march=native -O2 -fomit-frame-pointer -fwrapv -Qunused-arguments -fPIC -fPIE T:kcp/optimized1600AVX2
clang++ -march=native -O -fomit-frame-pointer -fwrapv -Qunused-arguments -fPIC -fPIE T:kcp/optimized1600AVX2
clang++ -march=native -Os -fomit-frame-pointer -fwrapv -Qunused-arguments -fPIC -fPIE T:kcp/optimized1600AVX2

Compiler output

Implementation: T:kcp/optimized1600AVX2
Security model: timingleaks
Compiler: clang++ -march=native -O3 -fomit-frame-pointer -fwrapv -Qunused-arguments -fPIC -fPIE
K12.c: clang: warning: treating 'c' input as 'c++' when in C++ mode, this behavior is deprecated [-Wdeprecated]
KangarooTwelve.c: clang: warning: treating 'c' input as 'c++' when in C++ mode, this behavior is deprecated [-Wdeprecated]
KeccakSpongeWidth1600.c: clang: warning: treating 'c' input as 'c++' when in C++ mode, this behavior is deprecated [-Wdeprecated]
try.cpp: /usr/bin/ld: libcrypto_hash_k12.a(KeccakSpongeWidth1600.o): in function `KeccakWidth1600_Sponge(unsigned int, unsigned int, unsigned char const*, unsigned long, unsigned char, unsigned char*, unsigned long)':
try.cpp: KeccakSpongeWidth1600.c:(.text+0x...): undefined reference to `KeccakP1600_StaticInitialize()'
try.cpp: /usr/bin/ld: KeccakSpongeWidth1600.c:(.text+0x...): undefined reference to `KeccakP1600_Initialize(void*)'
try.cpp: /usr/bin/ld: KeccakSpongeWidth1600.c:(.text+0x...): undefined reference to `KeccakF1600_FastLoop_Absorb(void*, unsigned int, unsigned char const*, unsigned long)'
try.cpp: /usr/bin/ld: KeccakSpongeWidth1600.c:(.text+0x...): undefined reference to `KeccakP1600_AddBytes(void*, unsigned char const*, unsigned int, unsigned int)'
try.cpp: /usr/bin/ld: KeccakSpongeWidth1600.c:(.text+0x...): undefined reference to `KeccakP1600_Permute_24rounds(void*)'
try.cpp: /usr/bin/ld: KeccakSpongeWidth1600.c:(.text+0x...): undefined reference to `KeccakP1600_AddBytes(void*, unsigned char const*, unsigned int, unsigned int)'
try.cpp: /usr/bin/ld: KeccakSpongeWidth1600.c:(.text+0x...): undefined reference to `KeccakP1600_AddByte(void*, unsigned char, unsigned int)'
try.cpp: /usr/bin/ld: KeccakSpongeWidth1600.c:(.text+0x...): undefined reference to `KeccakP1600_Permute_24rounds(void*)'
try.cpp: /usr/bin/ld: KeccakSpongeWidth1600.c:(.text+0x...): undefined reference to `KeccakP1600_AddByte(void*, unsigned char, unsigned int)'
try.cpp: /usr/bin/ld: KeccakSpongeWidth1600.c:(.text+0x...): undefined reference to `KeccakP1600_Permute_24rounds(void*)'
try.cpp: /usr/bin/ld: KeccakSpongeWidth1600.c:(.text+0x...): undefined reference to `KeccakP1600_ExtractBytes(void const*, unsigned char*, unsigned int, unsigned int)'
try.cpp: /usr/bin/ld: KeccakSpongeWidth1600.c:(.text+0x...): undefined reference to `KeccakP1600_Permute_24rounds(void*)'
try.cpp: /usr/bin/ld: KeccakSpongeWidth1600.c:(.text+0x...): undefined reference to `KeccakP1600_ExtractBytes(void const*, unsigned char*, unsigned int, unsigned int)'
try.cpp: /usr/bin/ld: libcrypto_hash_k12.a(KeccakSpongeWidth1600.o): in function `KeccakWidth1600_SpongeInitialize(KeccakWidth1600_SpongeInstanceStruct*, unsigned int, unsigned int)':
try.cpp: KeccakSpongeWidth1600.c:(.text+0x...): undefined reference to `KeccakP1600_StaticInitialize()'
try.cpp: /usr/bin/ld: KeccakSpongeWidth1600.c:(.text+0x...): undefined reference to `KeccakP1600_Initialize(void*)'
try.cpp: /usr/bin/ld: libcrypto_hash_k12.a(KeccakSpongeWidth1600.o): in function `KeccakWidth1600_SpongeAbsorb(KeccakWidth1600_SpongeInstanceStruct*, unsigned char const*, unsigned long)':
try.cpp: KeccakSpongeWidth1600.c:(.text+0x...): undefined reference to `KeccakP1600_AddBytes(void*, unsigned char const*, unsigned int, unsigned int)'
try.cpp: /usr/bin/ld: KeccakSpongeWidth1600.c:(.text+0x...): undefined reference to `KeccakP1600_Permute_24rounds(void*)'
try.cpp: /usr/bin/ld: KeccakSpongeWidth1600.c:(.text+0x...): undefined reference to `KeccakP1600_AddBytes(void*, unsigned char const*, unsigned int, unsigned int)'
try.cpp: /usr/bin/ld: KeccakSpongeWidth1600.c:(.text+0x...): undefined reference to `KeccakP1600_Permute_24rounds(void*)'
try.cpp: /usr/bin/ld: KeccakSpongeWidth1600.c:(.text+0x...): undefined reference to `KeccakF1600_FastLoop_Absorb(void*, unsigned int, unsigned char const*, unsigned long)'
try.cpp: /usr/bin/ld: KeccakSpongeWidth1600.c:(.text+0x...): undefined reference to `KeccakP1600_AddBytes(void*, unsigned char const*, unsigned int, unsigned int)'
try.cpp: /usr/bin/ld: KeccakSpongeWidth1600.c:(.text+0x...): undefined reference to `KeccakP1600_Permute_24rounds(void*)'
try.cpp: ...

Number of similar (compiler,implementation) pairs: 1, namely:
CompilerImplementations
clang++ -march=native -O3 -fomit-frame-pointer -fwrapv -Qunused-arguments -fPIC -fPIE T:kcp/optimized1600AVX2

Compiler output

Implementation: T:kcp/optimized1600AVX2
Security model: timingleaks
Compiler: g++ -march=native -mtune=native -O2 -fomit-frame-pointer -fwrapv -fPIC -fPIE
try.cpp: /usr/bin/ld: libcrypto_hash_k12.a(KeccakSpongeWidth1600.o): in function `KeccakWidth1600_Sponge(unsigned int, unsigned int, unsigned char const*, unsigned long, unsigned char, unsigned char*, unsigned long)':
try.cpp: KeccakSpongeWidth1600.c:(.text+0x...): undefined reference to `KeccakP1600_StaticInitialize()'
try.cpp: /usr/bin/ld: KeccakSpongeWidth1600.c:(.text+0x...): undefined reference to `KeccakP1600_Initialize(void*)'
try.cpp: /usr/bin/ld: KeccakSpongeWidth1600.c:(.text+0x...): undefined reference to `KeccakP1600_AddBytes(void*, unsigned char const*, unsigned int, unsigned int)'
try.cpp: /usr/bin/ld: KeccakSpongeWidth1600.c:(.text+0x...): undefined reference to `KeccakP1600_AddByte(void*, unsigned char, unsigned int)'
try.cpp: /usr/bin/ld: KeccakSpongeWidth1600.c:(.text+0x...): undefined reference to `KeccakP1600_AddByte(void*, unsigned char, unsigned int)'
try.cpp: /usr/bin/ld: KeccakSpongeWidth1600.c:(.text+0x...): undefined reference to `KeccakP1600_Permute_24rounds(void*)'
try.cpp: /usr/bin/ld: KeccakSpongeWidth1600.c:(.text+0x...): undefined reference to `KeccakP1600_ExtractBytes(void const*, unsigned char*, unsigned int, unsigned int)'
try.cpp: /usr/bin/ld: KeccakSpongeWidth1600.c:(.text+0x...): undefined reference to `KeccakP1600_Permute_24rounds(void*)'
try.cpp: /usr/bin/ld: KeccakSpongeWidth1600.c:(.text+0x...): undefined reference to `KeccakP1600_ExtractBytes(void const*, unsigned char*, unsigned int, unsigned int)'
try.cpp: /usr/bin/ld: KeccakSpongeWidth1600.c:(.text+0x...): undefined reference to `KeccakP1600_AddBytes(void*, unsigned char const*, unsigned int, unsigned int)'
try.cpp: /usr/bin/ld: KeccakSpongeWidth1600.c:(.text+0x...): undefined reference to `KeccakP1600_Permute_24rounds(void*)'
try.cpp: /usr/bin/ld: KeccakSpongeWidth1600.c:(.text+0x...): undefined reference to `KeccakF1600_FastLoop_Absorb(void*, unsigned int, unsigned char const*, unsigned long)'
try.cpp: /usr/bin/ld: KeccakSpongeWidth1600.c:(.text+0x...): undefined reference to `KeccakP1600_Permute_24rounds(void*)'
try.cpp: /usr/bin/ld: libcrypto_hash_k12.a(KeccakSpongeWidth1600.o): in function `KeccakWidth1600_SpongeInitialize(KeccakWidth1600_SpongeInstanceStruct*, unsigned int, unsigned int)':
try.cpp: KeccakSpongeWidth1600.c:(.text+0x...): undefined reference to `KeccakP1600_StaticInitialize()'
try.cpp: /usr/bin/ld: KeccakSpongeWidth1600.c:(.text+0x...): undefined reference to `KeccakP1600_Initialize(void*)'
try.cpp: /usr/bin/ld: libcrypto_hash_k12.a(KeccakSpongeWidth1600.o): in function `KeccakWidth1600_SpongeAbsorb(KeccakWidth1600_SpongeInstanceStruct*, unsigned char const*, unsigned long)':
try.cpp: KeccakSpongeWidth1600.c:(.text+0x...): undefined reference to `KeccakF1600_FastLoop_Absorb(void*, unsigned int, unsigned char const*, unsigned long)'
try.cpp: /usr/bin/ld: KeccakSpongeWidth1600.c:(.text+0x...): undefined reference to `KeccakP1600_AddBytes(void*, unsigned char const*, unsigned int, unsigned int)'
try.cpp: /usr/bin/ld: KeccakSpongeWidth1600.c:(.text+0x...): undefined reference to `KeccakP1600_Permute_24rounds(void*)'
try.cpp: /usr/bin/ld: KeccakSpongeWidth1600.c:(.text+0x...): undefined reference to `KeccakP1600_AddBytes(void*, unsigned char const*, unsigned int, unsigned int)'
try.cpp: /usr/bin/ld: KeccakSpongeWidth1600.c:(.text+0x...): undefined reference to `KeccakP1600_Permute_24rounds(void*)'
try.cpp: /usr/bin/ld: libcrypto_hash_k12.a(KeccakSpongeWidth1600.o): in function `KeccakWidth1600_SpongeAbsorbLastFewBits(KeccakWidth1600_SpongeInstanceStruct*, unsigned char)':
try.cpp: KeccakSpongeWidth1600.c:(.text+0x...): undefined reference to `KeccakP1600_AddByte(void*, unsigned char, unsigned int)'
try.cpp: ...

Number of similar (compiler,implementation) pairs: 2, namely:
CompilerImplementations
g++ -march=native -mtune=native -O2 -fomit-frame-pointer -fwrapv -fPIC -fPIE T:kcp/optimized1600AVX2
g++ -march=native -mtune=native -O3 -fomit-frame-pointer -fwrapv -fPIC -fPIE T:kcp/optimized1600AVX2

Compiler output

Implementation: T:kcp/optimized1600AVX2
Security model: timingleaks
Compiler: g++ -march=native -mtune=native -O -fomit-frame-pointer -fwrapv -fPIC -fPIE
try.cpp: /usr/bin/ld: libcrypto_hash_k12.a(KeccakSpongeWidth1600.o): in function `KeccakWidth1600_Sponge(unsigned int, unsigned int, unsigned char const*, unsigned long, unsigned char, unsigned char*, unsigned long)':
try.cpp: KeccakSpongeWidth1600.c:(.text+0x...): undefined reference to `KeccakP1600_StaticInitialize()'
try.cpp: /usr/bin/ld: KeccakSpongeWidth1600.c:(.text+0x...): undefined reference to `KeccakP1600_Initialize(void*)'
try.cpp: /usr/bin/ld: KeccakSpongeWidth1600.c:(.text+0x...): undefined reference to `KeccakF1600_FastLoop_Absorb(void*, unsigned int, unsigned char const*, unsigned long)'
try.cpp: /usr/bin/ld: KeccakSpongeWidth1600.c:(.text+0x...): undefined reference to `KeccakP1600_AddBytes(void*, unsigned char const*, unsigned int, unsigned int)'
try.cpp: /usr/bin/ld: KeccakSpongeWidth1600.c:(.text+0x...): undefined reference to `KeccakP1600_Permute_24rounds(void*)'
try.cpp: /usr/bin/ld: KeccakSpongeWidth1600.c:(.text+0x...): undefined reference to `KeccakP1600_AddBytes(void*, unsigned char const*, unsigned int, unsigned int)'
try.cpp: /usr/bin/ld: KeccakSpongeWidth1600.c:(.text+0x...): undefined reference to `KeccakP1600_AddByte(void*, unsigned char, unsigned int)'
try.cpp: /usr/bin/ld: KeccakSpongeWidth1600.c:(.text+0x...): undefined reference to `KeccakP1600_AddByte(void*, unsigned char, unsigned int)'
try.cpp: /usr/bin/ld: KeccakSpongeWidth1600.c:(.text+0x...): undefined reference to `KeccakP1600_Permute_24rounds(void*)'
try.cpp: /usr/bin/ld: KeccakSpongeWidth1600.c:(.text+0x...): undefined reference to `KeccakP1600_ExtractBytes(void const*, unsigned char*, unsigned int, unsigned int)'
try.cpp: /usr/bin/ld: KeccakSpongeWidth1600.c:(.text+0x...): undefined reference to `KeccakP1600_Permute_24rounds(void*)'
try.cpp: /usr/bin/ld: KeccakSpongeWidth1600.c:(.text+0x...): undefined reference to `KeccakP1600_ExtractBytes(void const*, unsigned char*, unsigned int, unsigned int)'
try.cpp: /usr/bin/ld: KeccakSpongeWidth1600.c:(.text+0x...): undefined reference to `KeccakP1600_Permute_24rounds(void*)'
try.cpp: /usr/bin/ld: libcrypto_hash_k12.a(KeccakSpongeWidth1600.o): in function `KeccakWidth1600_SpongeInitialize(KeccakWidth1600_SpongeInstanceStruct*, unsigned int, unsigned int)':
try.cpp: KeccakSpongeWidth1600.c:(.text+0x...): undefined reference to `KeccakP1600_StaticInitialize()'
try.cpp: /usr/bin/ld: KeccakSpongeWidth1600.c:(.text+0x...): undefined reference to `KeccakP1600_Initialize(void*)'
try.cpp: /usr/bin/ld: libcrypto_hash_k12.a(KeccakSpongeWidth1600.o): in function `KeccakWidth1600_SpongeAbsorb(KeccakWidth1600_SpongeInstanceStruct*, unsigned char const*, unsigned long)':
try.cpp: KeccakSpongeWidth1600.c:(.text+0x...): undefined reference to `KeccakP1600_AddBytes(void*, unsigned char const*, unsigned int, unsigned int)'
try.cpp: /usr/bin/ld: KeccakSpongeWidth1600.c:(.text+0x...): undefined reference to `KeccakP1600_Permute_24rounds(void*)'
try.cpp: /usr/bin/ld: KeccakSpongeWidth1600.c:(.text+0x...): undefined reference to `KeccakP1600_AddBytes(void*, unsigned char const*, unsigned int, unsigned int)'
try.cpp: /usr/bin/ld: KeccakSpongeWidth1600.c:(.text+0x...): undefined reference to `KeccakF1600_FastLoop_Absorb(void*, unsigned int, unsigned char const*, unsigned long)'
try.cpp: /usr/bin/ld: KeccakSpongeWidth1600.c:(.text+0x...): undefined reference to `KeccakP1600_Permute_24rounds(void*)'
try.cpp: /usr/bin/ld: libcrypto_hash_k12.a(KeccakSpongeWidth1600.o): in function `KeccakWidth1600_SpongeAbsorbLastFewBits(KeccakWidth1600_SpongeInstanceStruct*, unsigned char)':
try.cpp: KeccakSpongeWidth1600.c:(.text+0x...): undefined reference to `KeccakP1600_AddByte(void*, unsigned char, unsigned int)'
try.cpp: ...

Number of similar (compiler,implementation) pairs: 1, namely:
CompilerImplementations
g++ -march=native -mtune=native -O -fomit-frame-pointer -fwrapv -fPIC -fPIE T:kcp/optimized1600AVX2

Compiler output

Implementation: T:kcp/optimized1600AVX2
Security model: timingleaks
Compiler: g++ -march=native -mtune=native -Os -fomit-frame-pointer -fwrapv -fPIC -fPIE
try.cpp: /usr/bin/ld: libcrypto_hash_k12.a(KeccakSpongeWidth1600.o): in function `KeccakWidth1600_Sponge(unsigned int, unsigned int, unsigned char const*, unsigned long, unsigned char, unsigned char*, unsigned long)':
try.cpp: KeccakSpongeWidth1600.c:(.text+0x...): undefined reference to `KeccakP1600_StaticInitialize()'
try.cpp: /usr/bin/ld: KeccakSpongeWidth1600.c:(.text+0x...): undefined reference to `KeccakP1600_Initialize(void*)'
try.cpp: /usr/bin/ld: KeccakSpongeWidth1600.c:(.text+0x...): undefined reference to `KeccakF1600_FastLoop_Absorb(void*, unsigned int, unsigned char const*, unsigned long)'
try.cpp: /usr/bin/ld: KeccakSpongeWidth1600.c:(.text+0x...): undefined reference to `KeccakP1600_AddBytes(void*, unsigned char const*, unsigned int, unsigned int)'
try.cpp: /usr/bin/ld: KeccakSpongeWidth1600.c:(.text+0x...): undefined reference to `KeccakP1600_Permute_24rounds(void*)'
try.cpp: /usr/bin/ld: KeccakSpongeWidth1600.c:(.text+0x...): undefined reference to `KeccakP1600_AddBytes(void*, unsigned char const*, unsigned int, unsigned int)'
try.cpp: /usr/bin/ld: KeccakSpongeWidth1600.c:(.text+0x...): undefined reference to `KeccakP1600_AddByte(void*, unsigned char, unsigned int)'
try.cpp: /usr/bin/ld: KeccakSpongeWidth1600.c:(.text+0x...): undefined reference to `KeccakP1600_Permute_24rounds(void*)'
try.cpp: /usr/bin/ld: KeccakSpongeWidth1600.c:(.text+0x...): undefined reference to `KeccakP1600_AddByte(void*, unsigned char, unsigned int)'
try.cpp: /usr/bin/ld: KeccakSpongeWidth1600.c:(.text+0x...): undefined reference to `KeccakP1600_Permute_24rounds(void*)'
try.cpp: /usr/bin/ld: KeccakSpongeWidth1600.c:(.text+0x...): undefined reference to `KeccakP1600_ExtractBytes(void const*, unsigned char*, unsigned int, unsigned int)'
try.cpp: /usr/bin/ld: KeccakSpongeWidth1600.c:(.text+0x...): undefined reference to `KeccakP1600_Permute_24rounds(void*)'
try.cpp: /usr/bin/ld: KeccakSpongeWidth1600.c:(.text+0x...): undefined reference to `KeccakP1600_ExtractBytes(void const*, unsigned char*, unsigned int, unsigned int)'
try.cpp: /usr/bin/ld: libcrypto_hash_k12.a(KeccakSpongeWidth1600.o): in function `KeccakWidth1600_SpongeInitialize(KeccakWidth1600_SpongeInstanceStruct*, unsigned int, unsigned int)':
try.cpp: KeccakSpongeWidth1600.c:(.text+0x...): undefined reference to `KeccakP1600_StaticInitialize()'
try.cpp: /usr/bin/ld: KeccakSpongeWidth1600.c:(.text+0x...): undefined reference to `KeccakP1600_Initialize(void*)'
try.cpp: /usr/bin/ld: libcrypto_hash_k12.a(KeccakSpongeWidth1600.o): in function `KeccakWidth1600_SpongeAbsorb(KeccakWidth1600_SpongeInstanceStruct*, unsigned char const*, unsigned long)':
try.cpp: KeccakSpongeWidth1600.c:(.text+0x...): undefined reference to `KeccakF1600_FastLoop_Absorb(void*, unsigned int, unsigned char const*, unsigned long)'
try.cpp: /usr/bin/ld: KeccakSpongeWidth1600.c:(.text+0x...): undefined reference to `KeccakP1600_AddBytes(void*, unsigned char const*, unsigned int, unsigned int)'
try.cpp: /usr/bin/ld: KeccakSpongeWidth1600.c:(.text+0x...): undefined reference to `KeccakP1600_Permute_24rounds(void*)'
try.cpp: /usr/bin/ld: KeccakSpongeWidth1600.c:(.text+0x...): undefined reference to `KeccakP1600_AddBytes(void*, unsigned char const*, unsigned int, unsigned int)'
try.cpp: /usr/bin/ld: KeccakSpongeWidth1600.c:(.text+0x...): undefined reference to `KeccakP1600_Permute_24rounds(void*)'
try.cpp: /usr/bin/ld: libcrypto_hash_k12.a(KeccakSpongeWidth1600.o): in function `KeccakWidth1600_SpongeAbsorbLastFewBits(KeccakWidth1600_SpongeInstanceStruct*, unsigned char)':
try.cpp: KeccakSpongeWidth1600.c:(.text+0x...): undefined reference to `KeccakP1600_AddByte(void*, unsigned char, unsigned int)'
try.cpp: ...

Number of similar (compiler,implementation) pairs: 1, namely:
CompilerImplementations
g++ -march=native -mtune=native -Os -fomit-frame-pointer -fwrapv -fPIC -fPIE T:kcp/optimized1600AVX2

Compiler output

Implementation: T:kcp/optimized1600AVX512
Security model: timingleaks
Compiler: clang -march=native -O2 -fomit-frame-pointer -fwrapv -Qunused-arguments -fPIC -fPIE
KeccakP-1600-AVX512.c: KeccakP-1600-AVX512.c:238:41: error: always_inline function '_mm512_maskz_loadu_epi64' requires target feature 'avx512f', but would be inlined into function 'KeccakP1600_AddBytes' that is compiled without support for 'avx512f'
KeccakP-1600-AVX512.c: STORE_8Lanes( stateAsLanes, XOR(LOAD_8Lanes(stateAsLanes), LOAD_8Lanes((const UINT64*)data)));
KeccakP-1600-AVX512.c: ^
KeccakP-1600-AVX512.c: KeccakP-1600-AVX512.c:215:37: note: expanded from macro 'LOAD_8Lanes'
KeccakP-1600-AVX512.c: #define LOAD_8Lanes(a) LOAD_Lanes(0xFF,a)
KeccakP-1600-AVX512.c: ^
KeccakP-1600-AVX512.c: KeccakP-1600-AVX512.c:212:37: note: expanded from macro 'LOAD_Lanes'
KeccakP-1600-AVX512.c: #define LOAD_Lanes(m,a) _mm512_maskz_loadu_epi64(m,a)
KeccakP-1600-AVX512.c: ^
KeccakP-1600-AVX512.c: KeccakP-1600-AVX512.c:238:41: error: AVX vector return of type '__m512i' (vector of 8 'long long' values) without 'avx512f' enabled changes the ABI
KeccakP-1600-AVX512.c: KeccakP-1600-AVX512.c:215:37: note: expanded from macro 'LOAD_8Lanes'
KeccakP-1600-AVX512.c: #define LOAD_8Lanes(a) LOAD_Lanes(0xFF,a)
KeccakP-1600-AVX512.c: ^
KeccakP-1600-AVX512.c: KeccakP-1600-AVX512.c:212:37: note: expanded from macro 'LOAD_Lanes'
KeccakP-1600-AVX512.c: #define LOAD_Lanes(m,a) _mm512_maskz_loadu_epi64(m,a)
KeccakP-1600-AVX512.c: ^
KeccakP-1600-AVX512.c: KeccakP-1600-AVX512.c:238:68: error: always_inline function '_mm512_maskz_loadu_epi64' requires target feature 'avx512f', but would be inlined into function 'KeccakP1600_AddBytes' that is compiled without support for 'avx512f'
KeccakP-1600-AVX512.c: STORE_8Lanes( stateAsLanes, XOR(LOAD_8Lanes(stateAsLanes), LOAD_8Lanes((const UINT64*)data)));
KeccakP-1600-AVX512.c: ^
KeccakP-1600-AVX512.c: KeccakP-1600-AVX512.c:215:37: note: expanded from macro 'LOAD_8Lanes'
KeccakP-1600-AVX512.c: #define LOAD_8Lanes(a) LOAD_Lanes(0xFF,a)
KeccakP-1600-AVX512.c: ^
KeccakP-1600-AVX512.c: KeccakP-1600-AVX512.c:212:37: note: expanded from macro 'LOAD_Lanes'
KeccakP-1600-AVX512.c: #define LOAD_Lanes(m,a) _mm512_maskz_loadu_epi64(m,a)
KeccakP-1600-AVX512.c: ^
KeccakP-1600-AVX512.c: ...

Number of similar (compiler,implementation) pairs: 5, namely:
CompilerImplementations
clang -march=native -O2 -fomit-frame-pointer -fwrapv -Qunused-arguments -fPIC -fPIE T:kcp/optimized1600AVX512
clang -march=native -O3 -fomit-frame-pointer -fwrapv -Qunused-arguments -fPIC -fPIE T:kcp/optimized1600AVX512
clang -march=native -O -fomit-frame-pointer -fwrapv -Qunused-arguments -fPIC -fPIE T:kcp/optimized1600AVX512
clang -march=native -Os -fomit-frame-pointer -fwrapv -Qunused-arguments -fPIC -fPIE T:kcp/optimized1600AVX512
clang -mcpu=native -O3 -fomit-frame-pointer -fwrapv -Qunused-arguments -fPIC -fPIE T:kcp/optimized1600AVX512

Compiler output

Implementation: T:kcp/optimized1600AVX512
Security model: timingleaks
Compiler: gcc -march=native -mtune=native -O2 -fomit-frame-pointer -fwrapv -fPIC -fPIE
KeccakP-1600-AVX512.c: KeccakP-1600-AVX512.c: In function 'KeccakP1600_AddBytes':
KeccakP-1600-AVX512.c: KeccakP-1600-AVX512.c:216:37: warning: AVX512F vector return without AVX512F enabled changes the ABI [-Wpsabi]
KeccakP-1600-AVX512.c: 216 | #define STORE_Lanes(a,m,v) _mm512_mask_storeu_epi64(a,m,v)
KeccakP-1600-AVX512.c: | ^~~~~~~~~~~~~~~~~~~~~~~~~~~~~~~
KeccakP-1600-AVX512.c: KeccakP-1600-AVX512.c:219:37: note: in expansion of macro 'STORE_Lanes'
KeccakP-1600-AVX512.c: 219 | #define STORE_8Lanes(a,v) STORE_Lanes(a,0xFF,v)
KeccakP-1600-AVX512.c: | ^~~~~~~~~~~
KeccakP-1600-AVX512.c: KeccakP-1600-AVX512.c:238:9: note: in expansion of macro 'STORE_8Lanes'
KeccakP-1600-AVX512.c: 238 | STORE_8Lanes( stateAsLanes, XOR(LOAD_8Lanes(stateAsLanes), LOAD_8Lanes((const UINT64*)data)));
KeccakP-1600-AVX512.c: | ^~~~~~~~~~~~
KeccakP-1600-AVX512.c: In file included from /usr/lib/gcc/x86_64-linux-gnu/11/include/immintrin.h:49,
KeccakP-1600-AVX512.c: from KeccakP-1600-AVX512.c:26:
KeccakP-1600-AVX512.c: /usr/lib/gcc/x86_64-linux-gnu/11/include/avx512fintrin.h:6440:1: error: inlining failed in call to 'always_inline' '_mm512_mask_storeu_epi64': target specific option mismatch
KeccakP-1600-AVX512.c: 6440 | _mm512_mask_storeu_epi64 (void *__P, __mmask8 __U, __m512i __A)
KeccakP-1600-AVX512.c: | ^~~~~~~~~~~~~~~~~~~~~~~~
KeccakP-1600-AVX512.c: KeccakP-1600-AVX512.c:216:37: note: called from here
KeccakP-1600-AVX512.c: 216 | #define STORE_Lanes(a,m,v) _mm512_mask_storeu_epi64(a,m,v)
KeccakP-1600-AVX512.c: | ^~~~~~~~~~~~~~~~~~~~~~~~~~~~~~~
KeccakP-1600-AVX512.c: KeccakP-1600-AVX512.c:219:37: note: in expansion of macro 'STORE_Lanes'
KeccakP-1600-AVX512.c: 219 | #define STORE_8Lanes(a,v) STORE_Lanes(a,0xFF,v)
KeccakP-1600-AVX512.c: | ^~~~~~~~~~~
KeccakP-1600-AVX512.c: KeccakP-1600-AVX512.c:238:9: note: in expansion of macro 'STORE_8Lanes'
KeccakP-1600-AVX512.c: 238 | STORE_8Lanes( stateAsLanes, XOR(LOAD_8Lanes(stateAsLanes), LOAD_8Lanes((const UINT64*)data)));
KeccakP-1600-AVX512.c: | ^~~~~~~~~~~~
KeccakP-1600-AVX512.c: In file included from /usr/lib/gcc/x86_64-linux-gnu/11/include/immintrin.h:49,
KeccakP-1600-AVX512.c: ...

Number of similar (compiler,implementation) pairs: 4, namely:
CompilerImplementations
gcc -march=native -mtune=native -O2 -fomit-frame-pointer -fwrapv -fPIC -fPIE T:kcp/optimized1600AVX512
gcc -march=native -mtune=native -O3 -fomit-frame-pointer -fwrapv -fPIC -fPIE T:kcp/optimized1600AVX512
gcc -march=native -mtune=native -O -fomit-frame-pointer -fwrapv -fPIC -fPIE T:kcp/optimized1600AVX512
gcc -march=native -mtune=native -Os -fomit-frame-pointer -fwrapv -fPIC -fPIE T:kcp/optimized1600AVX512

Compiler output

Implementation: T:kcp/optimized1600AsmX86-64
Security model: timingleaks
Compiler: clang -march=native -O2 -fomit-frame-pointer -fwrapv -Qunused-arguments -fPIC -fPIE
try.c: /usr/bin/ld: libcrypto_hash_k12.a(keccak.o): relocation R_X86_64_32S against `.text' can not be used when making a PIE object; recompile with -fPIE
try.c: /usr/bin/ld: failed to set dynamic section sizes: bad value
try.c: clang: error: linker command failed with exit code 1 (use -v to see invocation)

Number of similar (compiler,implementation) pairs: 10, namely:
CompilerImplementations
clang -march=native -O2 -fomit-frame-pointer -fwrapv -Qunused-arguments -fPIC -fPIE T:kcp/optimized1600AsmX86-64
clang -march=native -O3 -fomit-frame-pointer -fwrapv -Qunused-arguments -fPIC -fPIE T:kcp/optimized1600AsmX86-64
clang -march=native -O -fomit-frame-pointer -fwrapv -Qunused-arguments -fPIC -fPIE T:kcp/optimized1600AsmX86-64
clang -march=native -Os -fomit-frame-pointer -fwrapv -Qunused-arguments -fPIC -fPIE T:kcp/optimized1600AsmX86-64
clang -mcpu=native -O3 -fomit-frame-pointer -fwrapv -Qunused-arguments -fPIC -fPIE T:kcp/optimized1600AsmX86-64
clang -march=native -O2 -fomit-frame-pointer -fwrapv -Qunused-arguments -fPIC -fPIE T:kcp/optimized1600AsmX86-64shld
clang -march=native -O3 -fomit-frame-pointer -fwrapv -Qunused-arguments -fPIC -fPIE T:kcp/optimized1600AsmX86-64shld
clang -march=native -O -fomit-frame-pointer -fwrapv -Qunused-arguments -fPIC -fPIE T:kcp/optimized1600AsmX86-64shld
clang -march=native -Os -fomit-frame-pointer -fwrapv -Qunused-arguments -fPIC -fPIE T:kcp/optimized1600AsmX86-64shld
clang -mcpu=native -O3 -fomit-frame-pointer -fwrapv -Qunused-arguments -fPIC -fPIE T:kcp/optimized1600AsmX86-64shld

Compiler output

Implementation: T:kcp/optimized1600AsmX86-64
Security model: timingleaks
Compiler: gcc -march=native -mtune=native -O2 -fomit-frame-pointer -fwrapv -fPIC -fPIE
try.c: /usr/bin/ld: libcrypto_hash_k12.a(keccak.o): relocation R_X86_64_32S against `.text' can not be used when making a PIE object; recompile with -fPIE
try.c: /usr/bin/ld: failed to set dynamic section sizes: bad value
try.c: collect2: error: ld returned 1 exit status

Number of similar (compiler,implementation) pairs: 8, namely:
CompilerImplementations
gcc -march=native -mtune=native -O2 -fomit-frame-pointer -fwrapv -fPIC -fPIE T:kcp/optimized1600AsmX86-64
gcc -march=native -mtune=native -O3 -fomit-frame-pointer -fwrapv -fPIC -fPIE T:kcp/optimized1600AsmX86-64
gcc -march=native -mtune=native -O -fomit-frame-pointer -fwrapv -fPIC -fPIE T:kcp/optimized1600AsmX86-64
gcc -march=native -mtune=native -Os -fomit-frame-pointer -fwrapv -fPIC -fPIE T:kcp/optimized1600AsmX86-64
gcc -march=native -mtune=native -O2 -fomit-frame-pointer -fwrapv -fPIC -fPIE T:kcp/optimized1600AsmX86-64shld
gcc -march=native -mtune=native -O3 -fomit-frame-pointer -fwrapv -fPIC -fPIE T:kcp/optimized1600AsmX86-64shld
gcc -march=native -mtune=native -O -fomit-frame-pointer -fwrapv -fPIC -fPIE T:kcp/optimized1600AsmX86-64shld
gcc -march=native -mtune=native -Os -fomit-frame-pointer -fwrapv -fPIC -fPIE T:kcp/optimized1600AsmX86-64shld

Compiler output

Implementation: T:kcp/optimized1600AsmX86-64Apple
Security model: timingleaks
Compiler: clang -march=native -O2 -fomit-frame-pointer -fwrapv -Qunused-arguments -fPIC -fPIE
keccak.s: keccak.s:555:24: error: expected register here
keccak.s: movq %rax, _ba(arg1)
keccak.s: ^
keccak.s: keccak.s:556:24: error: expected register here
keccak.s: movq %rcx, _be(arg1)
keccak.s: ^
keccak.s: keccak.s:557:24: error: expected register here
keccak.s: movq %rcx, _bi(arg1)
keccak.s: ^
keccak.s: keccak.s:558:24: error: expected register here
keccak.s: movq %rax, _bo(arg1)
keccak.s: ^
keccak.s: keccak.s:559:24: error: expected register here
keccak.s: movdqu %xmm0, _bu(arg1)
keccak.s: ^
keccak.s: keccak.s:560:24: error: expected register here
keccak.s: movdqu %xmm0, _ge(arg1)
keccak.s: ^
keccak.s: keccak.s:561:24: error: expected register here
keccak.s: movq %rcx, _go(arg1)
keccak.s: ^
keccak.s: keccak.s:562:24: error: expected register here
keccak.s: movq %rax, _gu(arg1)
keccak.s: ^
keccak.s: keccak.s:563:24: error: expected register here
keccak.s: ...

Number of similar (compiler,implementation) pairs: 5, namely:
CompilerImplementations
clang -march=native -O2 -fomit-frame-pointer -fwrapv -Qunused-arguments -fPIC -fPIE T:kcp/optimized1600AsmX86-64Apple
clang -march=native -O3 -fomit-frame-pointer -fwrapv -Qunused-arguments -fPIC -fPIE T:kcp/optimized1600AsmX86-64Apple
clang -march=native -O -fomit-frame-pointer -fwrapv -Qunused-arguments -fPIC -fPIE T:kcp/optimized1600AsmX86-64Apple
clang -march=native -Os -fomit-frame-pointer -fwrapv -Qunused-arguments -fPIC -fPIE T:kcp/optimized1600AsmX86-64Apple
clang -mcpu=native -O3 -fomit-frame-pointer -fwrapv -Qunused-arguments -fPIC -fPIE T:kcp/optimized1600AsmX86-64Apple

Compiler output

Implementation: T:kcp/optimized1600AsmX86-64Apple
Security model: timingleaks
Compiler: gcc -march=native -mtune=native -O2 -fomit-frame-pointer -fwrapv -fPIC -fPIE
keccak.s: keccak.s: Assembler messages:
keccak.s: keccak.s:555: Error: junk `(arg1)' after expression
keccak.s: keccak.s:556: Error: junk `(arg1)' after expression
keccak.s: keccak.s:557: Error: junk `(arg1)' after expression
keccak.s: keccak.s:558: Error: junk `(arg1)' after expression
keccak.s: keccak.s:559: Error: junk `(arg1)' after expression
keccak.s: keccak.s:560: Error: junk `(arg1)' after expression
keccak.s: keccak.s:561: Error: junk `(arg1)' after expression
keccak.s: keccak.s:562: Error: junk `(arg1)' after expression
keccak.s: keccak.s:563: Error: junk `(arg1)' after expression
keccak.s: keccak.s:564: Error: junk `(arg1)' after expression
keccak.s: keccak.s:565: Error: junk `(arg1)' after expression
keccak.s: keccak.s:566: Error: junk `(arg1)' after expression
keccak.s: keccak.s:567: Error: junk `(arg1)' after expression
keccak.s: keccak.s:568: Error: junk `(arg1)' after expression
keccak.s: keccak.s:569: Error: junk `(arg1)' after expression
keccak.s: keccak.s:570: Error: junk `(arg1)' after expression
keccak.s: keccak.s:571: Error: junk `(arg1)' after expression
keccak.s: keccak.s:572: Error: junk `(arg1)' after expression
keccak.s: keccak.s:573: Error: junk `(arg1)' after expression
keccak.s: keccak.s:583: Error: too many memory references for `add'
keccak.s: keccak.s:598: Error: too many memory references for `add'
keccak.s: keccak.s:601: Error: too many memory references for `movq'
keccak.s: keccak.s:605: Error: junk `(arg2)' after expression
keccak.s: keccak.s:605: Error: junk `(arg1)' after expression
keccak.s: ...

Number of similar (compiler,implementation) pairs: 4, namely:
CompilerImplementations
gcc -march=native -mtune=native -O2 -fomit-frame-pointer -fwrapv -fPIC -fPIE T:kcp/optimized1600AsmX86-64Apple
gcc -march=native -mtune=native -O3 -fomit-frame-pointer -fwrapv -fPIC -fPIE T:kcp/optimized1600AsmX86-64Apple
gcc -march=native -mtune=native -O -fomit-frame-pointer -fwrapv -fPIC -fPIE T:kcp/optimized1600AsmX86-64Apple
gcc -march=native -mtune=native -Os -fomit-frame-pointer -fwrapv -fPIC -fPIE T:kcp/optimized1600AsmX86-64Apple

Compiler output

Implementation: T:kcp/optimized1600XOPu6
Security model: timingleaks
Compiler: clang -march=native -O2 -fomit-frame-pointer -fwrapv -Qunused-arguments -fPIC -fPIE
KeccakP-1600-XOP.c: KeccakP-1600-XOP.c:400:5: error: '__builtin_ia32_vprotqi' needs target feature xop
KeccakP-1600-XOP.c: roundsN(nr)
KeccakP-1600-XOP.c: ^
KeccakP-1600-XOP.c: ./KeccakP-1600-unrolling.macros:297:9: note: expanded from macro 'roundsN'
KeccakP-1600-XOP.c: thetaRhoPiChiIotaPrepareTheta(i, A, E) \
KeccakP-1600-XOP.c: ^
KeccakP-1600-XOP.c: KeccakP-1600-XOP.c:200:5: note: expanded from macro 'thetaRhoPiChiIotaPrepareTheta'
KeccakP-1600-XOP.c: computeD \
KeccakP-1600-XOP.c: ^
KeccakP-1600-XOP.c: KeccakP-1600-XOP.c:187:23: note: expanded from macro 'computeD'
KeccakP-1600-XOP.c: Dei = XOR128(Cae, ROL6464same(Cio, 1)); \
KeccakP-1600-XOP.c: ^
KeccakP-1600-XOP.c: KeccakP-1600-XOP.c:60:29: note: expanded from macro 'ROL6464same'
KeccakP-1600-XOP.c: #define ROL6464same(a, o) _mm_roti_epi64(a, o)
KeccakP-1600-XOP.c: ^
KeccakP-1600-XOP.c: /usr/lib/llvm-14/lib/clang/14.0.0/include/xopintrin.h:237:13: note: expanded from macro '_mm_roti_epi64'
KeccakP-1600-XOP.c: ((__m128i)__builtin_ia32_vprotqi((__v2di)(__m128i)(A), (N)))
KeccakP-1600-XOP.c: ^
KeccakP-1600-XOP.c: KeccakP-1600-XOP.c:400:5: error: '__builtin_ia32_vprotqi' needs target feature xop
KeccakP-1600-XOP.c: ./KeccakP-1600-unrolling.macros:297:9: note: expanded from macro 'roundsN'
KeccakP-1600-XOP.c: thetaRhoPiChiIotaPrepareTheta(i, A, E) \
KeccakP-1600-XOP.c: ^
KeccakP-1600-XOP.c: KeccakP-1600-XOP.c:200:5: note: expanded from macro 'thetaRhoPiChiIotaPrepareTheta'
KeccakP-1600-XOP.c: computeD \
KeccakP-1600-XOP.c: ^
KeccakP-1600-XOP.c: ...

Number of similar (compiler,implementation) pairs: 10, namely:
CompilerImplementations
clang -march=native -O2 -fomit-frame-pointer -fwrapv -Qunused-arguments -fPIC -fPIE T:kcp/optimized1600XOPu6
clang -march=native -O3 -fomit-frame-pointer -fwrapv -Qunused-arguments -fPIC -fPIE T:kcp/optimized1600XOPu6
clang -march=native -O -fomit-frame-pointer -fwrapv -Qunused-arguments -fPIC -fPIE T:kcp/optimized1600XOPu6
clang -march=native -Os -fomit-frame-pointer -fwrapv -Qunused-arguments -fPIC -fPIE T:kcp/optimized1600XOPu6
clang -mcpu=native -O3 -fomit-frame-pointer -fwrapv -Qunused-arguments -fPIC -fPIE T:kcp/optimized1600XOPu6
clang -march=native -O2 -fomit-frame-pointer -fwrapv -Qunused-arguments -fPIC -fPIE T:kcp/optimized1600XOPufull
clang -march=native -O3 -fomit-frame-pointer -fwrapv -Qunused-arguments -fPIC -fPIE T:kcp/optimized1600XOPufull
clang -march=native -O -fomit-frame-pointer -fwrapv -Qunused-arguments -fPIC -fPIE T:kcp/optimized1600XOPufull
clang -march=native -Os -fomit-frame-pointer -fwrapv -Qunused-arguments -fPIC -fPIE T:kcp/optimized1600XOPufull
clang -mcpu=native -O3 -fomit-frame-pointer -fwrapv -Qunused-arguments -fPIC -fPIE T:kcp/optimized1600XOPufull

Compiler output

Implementation: T:kcp/optimized1600XOPu6
Security model: timingleaks
Compiler: gcc -march=native -mtune=native -O2 -fomit-frame-pointer -fwrapv -fPIC -fPIE
KeccakP-1600-XOP.c: In file included from /usr/lib/gcc/x86_64-linux-gnu/11/include/x86intrin.h:38,
KeccakP-1600-XOP.c: from KeccakP-1600-XOP.c:32:
KeccakP-1600-XOP.c: KeccakP-1600-XOP.c: In function 'KeccakP1600_Permute_Nrounds':
KeccakP-1600-XOP.c: /usr/lib/gcc/x86_64-linux-gnu/11/include/xopintrin.h:272:1: error: inlining failed in call to 'always_inline' '_mm_roti_epi64': target specific option mismatch
KeccakP-1600-XOP.c: 272 | _mm_roti_epi64(__m128i __A, const int __B)
KeccakP-1600-XOP.c: | ^~~~~~~~~~~~~~
KeccakP-1600-XOP.c: KeccakP-1600-XOP.c:60:29: note: called from here
KeccakP-1600-XOP.c: 60 | #define ROL6464same(a, o) _mm_roti_epi64(a, o)
KeccakP-1600-XOP.c: | ^~~~~~~~~~~~~~~~~~~~
KeccakP-1600-XOP.c: KeccakP-1600-XOP.c:250:13: note: in expansion of macro 'ROL6464same'
KeccakP-1600-XOP.c: 250 | Bsusa = ROL6464same(Bsusa, 2); \
KeccakP-1600-XOP.c: | ^~~~~~~~~~~
KeccakP-1600-XOP.c: KeccakP-1600-unrolling.macros:297:9: note: in expansion of macro 'thetaRhoPiChiIotaPrepareTheta'
KeccakP-1600-XOP.c: 297 | thetaRhoPiChiIotaPrepareTheta(i, A, E) \
KeccakP-1600-XOP.c: | ^~~~~~~~~~~~~~~~~~~~~~~~~~~~~
KeccakP-1600-XOP.c: KeccakP-1600-XOP.c:400:5: note: in expansion of macro 'roundsN'
KeccakP-1600-XOP.c: 400 | roundsN(nr)
KeccakP-1600-XOP.c: | ^~~~~~~
KeccakP-1600-XOP.c: In file included from /usr/lib/gcc/x86_64-linux-gnu/11/include/x86intrin.h:38,
KeccakP-1600-XOP.c: from KeccakP-1600-XOP.c:32:
KeccakP-1600-XOP.c: /usr/lib/gcc/x86_64-linux-gnu/11/include/xopintrin.h:245:1: error: inlining failed in call to 'always_inline' '_mm_rot_epi64': target specific option mismatch
KeccakP-1600-XOP.c: 245 | _mm_rot_epi64(__m128i __A, __m128i __B)
KeccakP-1600-XOP.c: | ^~~~~~~~~~~~~
KeccakP-1600-XOP.c: KeccakP-1600-XOP.c:61:29: note: called from here
KeccakP-1600-XOP.c: 61 | #define ROL6464(a, r1, r2) _mm_rot_epi64(a, CONST128( rot_##r1##_##r2 ))
KeccakP-1600-XOP.c: ...

Number of similar (compiler,implementation) pairs: 8, namely:
CompilerImplementations
gcc -march=native -mtune=native -O2 -fomit-frame-pointer -fwrapv -fPIC -fPIE T:kcp/optimized1600XOPu6
gcc -march=native -mtune=native -O3 -fomit-frame-pointer -fwrapv -fPIC -fPIE T:kcp/optimized1600XOPu6
gcc -march=native -mtune=native -O -fomit-frame-pointer -fwrapv -fPIC -fPIE T:kcp/optimized1600XOPu6
gcc -march=native -mtune=native -Os -fomit-frame-pointer -fwrapv -fPIC -fPIE T:kcp/optimized1600XOPu6
gcc -march=native -mtune=native -O2 -fomit-frame-pointer -fwrapv -fPIC -fPIE T:kcp/optimized1600XOPufull
gcc -march=native -mtune=native -O3 -fomit-frame-pointer -fwrapv -fPIC -fPIE T:kcp/optimized1600XOPufull
gcc -march=native -mtune=native -O -fomit-frame-pointer -fwrapv -fPIC -fPIE T:kcp/optimized1600XOPufull
gcc -march=native -mtune=native -Os -fomit-frame-pointer -fwrapv -fPIC -fPIE T:kcp/optimized1600XOPufull