Implementation notes: amd64, rumba5, crypto_hash/echosp512

Computer: rumba5
Microarchitecture: amd64; Zen (800f11)
Architecture: amd64
CPU ID: AuthenticAMD-00800f11-178bfbff
SUPERCOP version: 20240625
Operation: crypto_hash
Primitive: echosp512
TimeObject sizeTest sizeImplementationCompilerBenchmark dateSUPERCOP version
5891320458 0 132477 804 992T:generic/opt64gcc_-march=native_-mtune=native_-O2_-fwrapv_-fPIC_-fPIE_-gdwarf-4_-Wall2024062620240625
5900221969 0 133157 836 960T:generic/opt64clang_-march=native_-Os_-fwrapv_-Qunused-arguments_-fPIC_-fPIE_-gdwarf-4_-Wall2024062620240625
5925722946 0 136245 804 992T:generic/opt64gcc_-march=native_-mtune=native_-O3_-fwrapv_-fPIC_-fPIE_-gdwarf-4_-Wall2024062620240625
5948920184 0 131661 804 992T:generic/opt64gcc_-march=native_-mtune=native_-O_-fwrapv_-fPIC_-fPIE_-gdwarf-4_-Wall2024062620240625
6126620233 0 130600 780 960T:generic/opt64gcc_-march=native_-mtune=native_-Os_-fwrapv_-fPIC_-fPIE_-gdwarf-4_-Wall2024062620240625
6438524636 0 1638267 844 928T:powerpc/pp32cv2clang_-march=native_-O2_-fwrapv_-Qunused-arguments_-fPIC_-fPIE_-gdwarf-4_-Wall2024062620240625
6439524661 0 1638675 844 928T:powerpc/pp32cv2clang_-march=native_-O3_-fwrapv_-Qunused-arguments_-fPIC_-fPIE_-gdwarf-4_-Wall2024062620240625
7027323883 0 1634973 836 992T:powerpc/pp32cv2clang_-march=native_-Os_-fwrapv_-Qunused-arguments_-fPIC_-fPIE_-gdwarf-4_-Wall2024062620240625
7152827552 0 140491 844 896T:generic/opt64clang_-mcpu=native_-O3_-fwrapv_-Qunused-arguments_-fPIC_-fPIE_-gdwarf-4_-Wall2024062620240625
7303827567 0 1640507 844 928T:powerpc/pp32cv2clang_-mcpu=native_-O3_-fwrapv_-Qunused-arguments_-fPIC_-fPIE_-gdwarf-4_-Wall2024062620240625
7592223384 0 134003 844 896T:generic/opt64clang_-march=native_-O_-fwrapv_-Qunused-arguments_-fPIC_-fPIE_-gdwarf-4_-Wall2024062620240625
7959323057 0 136643 844 928T:generic/opt64clang_-march=native_-O2_-fwrapv_-Qunused-arguments_-fPIC_-fPIE_-gdwarf-4_-Wall2024062620240625
7960523048 0 136971 844 928T:generic/opt64clang_-march=native_-O3_-fwrapv_-Qunused-arguments_-fPIC_-fPIE_-gdwarf-4_-Wall2024062620240625
9542325662 0 1636119 788 960T:powerpc/pp32cv2gcc_-march=native_-mtune=native_-Os_-fwrapv_-fPIC_-fPIE_-gdwarf-4_-Wall2024062620240625
9549525079 0 1635707 844 928T:powerpc/pp32cv2clang_-march=native_-O_-fwrapv_-Qunused-arguments_-fPIC_-fPIE_-gdwarf-4_-Wall2024062620240625
9905332506 0 1645900 812 992T:powerpc/pp32cv2gcc_-march=native_-mtune=native_-O3_-fwrapv_-fPIC_-fPIE_-gdwarf-4_-Wall2024062620240625
10265029466 0 1641596 812 992T:powerpc/pp32cv2gcc_-march=native_-mtune=native_-O2_-fwrapv_-fPIC_-fPIE_-gdwarf-4_-Wall2024062620240625
10320327495 0 1639068 812 992T:powerpc/pp32cv2gcc_-march=native_-mtune=native_-O_-fwrapv_-fPIC_-fPIE_-gdwarf-4_-Wall2024062620240625
10739221082 0 1634476 812 992T:powerpc/pp32cv1gcc_-march=native_-mtune=native_-O3_-fwrapv_-fPIC_-fPIE_-gdwarf-4_-Wall2024062620240625
11295318298 0 1630428 812 992T:powerpc/pp32cv1gcc_-march=native_-mtune=native_-O2_-fwrapv_-fPIC_-fPIE_-gdwarf-4_-Wall2024062620240625
11589121183 0 1634123 844 928T:powerpc/pp32cv1clang_-mcpu=native_-O3_-fwrapv_-Qunused-arguments_-fPIC_-fPIE_-gdwarf-4_-Wall2024062620240625
12227617788 0 1629356 812 992T:powerpc/pp32cv1gcc_-march=native_-mtune=native_-O_-fwrapv_-fPIC_-fPIE_-gdwarf-4_-Wall2024062620240625
12302020341 0 1631429 836 992T:powerpc/pp32cv1clang_-march=native_-Os_-fwrapv_-Qunused-arguments_-fPIC_-fPIE_-gdwarf-4_-Wall2024062620240625
12335120701 0 1634723 844 928T:powerpc/pp32cv1clang_-march=native_-O3_-fwrapv_-Qunused-arguments_-fPIC_-fPIE_-gdwarf-4_-Wall2024062620240625
12349416971 0 1627431 788 960T:powerpc/pp32cv1gcc_-march=native_-mtune=native_-Os_-fwrapv_-fPIC_-fPIE_-gdwarf-4_-Wall2024062620240625
12384920676 0 1634315 844 928T:powerpc/pp32cv1clang_-march=native_-O2_-fwrapv_-Qunused-arguments_-fPIC_-fPIE_-gdwarf-4_-Wall2024062620240625
13309418439 0 1629067 844 928T:powerpc/pp32cv1clang_-march=native_-O_-fwrapv_-Qunused-arguments_-fPIC_-fPIE_-gdwarf-4_-Wall2024062620240625

Compiler output


echo64.S: echo64.S:1040:2: error: '.att_syntax noprefix' is not supported: registers must have a '%' prefix in .att_syntax
echo64.S:  .att_syntax noprefix
echo64.S:  ^
echo64.S: echo64.S:1053:10: error: unknown token in expression
echo64.S:  movabsq $-9187201950435737472, %rax
echo64.S:          ^
echo64.S: echo64.S:1054:10: error: unknown token in expression
echo64.S:  movabsq $-9187201950435737472, %r11
echo64.S:          ^
echo64.S: echo64.S:1055:10: error: unknown token in expression
echo64.S:  movabsq $7599940337074203, %r10
echo64.S:          ^
echo64.S: echo64.S:1056:7: error: unknown token in expression
echo64.S:  movq %rax, MEM_CST+16(%rip)
echo64.S:       ^
echo64.S: echo64.S:1057:10: error: unknown token in expression
echo64.S:  movabsq $7599940337074203, %r9
echo64.S:          ^
echo64.S: echo64.S:1058:10: error: unknown token in expression
echo64.S:  movabsq $-72340172838076674, %rax
echo64.S:          ^
echo64.S: echo64.S:1059:10: error: unknown token in expression
echo64.S:  movabsq $72340172838076673, %r8
echo64.S:          ^
echo64.S: echo64.S:1060:10: error: unknown token in expression
echo64.S: ...

Number of similar (implementation,compiler) pairs: 5, namely:
ImplementationCompiler
T:aes/aes64clang -march=native -O2 -fwrapv -Qunused-arguments -fPIC -fPIE -gdwarf-4 -Wall (Ubuntu_Clang_14.0.0)
T:aes/aes64clang -march=native -O3 -fwrapv -Qunused-arguments -fPIC -fPIE -gdwarf-4 -Wall (Ubuntu_Clang_14.0.0)
T:aes/aes64clang -march=native -O -fwrapv -Qunused-arguments -fPIC -fPIE -gdwarf-4 -Wall (Ubuntu_Clang_14.0.0)
T:aes/aes64clang -march=native -Os -fwrapv -Qunused-arguments -fPIC -fPIE -gdwarf-4 -Wall (Ubuntu_Clang_14.0.0)
T:aes/aes64clang -mcpu=native -O3 -fwrapv -Qunused-arguments -fPIC -fPIE -gdwarf-4 -Wall (Ubuntu_Clang_14.0.0)

Compiler output


try.c: /usr/bin/ld: libcrypto_hash_echosp512.a(echo64.o): relocation R_X86_64_32S against symbol `OLDCV' can not be used when making a PIE object; recompile with -fPIE
try.c: /usr/bin/ld: failed to set dynamic section sizes: bad value
try.c: collect2: error: ld returned 1 exit status

Number of similar (implementation,compiler) pairs: 4, namely:
ImplementationCompiler
T:aes/aes64gcc -march=native -mtune=native -O2 -fwrapv -fPIC -fPIE -gdwarf-4 -Wall (11.4.0)
T:aes/aes64gcc -march=native -mtune=native -O3 -fwrapv -fPIC -fPIE -gdwarf-4 -Wall (11.4.0)
T:aes/aes64gcc -march=native -mtune=native -O -fwrapv -fPIC -fPIE -gdwarf-4 -Wall (11.4.0)
T:aes/aes64gcc -march=native -mtune=native -Os -fwrapv -fPIC -fPIE -gdwarf-4 -Wall (11.4.0)

Compiler output


echo64.S: echo64.S:224:2: error: invalid instruction mnemonic 'movzbl'
echo64.S:  movzbl ebp, ah
echo64.S:  ^~~~~~
echo64.S: echo64.S:227:2: error: invalid instruction mnemonic 'movzbl'
echo64.S:  movzbl esi, al
echo64.S:  ^~~~~~
echo64.S: echo64.S:239:2: error: invalid instruction mnemonic 'movzbl'
echo64.S:  movzbl ebp, bl
echo64.S:  ^~~~~~
echo64.S: echo64.S:242:2: error: invalid instruction mnemonic 'movzbl'
echo64.S:  movzbl esi, bh
echo64.S:  ^~~~~~
echo64.S: echo64.S:254:2: error: invalid instruction mnemonic 'movzbl'
echo64.S:  movzbl ebp, al
echo64.S:  ^~~~~~
echo64.S: echo64.S:257:2: error: invalid instruction mnemonic 'movzbl'
echo64.S:  movzbl esi, ah
echo64.S:  ^~~~~~
echo64.S: echo64.S:269:2: error: invalid instruction mnemonic 'movzbl'
echo64.S:  movzbl ebp, bh
echo64.S:  ^~~~~~
echo64.S: echo64.S:272:2: error: invalid instruction mnemonic 'movzbl'
echo64.S:  movzbl esi, bl
echo64.S:  ^~~~~~
echo64.S: echo64.S:284:2: error: invalid instruction mnemonic 'movzbl'
echo64.S: ...

Number of similar (implementation,compiler) pairs: 5, namely:
ImplementationCompiler
T:athlon/athlon64clang -march=native -O2 -fwrapv -Qunused-arguments -fPIC -fPIE -gdwarf-4 -Wall (Ubuntu_Clang_14.0.0)
T:athlon/athlon64clang -march=native -O3 -fwrapv -Qunused-arguments -fPIC -fPIE -gdwarf-4 -Wall (Ubuntu_Clang_14.0.0)
T:athlon/athlon64clang -march=native -O -fwrapv -Qunused-arguments -fPIC -fPIE -gdwarf-4 -Wall (Ubuntu_Clang_14.0.0)
T:athlon/athlon64clang -march=native -Os -fwrapv -Qunused-arguments -fPIC -fPIE -gdwarf-4 -Wall (Ubuntu_Clang_14.0.0)
T:athlon/athlon64clang -mcpu=native -O3 -fwrapv -Qunused-arguments -fPIC -fPIE -gdwarf-4 -Wall (Ubuntu_Clang_14.0.0)

Compiler output


echo64.S: echo64.c: Assembler messages:
echo64.S: echo64.c:729: Error: no such instruction: `movzbl ebp,ah'
echo64.S: echo64.c:729: Error: no such instruction: `movzbl esi,al'
echo64.S: echo64.c:729: Error: no such instruction: `movzbl ebp,bl'
echo64.S: echo64.c:729: Error: no such instruction: `movzbl esi,bh'
echo64.S: echo64.c:729: Error: no such instruction: `movzbl ebp,al'
echo64.S: echo64.c:729: Error: no such instruction: `movzbl esi,ah'
echo64.S: echo64.c:729: Error: no such instruction: `movzbl ebp,bh'
echo64.S: echo64.c:729: Error: no such instruction: `movzbl esi,bl'
echo64.S: echo64.c:729: Error: no such instruction: `movzbl ebp,ah'
echo64.S: echo64.c:729: Error: no such instruction: `movzbl esi,al'
echo64.S: echo64.c:729: Error: no such instruction: `movzbl ebp,bl'
echo64.S: echo64.c:729: Error: no such instruction: `movzbl esi,bh'
echo64.S: echo64.c:729: Error: no such instruction: `movzbl ebp,al'
echo64.S: echo64.c:729: Error: no such instruction: `movzbl esi,ah'
echo64.S: echo64.c:729: Error: no such instruction: `movzbl ebp,bl'
echo64.S: echo64.c:729: Error: no such instruction: `movzbl esi,bh'
echo64.S: echo64.c:729: Error: no such instruction: `movzbl ebp,dl'
echo64.S: echo64.c:729: Error: no such instruction: `movzbl esi,dh'
echo64.S: echo64.c:729: Error: no such instruction: `movzbl ebp,ch'
echo64.S: echo64.c:729: Error: no such instruction: `movzbl esi,cl'
echo64.S: echo64.c:729: Error: no such instruction: `movzbl ebp,cl'
echo64.S: echo64.c:729: Error: no such instruction: `movzbl esi,ch'
echo64.S: echo64.c:729: Error: no such instruction: `movzbl ebp,dh'
echo64.S: echo64.c:729: Error: no such instruction: `movzbl esi,dl'
echo64.S: ...

Number of similar (implementation,compiler) pairs: 4, namely:
ImplementationCompiler
T:athlon/athlon64gcc -march=native -mtune=native -O2 -fwrapv -fPIC -fPIE -gdwarf-4 -Wall (11.4.0)
T:athlon/athlon64gcc -march=native -mtune=native -O3 -fwrapv -fPIC -fPIE -gdwarf-4 -Wall (11.4.0)
T:athlon/athlon64gcc -march=native -mtune=native -O -fwrapv -fPIC -fPIE -gdwarf-4 -Wall (11.4.0)
T:athlon/athlon64gcc -march=native -mtune=native -Os -fwrapv -fPIC -fPIE -gdwarf-4 -Wall (11.4.0)

Compiler output


echo64.S: echo64.S:212:2: error: invalid instruction mnemonic 'movzbl'
echo64.S:  movzbl ebp, ah
echo64.S:  ^~~~~~
echo64.S: echo64.S:218:2: error: invalid instruction mnemonic 'movzbl'
echo64.S:  movzbl esi, al
echo64.S:  ^~~~~~
echo64.S: echo64.S:227:2: error: invalid instruction mnemonic 'movzbl'
echo64.S:  movzbl ebp, bl
echo64.S:  ^~~~~~
echo64.S: echo64.S:233:2: error: invalid instruction mnemonic 'movzbl'
echo64.S:  movzbl esi, bh
echo64.S:  ^~~~~~
echo64.S: echo64.S:242:2: error: invalid instruction mnemonic 'movzbl'
echo64.S:  movzbl ebp, al
echo64.S:  ^~~~~~
echo64.S: echo64.S:248:2: error: invalid instruction mnemonic 'movzbl'
echo64.S:  movzbl esi, ah
echo64.S:  ^~~~~~
echo64.S: echo64.S:257:2: error: invalid instruction mnemonic 'movzbl'
echo64.S:  movzbl ebp, bh
echo64.S:  ^~~~~~
echo64.S: echo64.S:263:2: error: invalid instruction mnemonic 'movzbl'
echo64.S:  movzbl esi, bl
echo64.S:  ^~~~~~
echo64.S: echo64.S:272:2: error: invalid instruction mnemonic 'movzbl'
echo64.S: ...

Number of similar (implementation,compiler) pairs: 5, namely:
ImplementationCompiler
T:core2/core2v64clang -march=native -O2 -fwrapv -Qunused-arguments -fPIC -fPIE -gdwarf-4 -Wall (Ubuntu_Clang_14.0.0)
T:core2/core2v64clang -march=native -O3 -fwrapv -Qunused-arguments -fPIC -fPIE -gdwarf-4 -Wall (Ubuntu_Clang_14.0.0)
T:core2/core2v64clang -march=native -O -fwrapv -Qunused-arguments -fPIC -fPIE -gdwarf-4 -Wall (Ubuntu_Clang_14.0.0)
T:core2/core2v64clang -march=native -Os -fwrapv -Qunused-arguments -fPIC -fPIE -gdwarf-4 -Wall (Ubuntu_Clang_14.0.0)
T:core2/core2v64clang -mcpu=native -O3 -fwrapv -Qunused-arguments -fPIC -fPIE -gdwarf-4 -Wall (Ubuntu_Clang_14.0.0)

Compiler output


echo64.S: echo64.c: Assembler messages:
echo64.S: echo64.c:635: Error: no such instruction: `movzbl ebp,ah'
echo64.S: echo64.c:635: Error: no such instruction: `movzbl esi,al'
echo64.S: echo64.c:635: Error: no such instruction: `movzbl ebp,bl'
echo64.S: echo64.c:635: Error: no such instruction: `movzbl esi,bh'
echo64.S: echo64.c:635: Error: no such instruction: `movzbl ebp,al'
echo64.S: echo64.c:635: Error: no such instruction: `movzbl esi,ah'
echo64.S: echo64.c:635: Error: no such instruction: `movzbl ebp,bh'
echo64.S: echo64.c:635: Error: no such instruction: `movzbl esi,bl'
echo64.S: echo64.c:635: Error: no such instruction: `movzbl ebp,ah'
echo64.S: echo64.c:635: Error: no such instruction: `movzbl esi,al'
echo64.S: echo64.c:635: Error: no such instruction: `movzbl ebp,bl'
echo64.S: echo64.c:635: Error: no such instruction: `movzbl esi,bh'
echo64.S: echo64.c:635: Error: no such instruction: `movzbl ebp,al'
echo64.S: echo64.c:635: Error: no such instruction: `movzbl esi,ah'
echo64.S: echo64.c:635: Error: no such instruction: `movzbl ebp,bl'
echo64.S: echo64.c:635: Error: no such instruction: `movzbl esi,bh'
echo64.S: echo64.c:635: Error: no such instruction: `movzbl ebp,dl'
echo64.S: echo64.c:635: Error: no such instruction: `movzbl esi,dh'
echo64.S: echo64.c:635: Error: no such instruction: `movzbl ebp,ch'
echo64.S: echo64.c:635: Error: no such instruction: `movzbl esi,cl'
echo64.S: echo64.c:635: Error: no such instruction: `movzbl ebp,cl'
echo64.S: echo64.c:635: Error: no such instruction: `movzbl esi,ch'
echo64.S: echo64.c:635: Error: no such instruction: `movzbl ebp,dh'
echo64.S: echo64.c:635: Error: no such instruction: `movzbl esi,dl'
echo64.S: ...

Number of similar (implementation,compiler) pairs: 4, namely:
ImplementationCompiler
T:core2/core2v64gcc -march=native -mtune=native -O2 -fwrapv -fPIC -fPIE -gdwarf-4 -Wall (11.4.0)
T:core2/core2v64gcc -march=native -mtune=native -O3 -fwrapv -fPIC -fPIE -gdwarf-4 -Wall (11.4.0)
T:core2/core2v64gcc -march=native -mtune=native -O -fwrapv -fPIC -fPIE -gdwarf-4 -Wall (11.4.0)
T:core2/core2v64gcc -march=native -mtune=native -Os -fwrapv -fPIC -fPIE -gdwarf-4 -Wall (11.4.0)

Compiler output


echo32.c: echo32.c:37:4: warning: implicitly declaring library function 'printf' with type 'int (const char *, ...)' [-Wimplicit-function-declaration]
echo32.c:                         printf ("row %d,col %d :",i,j);
echo32.c:                         ^
echo32.c: echo32.c:37:4: note: include the header <stdio.h> or explicitly provide a declaration for 'printf'
echo32.c: echo32.c:125:18: warning: unused variable 'j' [-Wunused-variable]
echo32.c:         unsigned int i, j;
echo32.c:                         ^
echo32.c: echo32.c:126:16: warning: unused variable 'endianess' [-Wunused-variable]
echo32.c:         unsigned char endianess;
echo32.c:                       ^
echo32.c: echo32.c:397:15: warning: unused variable 'i' [-Wunused-variable]
echo32.c:         unsigned int i;
echo32.c:                      ^
echo32.c: echo32.c:398:21: warning: unused variable 'c0' [-Wunused-variable]
echo32.c:         unsigned long long c0, c1;
echo32.c:                            ^
echo32.c: echo32.c:398:25: warning: unused variable 'c1' [-Wunused-variable]
echo32.c:         unsigned long long c0, c1;
echo32.c:                                ^
echo32.c: echo32.c:496:21: warning: unused variable 'hashlen' [-Wunused-variable]
echo32.c:         unsigned short int hashlen = 0;
echo32.c:                            ^
echo32.c: echo32.c:497:21: warning: unused variable 'messlen_l' [-Wunused-variable]
echo32.c:         unsigned long long messlen_l = 0;
echo32.c:                            ^
echo32.c: ...

Number of similar (implementation,compiler) pairs: 5, namely:
ImplementationCompiler
T:generic/opt32clang -march=native -O2 -fwrapv -Qunused-arguments -fPIC -fPIE -gdwarf-4 -Wall (Ubuntu_Clang_14.0.0)
T:generic/opt32clang -march=native -O3 -fwrapv -Qunused-arguments -fPIC -fPIE -gdwarf-4 -Wall (Ubuntu_Clang_14.0.0)
T:generic/opt32clang -march=native -O -fwrapv -Qunused-arguments -fPIC -fPIE -gdwarf-4 -Wall (Ubuntu_Clang_14.0.0)
T:generic/opt32clang -march=native -Os -fwrapv -Qunused-arguments -fPIC -fPIE -gdwarf-4 -Wall (Ubuntu_Clang_14.0.0)
T:generic/opt32clang -mcpu=native -O3 -fwrapv -Qunused-arguments -fPIC -fPIE -gdwarf-4 -Wall (Ubuntu_Clang_14.0.0)

Compiler output


echo32.c: echo32.c: In function 'PrintState':
echo32.c: echo32.c:37:25: warning: implicit declaration of function 'printf' [-Wimplicit-function-declaration]
echo32.c:    37 |                         printf ("row %d,col %d :",i,j);
echo32.c:       |                         ^~~~~~
echo32.c: echo32.c:12:1: note: include '<stdio.h>' or provide a declaration of 'printf'
echo32.c:    11 | #include "api.h"
echo32.c:   +++ |+#include <stdio.h>
echo32.c:    12 |
echo32.c: echo32.c:37:25: warning: incompatible implicit declaration of built-in function 'printf' [-Wbuiltin-declaration-mismatch]
echo32.c:    37 |                         printf ("row %d,col %d :",i,j);
echo32.c:       |                         ^~~~~~
echo32.c: echo32.c:37:25: note: include '<stdio.h>' or provide a declaration of 'printf'
echo32.c: echo32.c:47:9: warning: incompatible implicit declaration of built-in function 'printf' [-Wbuiltin-declaration-mismatch]
echo32.c:    47 |         printf("-----------------------------------\n");
echo32.c:       |         ^~~~~~
echo32.c: echo32.c:47:9: note: include '<stdio.h>' or provide a declaration of 'printf'
echo32.c: echo32.c: In function 'Init':
echo32.c: echo32.c:126:23: warning: unused variable 'endianess' [-Wunused-variable]
echo32.c:   126 |         unsigned char endianess;
echo32.c:       |                       ^~~~~~~~~
echo32.c: echo32.c:125:25: warning: unused variable 'j' [-Wunused-variable]
echo32.c:   125 |         unsigned int i, j;
echo32.c:       |                         ^
echo32.c: echo32.c: In function 'Compress':
echo32.c: echo32.c:398:32: warning: unused variable 'c1' [-Wunused-variable]
echo32.c: ...

Number of similar (implementation,compiler) pairs: 4, namely:
ImplementationCompiler
T:generic/opt32gcc -march=native -mtune=native -O2 -fwrapv -fPIC -fPIE -gdwarf-4 -Wall (11.4.0)
T:generic/opt32gcc -march=native -mtune=native -O3 -fwrapv -fPIC -fPIE -gdwarf-4 -Wall (11.4.0)
T:generic/opt32gcc -march=native -mtune=native -O -fwrapv -fPIC -fPIE -gdwarf-4 -Wall (11.4.0)
T:generic/opt32gcc -march=native -mtune=native -Os -fwrapv -fPIC -fPIE -gdwarf-4 -Wall (11.4.0)

Compiler output


echo64.c: echo64.c:318:30: warning: unused variable 'WT5' [-Wunused-variable]
echo64.c:     WT0, WT1, WT2, WT3, WT4, WT5;
echo64.c:                              ^
echo64.c: echo64.c:486:16: warning: unused variable 'i' [-Wunused-variable]
echo64.c:   unsigned int i;
echo64.c:                ^
echo64.c: echo64.c:555:29: warning: passing 'const unsigned char *' to parameter of type 'BitSequence *' (aka 'unsigned char *') discards qualifiers [-Wincompatible-pointer-types-discards-qualifiers]
echo64.c:   if (Hash(CRYPTO_BYTES * 8,in,inlen * 8,out) == SUCCESS) return 0;
echo64.c:                             ^~
echo64.c: echo64.c:542:46: note: passing argument to parameter 'data' here
echo64.c: HashReturn Hash(int hashbitlen, BitSequence *data, DataLength databitlen, BitSequence *hashval)
echo64.c:                                              ^
echo64.c: 3 warnings generated.

Number of similar (implementation,compiler) pairs: 5, namely:
ImplementationCompiler
T:generic/opt64clang -march=native -O2 -fwrapv -Qunused-arguments -fPIC -fPIE -gdwarf-4 -Wall (Ubuntu_Clang_14.0.0)
T:generic/opt64clang -march=native -O3 -fwrapv -Qunused-arguments -fPIC -fPIE -gdwarf-4 -Wall (Ubuntu_Clang_14.0.0)
T:generic/opt64clang -march=native -O -fwrapv -Qunused-arguments -fPIC -fPIE -gdwarf-4 -Wall (Ubuntu_Clang_14.0.0)
T:generic/opt64clang -march=native -Os -fwrapv -Qunused-arguments -fPIC -fPIE -gdwarf-4 -Wall (Ubuntu_Clang_14.0.0)
T:generic/opt64clang -mcpu=native -O3 -fwrapv -Qunused-arguments -fPIC -fPIE -gdwarf-4 -Wall (Ubuntu_Clang_14.0.0)

Compiler output


echo64.c: echo64.c: In function 'Compress':
echo64.c: echo64.c:318:30: warning: unused variable 'WT5' [-Wunused-variable]
echo64.c:   318 |     WT0, WT1, WT2, WT3, WT4, WT5;
echo64.c:       |                              ^~~
echo64.c: echo64.c: In function 'Final':
echo64.c: echo64.c:486:16: warning: unused variable 'i' [-Wunused-variable]
echo64.c:   486 |   unsigned int i;
echo64.c:       |                ^
echo64.c: echo64.c: In function 'crypto_hash_echosp512_generic_opt64_timingleaks':
echo64.c: echo64.c:555:29: warning: passing argument 2 of 'Hash' discards 'const' qualifier from pointer target type [-Wdiscarded-qualifiers]
echo64.c:   555 |   if (Hash(CRYPTO_BYTES * 8,in,inlen * 8,out) == SUCCESS) return 0;
echo64.c:       |                             ^~
echo64.c: echo64.c:542:46: note: expected 'BitSequence *' {aka 'unsigned char *'} but argument is of type 'const unsigned char *'
echo64.c:   542 | HashReturn Hash(int hashbitlen, BitSequence *data, DataLength databitlen, BitSequence *hashval)
echo64.c:       |                                 ~~~~~~~~~~~~~^~~~

Number of similar (implementation,compiler) pairs: 4, namely:
ImplementationCompiler
T:generic/opt64gcc -march=native -mtune=native -O2 -fwrapv -fPIC -fPIE -gdwarf-4 -Wall (11.4.0)
T:generic/opt64gcc -march=native -mtune=native -O3 -fwrapv -fPIC -fPIE -gdwarf-4 -Wall (11.4.0)
T:generic/opt64gcc -march=native -mtune=native -O -fwrapv -fPIC -fPIE -gdwarf-4 -Wall (11.4.0)
T:generic/opt64gcc -march=native -mtune=native -Os -fwrapv -fPIC -fPIE -gdwarf-4 -Wall (11.4.0)

Compiler output


echo32.S: echo32.S:311:2: error: invalid instruction mnemonic 'addd'
echo32.S:  addd [SHA3_CNT], 1
echo32.S:  ^~~~
echo32.S: echo32.S:575:2: error: invalid instruction mnemonic 'addd'
echo32.S:  addd [SHA3_CNT], 1
echo32.S:  ^~~~
echo32.S: echo32.S:839:2: error: invalid instruction mnemonic 'addd'
echo32.S:  addd [SHA3_CNT], 1
echo32.S:  ^~~~
echo32.S: echo32.S:1103:2: error: invalid instruction mnemonic 'addd'
echo32.S:  addd [SHA3_CNT], 1
echo32.S:  ^~~~
echo32.S: echo32.S:1367:2: error: invalid instruction mnemonic 'addd'
echo32.S:  addd [SHA3_CNT], 1
echo32.S:  ^~~~
echo32.S: echo32.S:1631:2: error: invalid instruction mnemonic 'addd'
echo32.S:  addd [SHA3_CNT], 1
echo32.S:  ^~~~
echo32.S: echo32.S:1895:2: error: invalid instruction mnemonic 'addd'
echo32.S:  addd [SHA3_CNT], 1
echo32.S:  ^~~~
echo32.S: echo32.S:2159:2: error: invalid instruction mnemonic 'addd'
echo32.S:  addd [SHA3_CNT], 1
echo32.S:  ^~~~
echo32.S: echo32.S:2423:2: error: invalid instruction mnemonic 'addd'
echo32.S: ...

Number of similar (implementation,compiler) pairs: 5, namely:
ImplementationCompiler
T:pentium/pentium4v64v1clang -march=native -O2 -fwrapv -Qunused-arguments -fPIC -fPIE -gdwarf-4 -Wall (Ubuntu_Clang_14.0.0)
T:pentium/pentium4v64v1clang -march=native -O3 -fwrapv -Qunused-arguments -fPIC -fPIE -gdwarf-4 -Wall (Ubuntu_Clang_14.0.0)
T:pentium/pentium4v64v1clang -march=native -O -fwrapv -Qunused-arguments -fPIC -fPIE -gdwarf-4 -Wall (Ubuntu_Clang_14.0.0)
T:pentium/pentium4v64v1clang -march=native -Os -fwrapv -Qunused-arguments -fPIC -fPIE -gdwarf-4 -Wall (Ubuntu_Clang_14.0.0)
T:pentium/pentium4v64v1clang -mcpu=native -O3 -fwrapv -Qunused-arguments -fPIC -fPIE -gdwarf-4 -Wall (Ubuntu_Clang_14.0.0)

Compiler output


try.c: /usr/bin/ld: libcrypto_hash_echosp512.a(echo32.o): relocation R_X86_64_32S against symbol `SHA3_R' can not be used when making a PIE object; recompile with -fPIE
try.c: /usr/bin/ld: failed to set dynamic section sizes: bad value
try.c: collect2: error: ld returned 1 exit status

Number of similar (implementation,compiler) pairs: 4, namely:
ImplementationCompiler
T:pentium/pentium4v64v1gcc -march=native -mtune=native -O2 -fwrapv -fPIC -fPIE -gdwarf-4 -Wall (11.4.0)
T:pentium/pentium4v64v1gcc -march=native -mtune=native -O3 -fwrapv -fPIC -fPIE -gdwarf-4 -Wall (11.4.0)
T:pentium/pentium4v64v1gcc -march=native -mtune=native -O -fwrapv -fPIC -fPIE -gdwarf-4 -Wall (11.4.0)
T:pentium/pentium4v64v1gcc -march=native -mtune=native -Os -fwrapv -fPIC -fPIE -gdwarf-4 -Wall (11.4.0)

Compiler output


echo64.S: echo64.S:383:2: error: invalid instruction mnemonic 'addd'
echo64.S:  addd [SHA3_CNT], 1
echo64.S:  ^~~~
echo64.S: echo64.S:647:2: error: invalid instruction mnemonic 'addd'
echo64.S:  addd [SHA3_CNT], 1
echo64.S:  ^~~~
echo64.S: echo64.S:911:2: error: invalid instruction mnemonic 'addd'
echo64.S:  addd [SHA3_CNT], 1
echo64.S:  ^~~~
echo64.S: echo64.S:1175:2: error: invalid instruction mnemonic 'addd'
echo64.S:  addd [SHA3_CNT], 1
echo64.S:  ^~~~
echo64.S: echo64.S:1439:2: error: invalid instruction mnemonic 'addd'
echo64.S:  addd [SHA3_CNT], 1
echo64.S:  ^~~~
echo64.S: echo64.S:1703:2: error: invalid instruction mnemonic 'addd'
echo64.S:  addd [SHA3_CNT], 1
echo64.S:  ^~~~
echo64.S: echo64.S:1967:2: error: invalid instruction mnemonic 'addd'
echo64.S:  addd [SHA3_CNT], 1
echo64.S:  ^~~~
echo64.S: echo64.S:2231:2: error: invalid instruction mnemonic 'addd'
echo64.S:  addd [SHA3_CNT], 1
echo64.S:  ^~~~
echo64.S: echo64.S:2495:2: error: invalid instruction mnemonic 'addd'
echo64.S: ...

Number of similar (implementation,compiler) pairs: 5, namely:
ImplementationCompiler
T:pentium/pentium4v64v2clang -march=native -O2 -fwrapv -Qunused-arguments -fPIC -fPIE -gdwarf-4 -Wall (Ubuntu_Clang_14.0.0)
T:pentium/pentium4v64v2clang -march=native -O3 -fwrapv -Qunused-arguments -fPIC -fPIE -gdwarf-4 -Wall (Ubuntu_Clang_14.0.0)
T:pentium/pentium4v64v2clang -march=native -O -fwrapv -Qunused-arguments -fPIC -fPIE -gdwarf-4 -Wall (Ubuntu_Clang_14.0.0)
T:pentium/pentium4v64v2clang -march=native -Os -fwrapv -Qunused-arguments -fPIC -fPIE -gdwarf-4 -Wall (Ubuntu_Clang_14.0.0)
T:pentium/pentium4v64v2clang -mcpu=native -O3 -fwrapv -Qunused-arguments -fPIC -fPIE -gdwarf-4 -Wall (Ubuntu_Clang_14.0.0)

Compiler output


try.c: /usr/bin/ld: libcrypto_hash_echosp512.a(echo64.o): relocation R_X86_64_32S against symbol `SHA3_R' can not be used when making a PIE object; recompile with -fPIE
try.c: /usr/bin/ld: failed to set dynamic section sizes: bad value
try.c: collect2: error: ld returned 1 exit status

Number of similar (implementation,compiler) pairs: 4, namely:
ImplementationCompiler
T:pentium/pentium4v64v2gcc -march=native -mtune=native -O2 -fwrapv -fPIC -fPIE -gdwarf-4 -Wall (11.4.0)
T:pentium/pentium4v64v2gcc -march=native -mtune=native -O3 -fwrapv -fPIC -fPIE -gdwarf-4 -Wall (11.4.0)
T:pentium/pentium4v64v2gcc -march=native -mtune=native -O -fwrapv -fPIC -fPIE -gdwarf-4 -Wall (11.4.0)
T:pentium/pentium4v64v2gcc -march=native -mtune=native -Os -fwrapv -fPIC -fPIE -gdwarf-4 -Wall (11.4.0)

Compiler output


echo32.c: echo32.c:106:18: warning: unused variable 'j' [-Wunused-variable]
echo32.c:         unsigned int i, j;
echo32.c:                         ^
echo32.c: echo32.c:107:16: warning: unused variable 'endianess' [-Wunused-variable]
echo32.c:         unsigned char endianess;
echo32.c:                       ^
echo32.c: echo32.c:512:21: warning: unused variable 'c0' [-Wunused-variable]
echo32.c:         unsigned long long c0, c1;
echo32.c:                            ^
echo32.c: echo32.c:512:25: warning: unused variable 'c1' [-Wunused-variable]
echo32.c:         unsigned long long c0, c1;
echo32.c:                                ^
echo32.c: echo32.c:639:21: warning: unused variable 'hashlen' [-Wunused-variable]
echo32.c:         unsigned short int hashlen = 0;
echo32.c:                            ^
echo32.c: echo32.c:640:21: warning: unused variable 'messlen_l' [-Wunused-variable]
echo32.c:         unsigned long long messlen_l = 0;
echo32.c:                            ^
echo32.c: echo32.c:641:21: warning: unused variable 'messlen_h' [-Wunused-variable]
echo32.c:         unsigned long long messlen_h = 0;
echo32.c:                            ^
echo32.c: 7 warnings generated.

Number of similar (implementation,compiler) pairs: 5, namely:
ImplementationCompiler
T:powerpc/pp32cv1clang -march=native -O2 -fwrapv -Qunused-arguments -fPIC -fPIE -gdwarf-4 -Wall (Ubuntu_Clang_14.0.0)
T:powerpc/pp32cv1clang -march=native -O3 -fwrapv -Qunused-arguments -fPIC -fPIE -gdwarf-4 -Wall (Ubuntu_Clang_14.0.0)
T:powerpc/pp32cv1clang -march=native -O -fwrapv -Qunused-arguments -fPIC -fPIE -gdwarf-4 -Wall (Ubuntu_Clang_14.0.0)
T:powerpc/pp32cv1clang -march=native -Os -fwrapv -Qunused-arguments -fPIC -fPIE -gdwarf-4 -Wall (Ubuntu_Clang_14.0.0)
T:powerpc/pp32cv1clang -mcpu=native -O3 -fwrapv -Qunused-arguments -fPIC -fPIE -gdwarf-4 -Wall (Ubuntu_Clang_14.0.0)

Compiler output


echo32.c: echo32.c: In function 'Init':
echo32.c: echo32.c:107:23: warning: unused variable 'endianess' [-Wunused-variable]
echo32.c:   107 |         unsigned char endianess;
echo32.c:       |                       ^~~~~~~~~
echo32.c: echo32.c:106:25: warning: unused variable 'j' [-Wunused-variable]
echo32.c:   106 |         unsigned int i, j;
echo32.c:       |                         ^
echo32.c: echo32.c: In function 'Compress':
echo32.c: echo32.c:512:32: warning: unused variable 'c1' [-Wunused-variable]
echo32.c:   512 |         unsigned long long c0, c1;
echo32.c:       |                                ^~
echo32.c: echo32.c:512:28: warning: unused variable 'c0' [-Wunused-variable]
echo32.c:   512 |         unsigned long long c0, c1;
echo32.c:       |                            ^~
echo32.c: echo32.c: In function 'Final':
echo32.c: echo32.c:641:28: warning: unused variable 'messlen_h' [-Wunused-variable]
echo32.c:   641 |         unsigned long long messlen_h = 0;
echo32.c:       |                            ^~~~~~~~~
echo32.c: echo32.c:640:28: warning: unused variable 'messlen_l' [-Wunused-variable]
echo32.c:   640 |         unsigned long long messlen_l = 0;
echo32.c:       |                            ^~~~~~~~~
echo32.c: echo32.c:639:28: warning: unused variable 'hashlen' [-Wunused-variable]
echo32.c:   639 |         unsigned short int hashlen = 0;
echo32.c:       |                            ^~~~~~~

Number of similar (implementation,compiler) pairs: 4, namely:
ImplementationCompiler
T:powerpc/pp32cv1gcc -march=native -mtune=native -O2 -fwrapv -fPIC -fPIE -gdwarf-4 -Wall (11.4.0)
T:powerpc/pp32cv1gcc -march=native -mtune=native -O3 -fwrapv -fPIC -fPIE -gdwarf-4 -Wall (11.4.0)
T:powerpc/pp32cv1gcc -march=native -mtune=native -O -fwrapv -fPIC -fPIE -gdwarf-4 -Wall (11.4.0)
T:powerpc/pp32cv1gcc -march=native -mtune=native -Os -fwrapv -fPIC -fPIE -gdwarf-4 -Wall (11.4.0)

Compiler output


echo32.c: echo32.c:106:18: warning: unused variable 'j' [-Wunused-variable]
echo32.c:         unsigned int i, j;
echo32.c:                         ^
echo32.c: echo32.c:107:16: warning: unused variable 'endianess' [-Wunused-variable]
echo32.c:         unsigned char endianess;
echo32.c:                       ^
echo32.c: echo32.c:480:21: warning: unused variable 'c0' [-Wunused-variable]
echo32.c:         unsigned long long c0, c1;
echo32.c:                            ^
echo32.c: echo32.c:480:25: warning: unused variable 'c1' [-Wunused-variable]
echo32.c:         unsigned long long c0, c1;
echo32.c:                                ^
echo32.c: echo32.c:607:21: warning: unused variable 'hashlen' [-Wunused-variable]
echo32.c:         unsigned short int hashlen = 0;
echo32.c:                            ^
echo32.c: echo32.c:608:21: warning: unused variable 'messlen_l' [-Wunused-variable]
echo32.c:         unsigned long long messlen_l = 0;
echo32.c:                            ^
echo32.c: echo32.c:609:21: warning: unused variable 'messlen_h' [-Wunused-variable]
echo32.c:         unsigned long long messlen_h = 0;
echo32.c:                            ^
echo32.c: 7 warnings generated.

Number of similar (implementation,compiler) pairs: 5, namely:
ImplementationCompiler
T:powerpc/pp32cv2clang -march=native -O2 -fwrapv -Qunused-arguments -fPIC -fPIE -gdwarf-4 -Wall (Ubuntu_Clang_14.0.0)
T:powerpc/pp32cv2clang -march=native -O3 -fwrapv -Qunused-arguments -fPIC -fPIE -gdwarf-4 -Wall (Ubuntu_Clang_14.0.0)
T:powerpc/pp32cv2clang -march=native -O -fwrapv -Qunused-arguments -fPIC -fPIE -gdwarf-4 -Wall (Ubuntu_Clang_14.0.0)
T:powerpc/pp32cv2clang -march=native -Os -fwrapv -Qunused-arguments -fPIC -fPIE -gdwarf-4 -Wall (Ubuntu_Clang_14.0.0)
T:powerpc/pp32cv2clang -mcpu=native -O3 -fwrapv -Qunused-arguments -fPIC -fPIE -gdwarf-4 -Wall (Ubuntu_Clang_14.0.0)

Compiler output


echo32.c: echo32.c: In function 'Init':
echo32.c: echo32.c:107:23: warning: unused variable 'endianess' [-Wunused-variable]
echo32.c:   107 |         unsigned char endianess;
echo32.c:       |                       ^~~~~~~~~
echo32.c: echo32.c:106:25: warning: unused variable 'j' [-Wunused-variable]
echo32.c:   106 |         unsigned int i, j;
echo32.c:       |                         ^
echo32.c: echo32.c: In function 'Compress':
echo32.c: echo32.c:480:32: warning: unused variable 'c1' [-Wunused-variable]
echo32.c:   480 |         unsigned long long c0, c1;
echo32.c:       |                                ^~
echo32.c: echo32.c:480:28: warning: unused variable 'c0' [-Wunused-variable]
echo32.c:   480 |         unsigned long long c0, c1;
echo32.c:       |                            ^~
echo32.c: echo32.c: In function 'Final':
echo32.c: echo32.c:609:28: warning: unused variable 'messlen_h' [-Wunused-variable]
echo32.c:   609 |         unsigned long long messlen_h = 0;
echo32.c:       |                            ^~~~~~~~~
echo32.c: echo32.c:608:28: warning: unused variable 'messlen_l' [-Wunused-variable]
echo32.c:   608 |         unsigned long long messlen_l = 0;
echo32.c:       |                            ^~~~~~~~~
echo32.c: echo32.c:607:28: warning: unused variable 'hashlen' [-Wunused-variable]
echo32.c:   607 |         unsigned short int hashlen = 0;
echo32.c:       |                            ^~~~~~~

Number of similar (implementation,compiler) pairs: 4, namely:
ImplementationCompiler
T:powerpc/pp32cv2gcc -march=native -mtune=native -O2 -fwrapv -fPIC -fPIE -gdwarf-4 -Wall (11.4.0)
T:powerpc/pp32cv2gcc -march=native -mtune=native -O3 -fwrapv -fPIC -fPIE -gdwarf-4 -Wall (11.4.0)
T:powerpc/pp32cv2gcc -march=native -mtune=native -O -fwrapv -fPIC -fPIE -gdwarf-4 -Wall (11.4.0)
T:powerpc/pp32cv2gcc -march=native -mtune=native -Os -fwrapv -fPIC -fPIE -gdwarf-4 -Wall (11.4.0)