Implementation notes: amd64, rumba5, crypto_hash/echo512

Computer: rumba5
Architecture: amd64
CPU ID: AuthenticAMD-00800f11-178bfbff
SUPERCOP version: 20211108
Operation: crypto_hash
Primitive: echo512
TimeObject sizeTest sizeImplementationCompilerBenchmark dateSUPERCOP version
7761824299 0 037180 804 920T:ccalik/vpermclang_-march=native_-O_-fomit-frame-pointer_-fwrapv_-Qunused-arguments_-fPIC_-fPIE2021011420210114
7761924299 0 037180 804 920T:ccalik/vpermclang_-march=native_-O2_-fomit-frame-pointer_-fwrapv_-Qunused-arguments_-fPIC_-fPIE2021011420210114
7762924299 0 037180 804 920T:ccalik/aesniclang_-march=native_-O2_-fomit-frame-pointer_-fwrapv_-Qunused-arguments_-fPIC_-fPIE2021011420210114
7762924299 0 037180 804 920T:ccalik/aesniclang_-march=native_-O_-fomit-frame-pointer_-fwrapv_-Qunused-arguments_-fPIC_-fPIE2021011420210114
7877924987 0 037900 804 920T:ccalik/aesniclang_-march=native_-O3_-fomit-frame-pointer_-fwrapv_-Qunused-arguments_-fPIC_-fPIE2021011420210114
7882324987 0 037900 804 920T:ccalik/vpermclang_-march=native_-O3_-fomit-frame-pointer_-fwrapv_-Qunused-arguments_-fPIC_-fPIE2021011420210114
7900122275 0 032234 796 888T:ccalik/aesniclang_-march=native_-Os_-fomit-frame-pointer_-fwrapv_-Qunused-arguments_-fPIC_-fPIE2021011420210114
7909932371 0 046137 804 952T:sphlibgcc_-march=native_-mtune=native_-O3_-fomit-frame-pointer_-fwrapv_-fPIC_-fPIE2021011420210114
7944129160 0 040761 804 952T:sphlibgcc_-march=native_-mtune=native_-O2_-fomit-frame-pointer_-fwrapv_-fPIC_-fPIE2021011420210114
8120326692 0 040393 804 960T:generic/opt64gcc_-march=native_-mtune=native_-O3_-fomit-frame-pointer_-fwrapv_-fPIC_-fPIE2021011420210114
8133928860 0 040153 804 952T:sphlibgcc_-march=native_-mtune=native_-O_-fomit-frame-pointer_-fwrapv_-fPIC_-fPIE2021011420210114
8179121196 0 032713 804 960T:generic/opt64gcc_-march=native_-mtune=native_-O2_-fomit-frame-pointer_-fwrapv_-fPIC_-fPIE2021011420210114
8186417467 0 031241 804 952T:sphlib-smallgcc_-march=native_-mtune=native_-O3_-fomit-frame-pointer_-fwrapv_-fPIC_-fPIE2021011420210114
8196322275 0 032234 796 888T:ccalik/vpermclang_-march=native_-Os_-fomit-frame-pointer_-fwrapv_-Qunused-arguments_-fPIC_-fPIE2021011420210114
8250727496 0 037852 780 920T:sphlibgcc_-march=native_-mtune=native_-Os_-fomit-frame-pointer_-fwrapv_-fPIC_-fPIE2021011420210114
8365129440 0 042524 804 888T:sphlibclang_-mcpu=native_-O3_-fomit-frame-pointer_-fwrapv_-Qunused-arguments_-fPIC_-fPIE2021011420210114
8374420745 0 031937 804 960T:generic/opt64gcc_-march=native_-mtune=native_-O_-fomit-frame-pointer_-fwrapv_-fPIC_-fPIE2021011420210114
8463120642 0 030908 780 928T:generic/opt64gcc_-march=native_-mtune=native_-Os_-fomit-frame-pointer_-fwrapv_-fPIC_-fPIE2021011420210114
8493219530 0 029764 780 920T:ccalik/vpermgcc_-march=native_-mtune=native_-Os_-fomit-frame-pointer_-fwrapv_-fPIC_-fPIE2021011420210114
8495829997 0 042972 804 920T:sphlibclang_-march=native_-O3_-fomit-frame-pointer_-fwrapv_-Qunused-arguments_-fPIC_-fPIE2021011420210114
8499919530 0 029764 780 920T:ccalik/aesnigcc_-march=native_-mtune=native_-Os_-fomit-frame-pointer_-fwrapv_-fPIC_-fPIE2021011420210114
8579926353 0 040025 804 952T:ccalik/aesnigcc_-march=native_-mtune=native_-O3_-fomit-frame-pointer_-fwrapv_-fPIC_-fPIE2021011420210114
8579926353 0 040025 804 952T:ccalik/vpermgcc_-march=native_-mtune=native_-O3_-fomit-frame-pointer_-fwrapv_-fPIC_-fPIE2021011420210114
8586621500 0 032969 804 952T:ccalik/aesnigcc_-march=native_-mtune=native_-O2_-fomit-frame-pointer_-fwrapv_-fPIC_-fPIE2021011420210114
8586621500 0 032969 804 952T:ccalik/vpermgcc_-march=native_-mtune=native_-O2_-fomit-frame-pointer_-fwrapv_-fPIC_-fPIE2021011420210114
8687420989 0 032145 804 952T:ccalik/vpermgcc_-march=native_-mtune=native_-O_-fomit-frame-pointer_-fwrapv_-fPIC_-fPIE2021011420210114
8689220989 0 032145 804 952T:ccalik/aesnigcc_-march=native_-mtune=native_-O_-fomit-frame-pointer_-fwrapv_-fPIC_-fPIE2021011420210114
8935113631 0 026740 804 888T:sphlib-smallclang_-mcpu=native_-O3_-fomit-frame-pointer_-fwrapv_-Qunused-arguments_-fPIC_-fPIE2021011420210114
9015829653 0 039698 796 888T:sphlibclang_-march=native_-Os_-fomit-frame-pointer_-fwrapv_-Qunused-arguments_-fPIC_-fPIE2021011420210114
9065730670 0 043596 804 920T:sphlibclang_-march=native_-O_-fomit-frame-pointer_-fwrapv_-Qunused-arguments_-fPIC_-fPIE2021011420210114
9067230670 0 043596 804 920T:sphlibclang_-march=native_-O2_-fomit-frame-pointer_-fwrapv_-Qunused-arguments_-fPIC_-fPIE2021011420210114
9139910768 0 022385 804 952T:sphlib-smallgcc_-march=native_-mtune=native_-O2_-fomit-frame-pointer_-fwrapv_-fPIC_-fPIE2021011420210114
9148916267 0 029148 804 920T:ccalik/bitslicedclang_-march=native_-O_-fomit-frame-pointer_-fwrapv_-Qunused-arguments_-fPIC_-fPIE2021011420210114
9150716267 0 029148 804 920T:ccalik/bitslicedclang_-march=native_-O2_-fomit-frame-pointer_-fwrapv_-Qunused-arguments_-fPIC_-fPIE2021011420210114
9225816299 0 029212 804 920T:ccalik/bitslicedclang_-march=native_-O3_-fomit-frame-pointer_-fwrapv_-Qunused-arguments_-fPIC_-fPIE2021011420210114
9243410606 0 021905 804 952T:sphlib-smallgcc_-march=native_-mtune=native_-O_-fomit-frame-pointer_-fwrapv_-fPIC_-fPIE2021011420210114
933089643 0 020020 780 920T:sphlib-smallgcc_-march=native_-mtune=native_-Os_-fomit-frame-pointer_-fwrapv_-fPIC_-fPIE2021011420210114
9353219636 0 031232 812 968T:generic/opt32gcc_-march=native_-mtune=native_-O2_-fomit-frame-pointer_-fwrapv_-fPIC_-fPIE2021011420210114
9392115137 0 025098 796 888T:ccalik/bitslicedclang_-march=native_-Os_-fomit-frame-pointer_-fwrapv_-Qunused-arguments_-fPIC_-fPIE2021011420210114
9392923876 0 037640 812 968T:generic/opt32gcc_-march=native_-mtune=native_-O3_-fomit-frame-pointer_-fwrapv_-fPIC_-fPIE2021011420210114
9490319032 0 030304 812 968T:generic/opt32gcc_-march=native_-mtune=native_-O_-fomit-frame-pointer_-fwrapv_-fPIC_-fPIE2021011420210114
9540912403 0 025396 804 920T:sphlib-smallclang_-march=native_-O_-fomit-frame-pointer_-fwrapv_-Qunused-arguments_-fPIC_-fPIE2021011420210114
9552112688 0 025716 804 920T:sphlib-smallclang_-march=native_-O3_-fomit-frame-pointer_-fwrapv_-Qunused-arguments_-fPIC_-fPIE2021011420210114
9556212403 0 025396 804 920T:sphlib-smallclang_-march=native_-O2_-fomit-frame-pointer_-fwrapv_-Qunused-arguments_-fPIC_-fPIE2021011420210114
9821018628 0 028971 788 936T:generic/opt32gcc_-march=native_-mtune=native_-Os_-fomit-frame-pointer_-fwrapv_-fPIC_-fPIE2021011420210114
10187119329 0 033001 804 952T:ccalik/bitslicedgcc_-march=native_-mtune=native_-O3_-fomit-frame-pointer_-fwrapv_-fPIC_-fPIE2021011420210114
10209816108 0 027577 804 952T:ccalik/bitslicedgcc_-march=native_-mtune=native_-O2_-fomit-frame-pointer_-fwrapv_-fPIC_-fPIE2021011420210114
10318315965 0 027121 804 952T:ccalik/bitslicedgcc_-march=native_-mtune=native_-O_-fomit-frame-pointer_-fwrapv_-fPIC_-fPIE2021011420210114
10836920420 0 033316 804 936T:generic/opt32clang_-march=native_-O2_-fomit-frame-pointer_-fwrapv_-Qunused-arguments_-fPIC_-fPIE2021011420210114
10848720505 0 033444 804 936T:generic/opt32clang_-march=native_-O3_-fomit-frame-pointer_-fwrapv_-Qunused-arguments_-fPIC_-fPIE2021011420210114
10851020420 0 033316 804 936T:generic/opt32clang_-march=native_-O_-fomit-frame-pointer_-fwrapv_-Qunused-arguments_-fPIC_-fPIE2021011420210114
10935523273 0 036308 804 904T:generic/opt32clang_-mcpu=native_-O3_-fomit-frame-pointer_-fwrapv_-Qunused-arguments_-fPIC_-fPIE2021011420210114
1095019022 0 019106 796 888T:sphlib-smallclang_-march=native_-Os_-fomit-frame-pointer_-fwrapv_-Qunused-arguments_-fPIC_-fPIE2021011420210114
11121020408 0 030050 796 904T:generic/opt32clang_-march=native_-Os_-fomit-frame-pointer_-fwrapv_-Qunused-arguments_-fPIC_-fPIE2021011420210114
11186916168 0 026388 780 920T:ccalik/bitslicedgcc_-march=native_-mtune=native_-Os_-fomit-frame-pointer_-fwrapv_-fPIC_-fPIE2021011420210114
11215227021 0 036730 796 896T:generic/opt64clang_-march=native_-Os_-fomit-frame-pointer_-fwrapv_-Qunused-arguments_-fPIC_-fPIE2021011420210114
11463930731 0 043748 804 896T:generic/opt64clang_-mcpu=native_-O3_-fomit-frame-pointer_-fwrapv_-Qunused-arguments_-fPIC_-fPIE2021011420210114
11904425406 0 038300 804 928T:generic/opt64clang_-march=native_-O_-fomit-frame-pointer_-fwrapv_-Qunused-arguments_-fPIC_-fPIE2021011420210114
11910425203 0 038124 804 928T:generic/opt64clang_-march=native_-O3_-fomit-frame-pointer_-fwrapv_-Qunused-arguments_-fPIC_-fPIE2021011420210114
11911025406 0 038300 804 928T:generic/opt64clang_-march=native_-O2_-fomit-frame-pointer_-fwrapv_-Qunused-arguments_-fPIC_-fPIE2021011420210114
11997329801 0 042836 804 904T:powerpc/pp32cv2clang_-mcpu=native_-O3_-fomit-frame-pointer_-fwrapv_-Qunused-arguments_-fPIC_-fPIE2021011420210114
11999526836 0 039732 804 936T:powerpc/pp32cv2clang_-march=native_-O2_-fomit-frame-pointer_-fwrapv_-Qunused-arguments_-fPIC_-fPIE2021011420210114
12001326836 0 039732 804 936T:powerpc/pp32cv2clang_-march=native_-O_-fomit-frame-pointer_-fwrapv_-Qunused-arguments_-fPIC_-fPIE2021011420210114
12044126889 0 039828 804 936T:powerpc/pp32cv2clang_-march=native_-O3_-fomit-frame-pointer_-fwrapv_-Qunused-arguments_-fPIC_-fPIE2021011420210114
13370827002 0 036642 796 904T:powerpc/pp32cv2clang_-march=native_-Os_-fomit-frame-pointer_-fwrapv_-Qunused-arguments_-fPIC_-fPIE2021011420210114
13843625775 0 036123 788 936T:powerpc/pp32cv2gcc_-march=native_-mtune=native_-Os_-fomit-frame-pointer_-fwrapv_-fPIC_-fPIE2021011420210114
14036833268 0 047032 812 968T:powerpc/pp32cv2gcc_-march=native_-mtune=native_-O3_-fomit-frame-pointer_-fwrapv_-fPIC_-fPIE2021011420210114
14295521977 0 035012 804 904T:powerpc/pp32cv1clang_-mcpu=native_-O3_-fomit-frame-pointer_-fwrapv_-Qunused-arguments_-fPIC_-fPIE2021011420210114
14588929092 0 040688 812 968T:powerpc/pp32cv2gcc_-march=native_-mtune=native_-O2_-fomit-frame-pointer_-fwrapv_-fPIC_-fPIE2021011420210114
15037827912 0 039184 812 968T:powerpc/pp32cv2gcc_-march=native_-mtune=native_-O_-fomit-frame-pointer_-fwrapv_-fPIC_-fPIE2021011420210114
15454319140 0 032036 804 936T:powerpc/pp32cv1clang_-march=native_-O_-fomit-frame-pointer_-fwrapv_-Qunused-arguments_-fPIC_-fPIE2021011420210114
15463819193 0 032132 804 936T:powerpc/pp32cv1clang_-march=native_-O3_-fomit-frame-pointer_-fwrapv_-Qunused-arguments_-fPIC_-fPIE2021011420210114
15469119140 0 032036 804 936T:powerpc/pp32cv1clang_-march=native_-O2_-fomit-frame-pointer_-fwrapv_-Qunused-arguments_-fPIC_-fPIE2021011420210114
16200622356 0 036120 812 968T:powerpc/pp32cv1gcc_-march=native_-mtune=native_-O3_-fomit-frame-pointer_-fwrapv_-fPIC_-fPIE2021011420210114
16765218212 0 029808 812 968T:powerpc/pp32cv1gcc_-march=native_-mtune=native_-O2_-fomit-frame-pointer_-fwrapv_-fPIC_-fPIE2021011420210114
16788019207 0 028850 796 904T:powerpc/pp32cv1clang_-march=native_-Os_-fomit-frame-pointer_-fwrapv_-Qunused-arguments_-fPIC_-fPIE2021011420210114
17530117637 0 028912 812 968T:powerpc/pp32cv1gcc_-march=native_-mtune=native_-O_-fomit-frame-pointer_-fwrapv_-fPIC_-fPIE2021011420210114
18641316839 0 027179 788 936T:powerpc/pp32cv1gcc_-march=native_-mtune=native_-Os_-fomit-frame-pointer_-fwrapv_-fPIC_-fPIE2021011420210114

Compiler output

Implementation: T:aes/aes64
Security model: timingleaks
Compiler: clang -march=native -O2 -fomit-frame-pointer -fwrapv -Qunused-arguments -fPIC -fPIE
echo64.S: echo64.S:1064:2: error: '.att_syntax noprefix' is not supported: registers must have a '%' prefix in .att_syntax
echo64.S: .att_syntax noprefix
echo64.S: ^
echo64.S: echo64.S:1077:10: error: unknown token in expression
echo64.S: movabsq $-9187201950435737472, %rax
echo64.S: ^
echo64.S: echo64.S:1078:10: error: unknown token in expression
echo64.S: movabsq $-9187201950435737472, %r11
echo64.S: ^
echo64.S: echo64.S:1079:10: error: unknown token in expression
echo64.S: movabsq $7599940337074203, %r10
echo64.S: ^
echo64.S: echo64.S:1080:7: error: unknown token in expression
echo64.S: movq %rax, MEM_CST+16(%rip)
echo64.S: ^
echo64.S: echo64.S:1081:10: error: unknown token in expression
echo64.S: movabsq $7599940337074203, %r9
echo64.S: ^
echo64.S: echo64.S:1082:10: error: unknown token in expression
echo64.S: movabsq $-72340172838076674, %rax
echo64.S: ^
echo64.S: echo64.S:1083:10: error: unknown token in expression
echo64.S: movabsq $72340172838076673, %r8
echo64.S: ^
echo64.S: echo64.S:1084:10: error: unknown token in expression
echo64.S: ...

Number of similar (compiler,implementation) pairs: 5, namely:
CompilerImplementations
clang -march=native -O2 -fomit-frame-pointer -fwrapv -Qunused-arguments -fPIC -fPIE T:aes/aes64
clang -march=native -O3 -fomit-frame-pointer -fwrapv -Qunused-arguments -fPIC -fPIE T:aes/aes64
clang -march=native -O -fomit-frame-pointer -fwrapv -Qunused-arguments -fPIC -fPIE T:aes/aes64
clang -march=native -Os -fomit-frame-pointer -fwrapv -Qunused-arguments -fPIC -fPIE T:aes/aes64
clang -mcpu=native -O3 -fomit-frame-pointer -fwrapv -Qunused-arguments -fPIC -fPIE T:aes/aes64

Compiler output

Implementation: T:aes/aes64
Security model: timingleaks
Compiler: gcc -march=native -mtune=native -O2 -fomit-frame-pointer -fwrapv -fPIC -fPIE
try.c: /usr/bin/ld: crypto_hash_echo512.a(echo64.o): relocation R_X86_64_32S against undefined symbol `OLDCV' can not be used when making a PIE object; recompile with -fPIC
try.c: /usr/bin/ld: final link failed: Nonrepresentable section on output
try.c: collect2: error: ld returned 1 exit status

Number of similar (compiler,implementation) pairs: 4, namely:
CompilerImplementations
gcc -march=native -mtune=native -O2 -fomit-frame-pointer -fwrapv -fPIC -fPIE T:aes/aes64
gcc -march=native -mtune=native -O3 -fomit-frame-pointer -fwrapv -fPIC -fPIE T:aes/aes64
gcc -march=native -mtune=native -O -fomit-frame-pointer -fwrapv -fPIC -fPIE T:aes/aes64
gcc -march=native -mtune=native -Os -fomit-frame-pointer -fwrapv -fPIC -fPIE T:aes/aes64

Compiler output

Implementation: T:athlon/athlon64
Security model: timingleaks
Compiler: clang -march=native -O2 -fomit-frame-pointer -fwrapv -Qunused-arguments -fPIC -fPIE
echo64.S: echo64.S:248:2: error: invalid instruction mnemonic 'movzbl'
echo64.S: movzbl ebp, ah
echo64.S: ^~~~~~
echo64.S: echo64.S:251:2: error: invalid instruction mnemonic 'movzbl'
echo64.S: movzbl esi, al
echo64.S: ^~~~~~
echo64.S: echo64.S:263:2: error: invalid instruction mnemonic 'movzbl'
echo64.S: movzbl ebp, bl
echo64.S: ^~~~~~
echo64.S: echo64.S:266:2: error: invalid instruction mnemonic 'movzbl'
echo64.S: movzbl esi, bh
echo64.S: ^~~~~~
echo64.S: echo64.S:278:2: error: invalid instruction mnemonic 'movzbl'
echo64.S: movzbl ebp, al
echo64.S: ^~~~~~
echo64.S: echo64.S:281:2: error: invalid instruction mnemonic 'movzbl'
echo64.S: movzbl esi, ah
echo64.S: ^~~~~~
echo64.S: echo64.S:293:2: error: invalid instruction mnemonic 'movzbl'
echo64.S: movzbl ebp, bh
echo64.S: ^~~~~~
echo64.S: echo64.S:296:2: error: invalid instruction mnemonic 'movzbl'
echo64.S: movzbl esi, bl
echo64.S: ^~~~~~
echo64.S: echo64.S:308:2: error: invalid instruction mnemonic 'movzbl'
echo64.S: ...

Number of similar (compiler,implementation) pairs: 5, namely:
CompilerImplementations
clang -march=native -O2 -fomit-frame-pointer -fwrapv -Qunused-arguments -fPIC -fPIE T:athlon/athlon64
clang -march=native -O3 -fomit-frame-pointer -fwrapv -Qunused-arguments -fPIC -fPIE T:athlon/athlon64
clang -march=native -O -fomit-frame-pointer -fwrapv -Qunused-arguments -fPIC -fPIE T:athlon/athlon64
clang -march=native -Os -fomit-frame-pointer -fwrapv -Qunused-arguments -fPIC -fPIE T:athlon/athlon64
clang -mcpu=native -O3 -fomit-frame-pointer -fwrapv -Qunused-arguments -fPIC -fPIE T:athlon/athlon64

Compiler output

Implementation: T:athlon/athlon64
Security model: timingleaks
Compiler: gcc -march=native -mtune=native -O2 -fomit-frame-pointer -fwrapv -fPIC -fPIE
echo64.S: echo64.c: Assembler messages:
echo64.S: echo64.c:519: Error: no such instruction: `movzbl ebp,ah'
echo64.S: echo64.c:519: Error: no such instruction: `movzbl esi,al'
echo64.S: echo64.c:519: Error: no such instruction: `movzbl ebp,bl'
echo64.S: echo64.c:519: Error: no such instruction: `movzbl esi,bh'
echo64.S: echo64.c:519: Error: no such instruction: `movzbl ebp,al'
echo64.S: echo64.c:519: Error: no such instruction: `movzbl esi,ah'
echo64.S: echo64.c:519: Error: no such instruction: `movzbl ebp,bh'
echo64.S: echo64.c:519: Error: no such instruction: `movzbl esi,bl'
echo64.S: echo64.c:519: Error: no such instruction: `movzbl ebp,ah'
echo64.S: echo64.c:519: Error: no such instruction: `movzbl esi,al'
echo64.S: echo64.c:519: Error: no such instruction: `movzbl ebp,bl'
echo64.S: echo64.c:519: Error: no such instruction: `movzbl esi,bh'
echo64.S: echo64.c:519: Error: no such instruction: `movzbl ebp,al'
echo64.S: echo64.c:519: Error: no such instruction: `movzbl esi,ah'
echo64.S: echo64.c:519: Error: no such instruction: `movzbl ebp,bl'
echo64.S: echo64.c:519: Error: no such instruction: `movzbl esi,bh'
echo64.S: echo64.c:519: Error: no such instruction: `movzbl ebp,dl'
echo64.S: echo64.c:519: Error: no such instruction: `movzbl esi,dh'
echo64.S: echo64.c:519: Error: no such instruction: `movzbl ebp,ch'
echo64.S: echo64.c:519: Error: no such instruction: `movzbl esi,cl'
echo64.S: echo64.c:519: Error: no such instruction: `movzbl ebp,cl'
echo64.S: echo64.c:519: Error: no such instruction: `movzbl esi,ch'
echo64.S: echo64.c:519: Error: no such instruction: `movzbl ebp,dh'
echo64.S: echo64.c:519: Error: no such instruction: `movzbl esi,dl'
echo64.S: ...

Number of similar (compiler,implementation) pairs: 4, namely:
CompilerImplementations
gcc -march=native -mtune=native -O2 -fomit-frame-pointer -fwrapv -fPIC -fPIE T:athlon/athlon64
gcc -march=native -mtune=native -O3 -fomit-frame-pointer -fwrapv -fPIC -fPIE T:athlon/athlon64
gcc -march=native -mtune=native -O -fomit-frame-pointer -fwrapv -fPIC -fPIE T:athlon/athlon64
gcc -march=native -mtune=native -Os -fomit-frame-pointer -fwrapv -fPIC -fPIE T:athlon/athlon64

Compiler output

Implementation: T:ccalik/aesni
Security model: timingleaks
Compiler: clang -mcpu=native -O3 -fomit-frame-pointer -fwrapv -Qunused-arguments -fPIC -fPIE
hash.c: hash.c:263:4: error: always_inline function '_mm_shuffle_epi8' requires target feature 'ssse3', but would be inlined into function 'Compress' that is compiled without support for 'ssse3'
hash.c: TRANSFORM(_state[i][j], _k_ipt, t1, t2);
hash.c: ^
hash.c: ./vperm.h:52:7: note: expanded from macro 'TRANSFORM'
hash.c: t1 = _mm_shuffle_epi8(*((__m128i*)table + 1), t1);\
hash.c: ^
hash.c: hash.c:263:4: error: always_inline function '_mm_shuffle_epi8' requires target feature 'ssse3', but would be inlined into function 'Compress' that is compiled without support for 'ssse3'
hash.c: ./vperm.h:53:7: note: expanded from macro 'TRANSFORM'
hash.c: x = _mm_shuffle_epi8(*((__m128i*)table + 0), x);\
hash.c: ^
hash.c: hash.c:280:5: error: always_inline function '_mm_shuffle_epi8' requires target feature 'ssse3', but would be inlined into function 'Compress' that is compiled without support for 'ssse3'
hash.c: TRANSFORM(_state[i][j], _k_ipt, t1, t2);
hash.c: ^
hash.c: ./vperm.h:52:7: note: expanded from macro 'TRANSFORM'
hash.c: t1 = _mm_shuffle_epi8(*((__m128i*)table + 1), t1);\
hash.c: ^
hash.c: hash.c:280:5: error: always_inline function '_mm_shuffle_epi8' requires target feature 'ssse3', but would be inlined into function 'Compress' that is compiled without support for 'ssse3'
hash.c: ./vperm.h:53:7: note: expanded from macro 'TRANSFORM'
hash.c: x = _mm_shuffle_epi8(*((__m128i*)table + 0), x);\
hash.c: ^
hash.c: hash.c:305:4: error: always_inline function '_mm_shuffle_epi8' requires target feature 'ssse3', but would be inlined into function 'Compress' that is compiled without support for 'ssse3'
hash.c: ECHO_SUB_AND_MIX(_state, 0, 0, _state2, 0, 0, 1, 2, 3);
hash.c: ^
hash.c: hash.c:124:5: note: expanded from macro 'ECHO_SUB_AND_MIX'
hash.c: AES_ROUND_VPERM_CORE(state[i][j], t1, t2, t3, t4, s1, s2, s3);\
hash.c: ...

Number of similar (compiler,implementation) pairs: 2, namely:
CompilerImplementations
clang -mcpu=native -O3 -fomit-frame-pointer -fwrapv -Qunused-arguments -fPIC -fPIE T:ccalik/aesni T:ccalik/vperm

Compiler output

Implementation: T:ccalik/bitsliced
Security model: timingleaks
Compiler: clang -mcpu=native -O3 -fomit-frame-pointer -fwrapv -Qunused-arguments -fPIC -fPIE
hash.c: hash.c:468:4: error: always_inline function '_mm_shuffle_epi8' requires target feature 'ssse3', but would be inlined into function 'Compress' that is compiled without support for 'ssse3'
hash.c: AES_SHIFT_ROWS(_state);
hash.c: ^
hash.c: hash.c:141:14: note: expanded from macro 'AES_SHIFT_ROWS'
hash.c: s[0][0] = _mm_shuffle_epi8(s[0][0], M128(shiftrowsslice));\
hash.c: ^
hash.c: hash.c:468:4: error: always_inline function '_mm_shuffle_epi8' requires target feature 'ssse3', but would be inlined into function 'Compress' that is compiled without support for 'ssse3'
hash.c: hash.c:142:14: note: expanded from macro 'AES_SHIFT_ROWS'
hash.c: s[0][1] = _mm_shuffle_epi8(s[0][1], M128(shiftrowsslice));\
hash.c: ^
hash.c: hash.c:468:4: error: always_inline function '_mm_shuffle_epi8' requires target feature 'ssse3', but would be inlined into function 'Compress' that is compiled without support for 'ssse3'
hash.c: hash.c:143:14: note: expanded from macro 'AES_SHIFT_ROWS'
hash.c: s[0][2] = _mm_shuffle_epi8(s[0][2], M128(shiftrowsslice));\
hash.c: ^
hash.c: hash.c:468:4: error: always_inline function '_mm_shuffle_epi8' requires target feature 'ssse3', but would be inlined into function 'Compress' that is compiled without support for 'ssse3'
hash.c: hash.c:144:14: note: expanded from macro 'AES_SHIFT_ROWS'
hash.c: s[0][3] = _mm_shuffle_epi8(s[0][3], M128(shiftrowsslice));\
hash.c: ^
hash.c: hash.c:468:4: error: always_inline function '_mm_shuffle_epi8' requires target feature 'ssse3', but would be inlined into function 'Compress' that is compiled without support for 'ssse3'
hash.c: hash.c:145:14: note: expanded from macro 'AES_SHIFT_ROWS'
hash.c: s[1][0] = _mm_shuffle_epi8(s[1][0], M128(shiftrowsslice));\
hash.c: ^
hash.c: hash.c:468:4: error: always_inline function '_mm_shuffle_epi8' requires target feature 'ssse3', but would be inlined into function 'Compress' that is compiled without support for 'ssse3'
hash.c: hash.c:146:14: note: expanded from macro 'AES_SHIFT_ROWS'
hash.c: s[1][1] = _mm_shuffle_epi8(s[1][1], M128(shiftrowsslice));\
hash.c: ...

Number of similar (compiler,implementation) pairs: 1, namely:
CompilerImplementations
clang -mcpu=native -O3 -fomit-frame-pointer -fwrapv -Qunused-arguments -fPIC -fPIE T:ccalik/bitsliced

Compiler output

Implementation: T:core2/core2v64
Security model: timingleaks
Compiler: clang -march=native -O2 -fomit-frame-pointer -fwrapv -Qunused-arguments -fPIC -fPIE
echo64.S: echo64.S:224:2: error: invalid instruction mnemonic 'movzbl'
echo64.S: movzbl ebp, ah
echo64.S: ^~~~~~
echo64.S: echo64.S:230:2: error: invalid instruction mnemonic 'movzbl'
echo64.S: movzbl esi, al
echo64.S: ^~~~~~
echo64.S: echo64.S:239:2: error: invalid instruction mnemonic 'movzbl'
echo64.S: movzbl ebp, bl
echo64.S: ^~~~~~
echo64.S: echo64.S:245:2: error: invalid instruction mnemonic 'movzbl'
echo64.S: movzbl esi, bh
echo64.S: ^~~~~~
echo64.S: echo64.S:254:2: error: invalid instruction mnemonic 'movzbl'
echo64.S: movzbl ebp, al
echo64.S: ^~~~~~
echo64.S: echo64.S:260:2: error: invalid instruction mnemonic 'movzbl'
echo64.S: movzbl esi, ah
echo64.S: ^~~~~~
echo64.S: echo64.S:269:2: error: invalid instruction mnemonic 'movzbl'
echo64.S: movzbl ebp, bh
echo64.S: ^~~~~~
echo64.S: echo64.S:275:2: error: invalid instruction mnemonic 'movzbl'
echo64.S: movzbl esi, bl
echo64.S: ^~~~~~
echo64.S: echo64.S:284:2: error: invalid instruction mnemonic 'movzbl'
echo64.S: ...

Number of similar (compiler,implementation) pairs: 5, namely:
CompilerImplementations
clang -march=native -O2 -fomit-frame-pointer -fwrapv -Qunused-arguments -fPIC -fPIE T:core2/core2v64
clang -march=native -O3 -fomit-frame-pointer -fwrapv -Qunused-arguments -fPIC -fPIE T:core2/core2v64
clang -march=native -O -fomit-frame-pointer -fwrapv -Qunused-arguments -fPIC -fPIE T:core2/core2v64
clang -march=native -Os -fomit-frame-pointer -fwrapv -Qunused-arguments -fPIC -fPIE T:core2/core2v64
clang -mcpu=native -O3 -fomit-frame-pointer -fwrapv -Qunused-arguments -fPIC -fPIE T:core2/core2v64

Compiler output

Implementation: T:core2/core2v64
Security model: timingleaks
Compiler: gcc -march=native -mtune=native -O2 -fomit-frame-pointer -fwrapv -fPIC -fPIE
echo64.S: echo64.c: Assembler messages:
echo64.S: echo64.c:473: Error: no such instruction: `movzbl ebp,ah'
echo64.S: echo64.c:473: Error: no such instruction: `movzbl esi,al'
echo64.S: echo64.c:473: Error: no such instruction: `movzbl ebp,bl'
echo64.S: echo64.c:473: Error: no such instruction: `movzbl esi,bh'
echo64.S: echo64.c:473: Error: no such instruction: `movzbl ebp,al'
echo64.S: echo64.c:473: Error: no such instruction: `movzbl esi,ah'
echo64.S: echo64.c:473: Error: no such instruction: `movzbl ebp,bh'
echo64.S: echo64.c:473: Error: no such instruction: `movzbl esi,bl'
echo64.S: echo64.c:473: Error: no such instruction: `movzbl ebp,ah'
echo64.S: echo64.c:473: Error: no such instruction: `movzbl esi,al'
echo64.S: echo64.c:473: Error: no such instruction: `movzbl ebp,bl'
echo64.S: echo64.c:473: Error: no such instruction: `movzbl esi,bh'
echo64.S: echo64.c:473: Error: no such instruction: `movzbl ebp,al'
echo64.S: echo64.c:473: Error: no such instruction: `movzbl esi,ah'
echo64.S: echo64.c:473: Error: no such instruction: `movzbl ebp,bl'
echo64.S: echo64.c:473: Error: no such instruction: `movzbl esi,bh'
echo64.S: echo64.c:473: Error: no such instruction: `movzbl ebp,dl'
echo64.S: echo64.c:473: Error: no such instruction: `movzbl esi,dh'
echo64.S: echo64.c:473: Error: no such instruction: `movzbl ebp,ch'
echo64.S: echo64.c:473: Error: no such instruction: `movzbl esi,cl'
echo64.S: echo64.c:473: Error: no such instruction: `movzbl ebp,cl'
echo64.S: echo64.c:473: Error: no such instruction: `movzbl esi,ch'
echo64.S: echo64.c:473: Error: no such instruction: `movzbl ebp,dh'
echo64.S: echo64.c:473: Error: no such instruction: `movzbl esi,dl'
echo64.S: ...

Number of similar (compiler,implementation) pairs: 4, namely:
CompilerImplementations
gcc -march=native -mtune=native -O2 -fomit-frame-pointer -fwrapv -fPIC -fPIE T:core2/core2v64
gcc -march=native -mtune=native -O3 -fomit-frame-pointer -fwrapv -fPIC -fPIE T:core2/core2v64
gcc -march=native -mtune=native -O -fomit-frame-pointer -fwrapv -fPIC -fPIE T:core2/core2v64
gcc -march=native -mtune=native -Os -fomit-frame-pointer -fwrapv -fPIC -fPIE T:core2/core2v64

Compiler output

Implementation: T:generic/opt64
Security model: timingleaks
Compiler: clang -march=native -O2 -fomit-frame-pointer -fwrapv -Qunused-arguments -fPIC -fPIE
echo64.c: echo64.c:501:29: warning: passing 'const unsigned char *' to parameter of type 'BitSequence *' (aka 'unsigned char *') discards qualifiers [-Wincompatible-pointer-types-discards-qualifiers]
echo64.c: if (Hash(CRYPTO_BYTES * 8,in,inlen * 8,out) == SUCCESS) return 0;
echo64.c: ^~
echo64.c: echo64.c:488:46: note: passing argument to parameter 'data' here
echo64.c: HashReturn Hash(int hashbitlen, BitSequence *data, DataLength databitlen, BitSequence *hashval)
echo64.c: ^
echo64.c: 1 warning generated.

Number of similar (compiler,implementation) pairs: 5, namely:
CompilerImplementations
clang -march=native -O2 -fomit-frame-pointer -fwrapv -Qunused-arguments -fPIC -fPIE T:generic/opt64
clang -march=native -O3 -fomit-frame-pointer -fwrapv -Qunused-arguments -fPIC -fPIE T:generic/opt64
clang -march=native -O -fomit-frame-pointer -fwrapv -Qunused-arguments -fPIC -fPIE T:generic/opt64
clang -march=native -Os -fomit-frame-pointer -fwrapv -Qunused-arguments -fPIC -fPIE T:generic/opt64
clang -mcpu=native -O3 -fomit-frame-pointer -fwrapv -Qunused-arguments -fPIC -fPIE T:generic/opt64

Compiler output

Implementation: T:generic/opt64
Security model: timingleaks
Compiler: gcc -march=native -mtune=native -O2 -fomit-frame-pointer -fwrapv -fPIC -fPIE
echo64.c: echo64.c: In function 'crypto_hash_echo512_generic_opt64_timingleaks':
echo64.c: echo64.c:501:29: warning: passing argument 2 of 'Hash' discards 'const' qualifier from pointer target type [-Wdiscarded-qualifiers]
echo64.c: if (Hash(CRYPTO_BYTES * 8,in,inlen * 8,out) == SUCCESS) return 0;
echo64.c: ^~
echo64.c: echo64.c:488:12: note: expected 'BitSequence * {aka unsigned char *}' but argument is of type 'const unsigned char *'
echo64.c: HashReturn Hash(int hashbitlen, BitSequence *data, DataLength databitlen, BitSequence *hashval)
echo64.c: ^~~~

Number of similar (compiler,implementation) pairs: 4, namely:
CompilerImplementations
gcc -march=native -mtune=native -O2 -fomit-frame-pointer -fwrapv -fPIC -fPIE T:generic/opt64
gcc -march=native -mtune=native -O3 -fomit-frame-pointer -fwrapv -fPIC -fPIE T:generic/opt64
gcc -march=native -mtune=native -O -fomit-frame-pointer -fwrapv -fPIC -fPIE T:generic/opt64
gcc -march=native -mtune=native -Os -fomit-frame-pointer -fwrapv -fPIC -fPIE T:generic/opt64

Compiler output

Implementation: T:pentium/pentium4v64v1
Security model: timingleaks
Compiler: clang -march=native -O2 -fomit-frame-pointer -fwrapv -Qunused-arguments -fPIC -fPIE
echo32.S: echo32.S:323:2: error: invalid instruction mnemonic 'addd'
echo32.S: addd [SHA3_CNT], 1
echo32.S: ^~~~
echo32.S: echo32.S:587:2: error: invalid instruction mnemonic 'addd'
echo32.S: addd [SHA3_CNT], 1
echo32.S: ^~~~
echo32.S: echo32.S:851:2: error: invalid instruction mnemonic 'addd'
echo32.S: addd [SHA3_CNT], 1
echo32.S: ^~~~
echo32.S: echo32.S:1115:2: error: invalid instruction mnemonic 'addd'
echo32.S: addd [SHA3_CNT], 1
echo32.S: ^~~~
echo32.S: echo32.S:1379:2: error: invalid instruction mnemonic 'addd'
echo32.S: addd [SHA3_CNT], 1
echo32.S: ^~~~
echo32.S: echo32.S:1643:2: error: invalid instruction mnemonic 'addd'
echo32.S: addd [SHA3_CNT], 1
echo32.S: ^~~~
echo32.S: echo32.S:1907:2: error: invalid instruction mnemonic 'addd'
echo32.S: addd [SHA3_CNT], 1
echo32.S: ^~~~
echo32.S: echo32.S:2171:2: error: invalid instruction mnemonic 'addd'
echo32.S: addd [SHA3_CNT], 1
echo32.S: ^~~~
echo32.S: echo32.S:2435:2: error: invalid instruction mnemonic 'addd'
echo32.S: ...

Number of similar (compiler,implementation) pairs: 5, namely:
CompilerImplementations
clang -march=native -O2 -fomit-frame-pointer -fwrapv -Qunused-arguments -fPIC -fPIE T:pentium/pentium4v64v1
clang -march=native -O3 -fomit-frame-pointer -fwrapv -Qunused-arguments -fPIC -fPIE T:pentium/pentium4v64v1
clang -march=native -O -fomit-frame-pointer -fwrapv -Qunused-arguments -fPIC -fPIE T:pentium/pentium4v64v1
clang -march=native -Os -fomit-frame-pointer -fwrapv -Qunused-arguments -fPIC -fPIE T:pentium/pentium4v64v1
clang -mcpu=native -O3 -fomit-frame-pointer -fwrapv -Qunused-arguments -fPIC -fPIE T:pentium/pentium4v64v1

Compiler output

Implementation: T:pentium/pentium4v64v1
Security model: timingleaks
Compiler: gcc -march=native -mtune=native -O2 -fomit-frame-pointer -fwrapv -fPIC -fPIE
try.c: /usr/bin/ld: crypto_hash_echo512.a(echo32.o): relocation R_X86_64_32S against undefined symbol `SHA3_R' can not be used when making a PIE object; recompile with -fPIC
try.c: /usr/bin/ld: final link failed: Nonrepresentable section on output
try.c: collect2: error: ld returned 1 exit status

Number of similar (compiler,implementation) pairs: 4, namely:
CompilerImplementations
gcc -march=native -mtune=native -O2 -fomit-frame-pointer -fwrapv -fPIC -fPIE T:pentium/pentium4v64v1
gcc -march=native -mtune=native -O3 -fomit-frame-pointer -fwrapv -fPIC -fPIE T:pentium/pentium4v64v1
gcc -march=native -mtune=native -O -fomit-frame-pointer -fwrapv -fPIC -fPIE T:pentium/pentium4v64v1
gcc -march=native -mtune=native -Os -fomit-frame-pointer -fwrapv -fPIC -fPIE T:pentium/pentium4v64v1

Compiler output

Implementation: T:pentium/pentium4v64v2
Security model: timingleaks
Compiler: clang -march=native -O2 -fomit-frame-pointer -fwrapv -Qunused-arguments -fPIC -fPIE
echo64.S: echo64.S:371:2: error: invalid instruction mnemonic 'addd'
echo64.S: addd [SHA3_CNT], 1
echo64.S: ^~~~
echo64.S: echo64.S:635:2: error: invalid instruction mnemonic 'addd'
echo64.S: addd [SHA3_CNT], 1
echo64.S: ^~~~
echo64.S: echo64.S:899:2: error: invalid instruction mnemonic 'addd'
echo64.S: addd [SHA3_CNT], 1
echo64.S: ^~~~
echo64.S: echo64.S:1163:2: error: invalid instruction mnemonic 'addd'
echo64.S: addd [SHA3_CNT], 1
echo64.S: ^~~~
echo64.S: echo64.S:1427:2: error: invalid instruction mnemonic 'addd'
echo64.S: addd [SHA3_CNT], 1
echo64.S: ^~~~
echo64.S: echo64.S:1691:2: error: invalid instruction mnemonic 'addd'
echo64.S: addd [SHA3_CNT], 1
echo64.S: ^~~~
echo64.S: echo64.S:1955:2: error: invalid instruction mnemonic 'addd'
echo64.S: addd [SHA3_CNT], 1
echo64.S: ^~~~
echo64.S: echo64.S:2219:2: error: invalid instruction mnemonic 'addd'
echo64.S: addd [SHA3_CNT], 1
echo64.S: ^~~~
echo64.S: echo64.S:2483:2: error: invalid instruction mnemonic 'addd'
echo64.S: ...

Number of similar (compiler,implementation) pairs: 5, namely:
CompilerImplementations
clang -march=native -O2 -fomit-frame-pointer -fwrapv -Qunused-arguments -fPIC -fPIE T:pentium/pentium4v64v2
clang -march=native -O3 -fomit-frame-pointer -fwrapv -Qunused-arguments -fPIC -fPIE T:pentium/pentium4v64v2
clang -march=native -O -fomit-frame-pointer -fwrapv -Qunused-arguments -fPIC -fPIE T:pentium/pentium4v64v2
clang -march=native -Os -fomit-frame-pointer -fwrapv -Qunused-arguments -fPIC -fPIE T:pentium/pentium4v64v2
clang -mcpu=native -O3 -fomit-frame-pointer -fwrapv -Qunused-arguments -fPIC -fPIE T:pentium/pentium4v64v2

Compiler output

Implementation: T:pentium/pentium4v64v2
Security model: timingleaks
Compiler: gcc -march=native -mtune=native -O2 -fomit-frame-pointer -fwrapv -fPIC -fPIE
try.c: /usr/bin/ld: crypto_hash_echo512.a(echo64.o): relocation R_X86_64_32S against undefined symbol `SHA3_R' can not be used when making a PIE object; recompile with -fPIC
try.c: /usr/bin/ld: final link failed: Nonrepresentable section on output
try.c: collect2: error: ld returned 1 exit status

Number of similar (compiler,implementation) pairs: 4, namely:
CompilerImplementations
gcc -march=native -mtune=native -O2 -fomit-frame-pointer -fwrapv -fPIC -fPIE T:pentium/pentium4v64v2
gcc -march=native -mtune=native -O3 -fomit-frame-pointer -fwrapv -fPIC -fPIE T:pentium/pentium4v64v2
gcc -march=native -mtune=native -O -fomit-frame-pointer -fwrapv -fPIC -fPIE T:pentium/pentium4v64v2
gcc -march=native -mtune=native -Os -fomit-frame-pointer -fwrapv -fPIC -fPIE T:pentium/pentium4v64v2

Namespace violations

Implementation: T:ccalik/aesni
Security model: timingleaks
Compiler: clang -march=native -O2 -fomit-frame-pointer -fwrapv -Qunused-arguments -fPIC -fPIE
hash.o Compress T
hash.o Final T
hash.o Hash T
hash.o Init T
hash.o Update T
hash.o _k_aesmix1 R
hash.o _k_aesmix2 R
hash.o _k_aesmix3 R
hash.o _k_aesmix4 R
hash.o _k_h0e R
hash.o _k_h15 R
hash.o _k_h4e R
hash.o _k_h5b R
hash.o _k_h63 R
hash.o _k_hc6 R
hash.o _k_inv R
hash.o _k_ipt R
hash.o _k_opt R
hash.o _k_s0F R
hash.o _k_sb1 R
hash.o _k_sb2 R
hash.o _k_sb3 R
hash.o _k_sb4 R
hash.o _k_sb5 R
hash.o _k_sb7 R
hash.o _k_sbo R
hash.o const1 R
hash.o invshiftrows R
hash.o lsbmask R
hash.o mul2ipt R
hash.o mul2mask R
hash.o zero R

Number of similar (compiler,implementation) pairs: 16, namely:
CompilerImplementations
clang -march=native -O2 -fomit-frame-pointer -fwrapv -Qunused-arguments -fPIC -fPIE T:ccalik/aesni
clang -march=native -O3 -fomit-frame-pointer -fwrapv -Qunused-arguments -fPIC -fPIE T:ccalik/aesni
clang -march=native -O -fomit-frame-pointer -fwrapv -Qunused-arguments -fPIC -fPIE T:ccalik/aesni
clang -march=native -Os -fomit-frame-pointer -fwrapv -Qunused-arguments -fPIC -fPIE T:ccalik/aesni
gcc -march=native -mtune=native -O2 -fomit-frame-pointer -fwrapv -fPIC -fPIE T:ccalik/aesni
gcc -march=native -mtune=native -O3 -fomit-frame-pointer -fwrapv -fPIC -fPIE T:ccalik/aesni
gcc -march=native -mtune=native -O -fomit-frame-pointer -fwrapv -fPIC -fPIE T:ccalik/aesni
gcc -march=native -mtune=native -Os -fomit-frame-pointer -fwrapv -fPIC -fPIE T:ccalik/aesni
clang -march=native -O2 -fomit-frame-pointer -fwrapv -Qunused-arguments -fPIC -fPIE T:ccalik/vperm
clang -march=native -O3 -fomit-frame-pointer -fwrapv -Qunused-arguments -fPIC -fPIE T:ccalik/vperm
clang -march=native -O -fomit-frame-pointer -fwrapv -Qunused-arguments -fPIC -fPIE T:ccalik/vperm
clang -march=native -Os -fomit-frame-pointer -fwrapv -Qunused-arguments -fPIC -fPIE T:ccalik/vperm
gcc -march=native -mtune=native -O2 -fomit-frame-pointer -fwrapv -fPIC -fPIE T:ccalik/vperm
gcc -march=native -mtune=native -O3 -fomit-frame-pointer -fwrapv -fPIC -fPIE T:ccalik/vperm
gcc -march=native -mtune=native -O -fomit-frame-pointer -fwrapv -fPIC -fPIE T:ccalik/vperm
gcc -march=native -mtune=native -Os -fomit-frame-pointer -fwrapv -fPIC -fPIE T:ccalik/vperm

Namespace violations

Implementation: T:ccalik/bitsliced
Security model: timingleaks
Compiler: clang -march=native -O2 -fomit-frame-pointer -fwrapv -Qunused-arguments -fPIC -fPIE
hash.o Compress T
hash.o Final T
hash.o Hash T
hash.o Init T
hash.o Update T
hash.o _BS0 R
hash.o _BS1 R
hash.o _BS2 R
hash.o _ONE R
hash.o bigshiftrows1 R
hash.o bigshiftrows2 R
hash.o bigshiftrows3 R
hash.o const1 R
hash.o lownibblemask R
hash.o mixcol1 R
hash.o mixcol2 R
hash.o mixcol3 R
hash.o shiftrowsslice R

Number of similar (compiler,implementation) pairs: 8, namely:
CompilerImplementations
clang -march=native -O2 -fomit-frame-pointer -fwrapv -Qunused-arguments -fPIC -fPIE T:ccalik/bitsliced
clang -march=native -O3 -fomit-frame-pointer -fwrapv -Qunused-arguments -fPIC -fPIE T:ccalik/bitsliced
clang -march=native -O -fomit-frame-pointer -fwrapv -Qunused-arguments -fPIC -fPIE T:ccalik/bitsliced
clang -march=native -Os -fomit-frame-pointer -fwrapv -Qunused-arguments -fPIC -fPIE T:ccalik/bitsliced
gcc -march=native -mtune=native -O2 -fomit-frame-pointer -fwrapv -fPIC -fPIE T:ccalik/bitsliced
gcc -march=native -mtune=native -O3 -fomit-frame-pointer -fwrapv -fPIC -fPIE T:ccalik/bitsliced
gcc -march=native -mtune=native -O -fomit-frame-pointer -fwrapv -fPIC -fPIE T:ccalik/bitsliced
gcc -march=native -mtune=native -Os -fomit-frame-pointer -fwrapv -fPIC -fPIE T:ccalik/bitsliced

Namespace violations

Implementation: T:generic/opt32
Security model: timingleaks
Compiler: clang -march=native -O2 -fomit-frame-pointer -fwrapv -Qunused-arguments -fPIC -fPIE
echo32.o CNT_r C
echo32.o Compress T
echo32.o Endianess T
echo32.o Final T
echo32.o Hash T
echo32.o Init T
echo32.o PushString T
echo32.o Update T
echo32.o endian C
echo32.o flip_bits T
echo32.o r C

Number of similar (compiler,implementation) pairs: 27, namely:
CompilerImplementations
clang -march=native -O2 -fomit-frame-pointer -fwrapv -Qunused-arguments -fPIC -fPIE T:generic/opt32
clang -march=native -O3 -fomit-frame-pointer -fwrapv -Qunused-arguments -fPIC -fPIE T:generic/opt32
clang -march=native -O -fomit-frame-pointer -fwrapv -Qunused-arguments -fPIC -fPIE T:generic/opt32
clang -march=native -Os -fomit-frame-pointer -fwrapv -Qunused-arguments -fPIC -fPIE T:generic/opt32
clang -mcpu=native -O3 -fomit-frame-pointer -fwrapv -Qunused-arguments -fPIC -fPIE T:generic/opt32
gcc -march=native -mtune=native -O2 -fomit-frame-pointer -fwrapv -fPIC -fPIE T:generic/opt32
gcc -march=native -mtune=native -O3 -fomit-frame-pointer -fwrapv -fPIC -fPIE T:generic/opt32
gcc -march=native -mtune=native -O -fomit-frame-pointer -fwrapv -fPIC -fPIE T:generic/opt32
gcc -march=native -mtune=native -Os -fomit-frame-pointer -fwrapv -fPIC -fPIE T:generic/opt32
clang -march=native -O2 -fomit-frame-pointer -fwrapv -Qunused-arguments -fPIC -fPIE T:powerpc/pp32cv1
clang -march=native -O3 -fomit-frame-pointer -fwrapv -Qunused-arguments -fPIC -fPIE T:powerpc/pp32cv1
clang -march=native -O -fomit-frame-pointer -fwrapv -Qunused-arguments -fPIC -fPIE T:powerpc/pp32cv1
clang -march=native -Os -fomit-frame-pointer -fwrapv -Qunused-arguments -fPIC -fPIE T:powerpc/pp32cv1
clang -mcpu=native -O3 -fomit-frame-pointer -fwrapv -Qunused-arguments -fPIC -fPIE T:powerpc/pp32cv1
gcc -march=native -mtune=native -O2 -fomit-frame-pointer -fwrapv -fPIC -fPIE T:powerpc/pp32cv1
gcc -march=native -mtune=native -O3 -fomit-frame-pointer -fwrapv -fPIC -fPIE T:powerpc/pp32cv1
gcc -march=native -mtune=native -O -fomit-frame-pointer -fwrapv -fPIC -fPIE T:powerpc/pp32cv1
gcc -march=native -mtune=native -Os -fomit-frame-pointer -fwrapv -fPIC -fPIE T:powerpc/pp32cv1
clang -march=native -O2 -fomit-frame-pointer -fwrapv -Qunused-arguments -fPIC -fPIE T:powerpc/pp32cv2
clang -march=native -O3 -fomit-frame-pointer -fwrapv -Qunused-arguments -fPIC -fPIE T:powerpc/pp32cv2
clang -march=native -O -fomit-frame-pointer -fwrapv -Qunused-arguments -fPIC -fPIE T:powerpc/pp32cv2
clang -march=native -Os -fomit-frame-pointer -fwrapv -Qunused-arguments -fPIC -fPIE T:powerpc/pp32cv2
clang -mcpu=native -O3 -fomit-frame-pointer -fwrapv -Qunused-arguments -fPIC -fPIE T:powerpc/pp32cv2
gcc -march=native -mtune=native -O2 -fomit-frame-pointer -fwrapv -fPIC -fPIE T:powerpc/pp32cv2
gcc -march=native -mtune=native -O3 -fomit-frame-pointer -fwrapv -fPIC -fPIE T:powerpc/pp32cv2
gcc -march=native -mtune=native -O -fomit-frame-pointer -fwrapv -fPIC -fPIE T:powerpc/pp32cv2
gcc -march=native -mtune=native -Os -fomit-frame-pointer -fwrapv -fPIC -fPIE T:powerpc/pp32cv2

Namespace violations

Implementation: T:generic/opt64
Security model: timingleaks
Compiler: clang -march=native -O2 -fomit-frame-pointer -fwrapv -Qunused-arguments -fPIC -fPIE
echo64.o Compress T
echo64.o Endianess T
echo64.o Final T
echo64.o Hash T
echo64.o Init T
echo64.o PushString T
echo64.o Update T
echo64.o endian C

Number of similar (compiler,implementation) pairs: 9, namely:
CompilerImplementations
clang -march=native -O2 -fomit-frame-pointer -fwrapv -Qunused-arguments -fPIC -fPIE T:generic/opt64
clang -march=native -O3 -fomit-frame-pointer -fwrapv -Qunused-arguments -fPIC -fPIE T:generic/opt64
clang -march=native -O -fomit-frame-pointer -fwrapv -Qunused-arguments -fPIC -fPIE T:generic/opt64
clang -march=native -Os -fomit-frame-pointer -fwrapv -Qunused-arguments -fPIC -fPIE T:generic/opt64
clang -mcpu=native -O3 -fomit-frame-pointer -fwrapv -Qunused-arguments -fPIC -fPIE T:generic/opt64
gcc -march=native -mtune=native -O2 -fomit-frame-pointer -fwrapv -fPIC -fPIE T:generic/opt64
gcc -march=native -mtune=native -O3 -fomit-frame-pointer -fwrapv -fPIC -fPIE T:generic/opt64
gcc -march=native -mtune=native -O -fomit-frame-pointer -fwrapv -fPIC -fPIE T:generic/opt64
gcc -march=native -mtune=native -Os -fomit-frame-pointer -fwrapv -fPIC -fPIE T:generic/opt64

Namespace violations

Implementation: T:sphlib
Security model: timingleaks
Compiler: clang -march=native -O2 -fomit-frame-pointer -fwrapv -Qunused-arguments -fPIC -fPIE
echo.o sph_echo224 T
echo.o sph_echo224_addbits_and_close T
echo.o sph_echo224_close T
echo.o sph_echo224_init T
echo.o sph_echo256 T
echo.o sph_echo256_addbits_and_close T
echo.o sph_echo256_close T
echo.o sph_echo256_init T
echo.o sph_echo384 T
echo.o sph_echo384_addbits_and_close T
echo.o sph_echo384_close T
echo.o sph_echo384_init T
echo.o sph_echo512 T
echo.o sph_echo512_addbits_and_close T
echo.o sph_echo512_close T
echo.o sph_echo512_init T

Number of similar (compiler,implementation) pairs: 18, namely:
CompilerImplementations
clang -march=native -O2 -fomit-frame-pointer -fwrapv -Qunused-arguments -fPIC -fPIE T:sphlib
clang -march=native -O3 -fomit-frame-pointer -fwrapv -Qunused-arguments -fPIC -fPIE T:sphlib
clang -march=native -O -fomit-frame-pointer -fwrapv -Qunused-arguments -fPIC -fPIE T:sphlib
clang -march=native -Os -fomit-frame-pointer -fwrapv -Qunused-arguments -fPIC -fPIE T:sphlib
clang -mcpu=native -O3 -fomit-frame-pointer -fwrapv -Qunused-arguments -fPIC -fPIE T:sphlib
gcc -march=native -mtune=native -O2 -fomit-frame-pointer -fwrapv -fPIC -fPIE T:sphlib
gcc -march=native -mtune=native -O3 -fomit-frame-pointer -fwrapv -fPIC -fPIE T:sphlib
gcc -march=native -mtune=native -O -fomit-frame-pointer -fwrapv -fPIC -fPIE T:sphlib
gcc -march=native -mtune=native -Os -fomit-frame-pointer -fwrapv -fPIC -fPIE T:sphlib
clang -march=native -O2 -fomit-frame-pointer -fwrapv -Qunused-arguments -fPIC -fPIE T:sphlib-small
clang -march=native -O3 -fomit-frame-pointer -fwrapv -Qunused-arguments -fPIC -fPIE T:sphlib-small
clang -march=native -O -fomit-frame-pointer -fwrapv -Qunused-arguments -fPIC -fPIE T:sphlib-small
clang -march=native -Os -fomit-frame-pointer -fwrapv -Qunused-arguments -fPIC -fPIE T:sphlib-small
clang -mcpu=native -O3 -fomit-frame-pointer -fwrapv -Qunused-arguments -fPIC -fPIE T:sphlib-small
gcc -march=native -mtune=native -O2 -fomit-frame-pointer -fwrapv -fPIC -fPIE T:sphlib-small
gcc -march=native -mtune=native -O3 -fomit-frame-pointer -fwrapv -fPIC -fPIE T:sphlib-small
gcc -march=native -mtune=native -O -fomit-frame-pointer -fwrapv -fPIC -fPIE T:sphlib-small
gcc -march=native -mtune=native -Os -fomit-frame-pointer -fwrapv -fPIC -fPIE T:sphlib-small