Implementation notes: amd64, rumba5, crypto_hash/blake3

Computer: rumba5
Architecture: amd64
CPU ID: AuthenticAMD-00800f11-178bfbff
SUPERCOP version: 20211108
Operation: crypto_hash
Primitive: blake3
TimeObject sizeTest sizeImplementationCompilerBenchmark dateSUPERCOP version
574014238 0 027244 804 888T:sse41clang_-mcpu=native_-O3_-fomit-frame-pointer_-fwrapv_-Qunused-arguments_-fPIC_-fPIE2021011420210114
574214796 0 028400 812 952T:sse41gcc_-march=native_-mtune=native_-O3_-fomit-frame-pointer_-fwrapv_-fPIC_-fPIE2021011420210114
574413042 0 024431 804 952T:sse41gcc_-march=native_-mtune=native_-O2_-fomit-frame-pointer_-fwrapv_-fPIC_-fPIE2021011420210114
575213533 0 026348 804 920T:sse41clang_-march=native_-O3_-fomit-frame-pointer_-fwrapv_-Qunused-arguments_-fPIC_-fPIE2021011420210114
575213533 0 026284 804 920T:sse41clang_-march=native_-O_-fomit-frame-pointer_-fwrapv_-Qunused-arguments_-fPIC_-fPIE2021011420210114
575413533 0 026284 804 920T:sse41clang_-march=native_-O2_-fomit-frame-pointer_-fwrapv_-Qunused-arguments_-fPIC_-fPIE2021011420210114
575712585 0 022522 796 888T:sse41clang_-march=native_-Os_-fomit-frame-pointer_-fwrapv_-Qunused-arguments_-fPIC_-fPIE2021011420210114
576023044 0 034271 804 952T:avx2gcc_-march=native_-mtune=native_-O_-fomit-frame-pointer_-fwrapv_-fPIC_-fPIE2021011420210114
576223417 0 036268 804 920T:avx2clang_-march=native_-O3_-fomit-frame-pointer_-fwrapv_-Qunused-arguments_-fPIC_-fPIE2021011420210114
576222926 0 034351 804 952T:avx2gcc_-march=native_-mtune=native_-O2_-fomit-frame-pointer_-fwrapv_-fPIC_-fPIE2021011420210114
576324122 0 037164 804 888T:avx2clang_-mcpu=native_-O3_-fomit-frame-pointer_-fwrapv_-Qunused-arguments_-fPIC_-fPIE2021011420210114
576423417 0 036204 804 920T:avx2clang_-march=native_-O2_-fomit-frame-pointer_-fwrapv_-Qunused-arguments_-fPIC_-fPIE2021011420210114
576423417 0 036204 804 920T:avx2clang_-march=native_-O_-fomit-frame-pointer_-fwrapv_-Qunused-arguments_-fPIC_-fPIE2021011420210114
576922469 0 032442 796 888T:avx2clang_-march=native_-Os_-fomit-frame-pointer_-fwrapv_-Qunused-arguments_-fPIC_-fPIE2021011420210114
576924888 0 038576 812 952T:avx2gcc_-march=native_-mtune=native_-O3_-fomit-frame-pointer_-fwrapv_-fPIC_-fPIE2021011420210114
577613160 0 024351 804 952T:sse41gcc_-march=native_-mtune=native_-O_-fomit-frame-pointer_-fwrapv_-fPIC_-fPIE2021011420210114
577812463 0 022779 788 920T:sse41gcc_-march=native_-mtune=native_-Os_-fomit-frame-pointer_-fwrapv_-fPIC_-fPIE2021011420210114
580822347 0 032699 788 920T:avx2gcc_-march=native_-mtune=native_-Os_-fomit-frame-pointer_-fwrapv_-fPIC_-fPIE2021011420210114
789512352 0 025952 812 952T:portablegcc_-march=native_-mtune=native_-O3_-fomit-frame-pointer_-fwrapv_-fPIC_-fPIE2021011420210114
811210614 0 021967 804 952T:portablegcc_-march=native_-mtune=native_-O2_-fomit-frame-pointer_-fwrapv_-fPIC_-fPIE2021011420210114
828710104 0 023084 804 888T:portableclang_-mcpu=native_-O3_-fomit-frame-pointer_-fwrapv_-Qunused-arguments_-fPIC_-fPIE2021011420210114
850810136 0 020411 788 920T:portablegcc_-march=native_-mtune=native_-Os_-fomit-frame-pointer_-fwrapv_-fPIC_-fPIE2021011420210114
851810058 0 019898 796 888T:portableclang_-march=native_-Os_-fomit-frame-pointer_-fwrapv_-Qunused-arguments_-fPIC_-fPIE2021011420210114
857810917 0 023628 804 920T:portableclang_-march=native_-O_-fomit-frame-pointer_-fwrapv_-Qunused-arguments_-fPIC_-fPIE2021011420210114
860310917 0 023628 804 920T:portableclang_-march=native_-O2_-fomit-frame-pointer_-fwrapv_-Qunused-arguments_-fPIC_-fPIE2021011420210114
861010933 0 023708 804 920T:portableclang_-march=native_-O3_-fomit-frame-pointer_-fwrapv_-Qunused-arguments_-fPIC_-fPIE2021011420210114
914111922 0 023055 804 952T:portablegcc_-march=native_-mtune=native_-O_-fomit-frame-pointer_-fwrapv_-fPIC_-fPIE2021011420210114

Test failure

Implementation: T:avx512
Security model: timingleaks
Compiler: gcc -march=native -mtune=native -O2 -fomit-frame-pointer -fwrapv -fPIC -fPIE
error 111

Number of similar (compiler,implementation) pairs: 4, namely:
CompilerImplementations
gcc -march=native -mtune=native -O2 -fomit-frame-pointer -fwrapv -fPIC -fPIE T:avx512
gcc -march=native -mtune=native -O3 -fomit-frame-pointer -fwrapv -fPIC -fPIE T:avx512
gcc -march=native -mtune=native -O -fomit-frame-pointer -fwrapv -fPIC -fPIE T:avx512
gcc -march=native -mtune=native -Os -fomit-frame-pointer -fwrapv -fPIC -fPIE T:avx512

Compiler output

Implementation: T:avx512
Security model: timingleaks
Compiler: clang -march=native -O2 -fomit-frame-pointer -fwrapv -Qunused-arguments -fPIC -fPIE
blake3_avx512_x86-64_unix.S: blake3_avx512_x86-64_unix.S:28:9: error: instruction requires: AVX-512 ISA
blake3_avx512_x86-64_unix.S: kmovw k1, r9d
blake3_avx512_x86-64_unix.S: ^
blake3_avx512_x86-64_unix.S: blake3_avx512_x86-64_unix.S:38:9: error: instruction requires: AVX-512 ISA AVX-512 VL ISA
blake3_avx512_x86-64_unix.S: vpcmpltud k2, ymm2, ymm0
blake3_avx512_x86-64_unix.S: ^
blake3_avx512_x86-64_unix.S: blake3_avx512_x86-64_unix.S:39:9: error: instruction requires: AVX-512 ISA AVX-512 VL ISA
blake3_avx512_x86-64_unix.S: vpcmpltud k3, ymm3, ymm0
blake3_avx512_x86-64_unix.S: ^
blake3_avx512_x86-64_unix.S: blake3_avx512_x86-64_unix.S:40:21: error: unexpected token in argument list
blake3_avx512_x86-64_unix.S: vpaddd ymm4 {k2}, ymm4, dword ptr [ADD1+rip] {1to8}
blake3_avx512_x86-64_unix.S: ^
blake3_avx512_x86-64_unix.S: blake3_avx512_x86-64_unix.S:41:21: error: unexpected token in argument list
blake3_avx512_x86-64_unix.S: vpaddd ymm5 {k3}, ymm5, dword ptr [ADD1+rip] {1to8}
blake3_avx512_x86-64_unix.S: ^
blake3_avx512_x86-64_unix.S: blake3_avx512_x86-64_unix.S:42:9: error: instruction requires: AVX-512 ISA
blake3_avx512_x86-64_unix.S: knotw k2, k1
blake3_avx512_x86-64_unix.S: ^
blake3_avx512_x86-64_unix.S: blake3_avx512_x86-64_unix.S:43:24: error: unexpected token in argument list
blake3_avx512_x86-64_unix.S: vmovdqa32 ymm2 {k2}, ymm0
blake3_avx512_x86-64_unix.S: ^
blake3_avx512_x86-64_unix.S: blake3_avx512_x86-64_unix.S:44:24: error: unexpected token in argument list
blake3_avx512_x86-64_unix.S: vmovdqa32 ymm3 {k2}, ymm0
blake3_avx512_x86-64_unix.S: ^
blake3_avx512_x86-64_unix.S: blake3_avx512_x86-64_unix.S:45:24: error: unexpected token in argument list
blake3_avx512_x86-64_unix.S: ...

Number of similar (compiler,implementation) pairs: 5, namely:
CompilerImplementations
clang -march=native -O2 -fomit-frame-pointer -fwrapv -Qunused-arguments -fPIC -fPIE T:avx512
clang -march=native -O3 -fomit-frame-pointer -fwrapv -Qunused-arguments -fPIC -fPIE T:avx512
clang -march=native -O -fomit-frame-pointer -fwrapv -Qunused-arguments -fPIC -fPIE T:avx512
clang -march=native -Os -fomit-frame-pointer -fwrapv -Qunused-arguments -fPIC -fPIE T:avx512
clang -mcpu=native -O3 -fomit-frame-pointer -fwrapv -Qunused-arguments -fPIC -fPIE T:avx512

Compiler output

Implementation: T:neon
Security model: timingleaks
Compiler: clang -march=native -O2 -fomit-frame-pointer -fwrapv -Qunused-arguments -fPIC -fPIE
blake3.c: In file included from blake3.c:12:
blake3.c: ./blake3_static_dispatch.h:17:9: warning: 'MAX_SIMD_DEGREE' macro redefined [-Wmacro-redefined]
blake3.c: #define MAX_SIMD_DEGREE 4
blake3.c: ^
blake3.c: ./blake3_impl.h:49:9: note: previous definition is here
blake3.c: #define MAX_SIMD_DEGREE 16
blake3.c: ^
blake3.c: In file included from blake3.c:12:
blake3.c: ./blake3_static_dispatch.h:18:9: warning: 'MAX_SIMD_DEGREE_OR_2' macro redefined [-Wmacro-redefined]
blake3.c: #define MAX_SIMD_DEGREE_OR_2 4
blake3.c: ^
blake3.c: ./blake3_impl.h:58:9: note: previous definition is here
blake3.c: #define MAX_SIMD_DEGREE_OR_2 (MAX_SIMD_DEGREE > 2 ? MAX_SIMD_DEGREE : 2)
blake3.c: ^
blake3.c: 2 warnings generated.
blake3_neon.c: In file included from blake3_neon.c:3:
blake3_neon.c: /usr/lib/llvm-6.0/lib/clang/6.0.0/include/arm_neon.h:28:2: error: "NEON support not enabled"
blake3_neon.c: #error "NEON support not enabled"
blake3_neon.c: ^
blake3_neon.c: /usr/lib/llvm-6.0/lib/clang/6.0.0/include/arm_neon.h:48:24: error: 'neon_vector_type' attribute is not supported for this target
blake3_neon.c: typedef __attribute__((neon_vector_type(8))) int8_t int8x8_t;
blake3_neon.c: ^
blake3_neon.c: /usr/lib/llvm-6.0/lib/clang/6.0.0/include/arm_neon.h:49:24: error: 'neon_vector_type' attribute is not supported for this target
blake3_neon.c: typedef __attribute__((neon_vector_type(16))) int8_t int8x16_t;
blake3_neon.c: ^
blake3_neon.c: /usr/lib/llvm-6.0/lib/clang/6.0.0/include/arm_neon.h:50:24: error: 'neon_vector_type' attribute is not supported for this target
blake3_neon.c: typedef __attribute__((neon_vector_type(4))) int16_t int16x4_t;
blake3_neon.c: ^
blake3_neon.c: /usr/lib/llvm-6.0/lib/clang/6.0.0/include/arm_neon.h:51:24: error: 'neon_vector_type' attribute is not supported for this target
blake3_neon.c: typedef __attribute__((neon_vector_type(8))) int16_t int16x8_t;
blake3_neon.c: ^
blake3_neon.c: /usr/lib/llvm-6.0/lib/clang/6.0.0/include/arm_neon.h:52:24: error: 'neon_vector_type' attribute is not supported for this target
blake3_neon.c: typedef __attribute__((neon_vector_type(2))) int32_t int32x2_t;
blake3_neon.c: ^
blake3_neon.c: /usr/lib/llvm-6.0/lib/clang/6.0.0/include/arm_neon.h:53:24: error: 'neon_vector_type' attribute is not supported for this target
blake3_neon.c: typedef __attribute__((neon_vector_type(4))) int32_t int32x4_t;
blake3_neon.c: ^
blake3_neon.c: /usr/lib/llvm-6.0/lib/clang/6.0.0/include/arm_neon.h:54:24: error: 'neon_vector_type' attribute is not supported for this target
blake3_neon.c: typedef __attribute__((neon_vector_type(1))) int64_t int64x1_t;
blake3_neon.c: ^
blake3_neon.c: ...

Number of similar (compiler,implementation) pairs: 5, namely:
CompilerImplementations
clang -march=native -O2 -fomit-frame-pointer -fwrapv -Qunused-arguments -fPIC -fPIE T:neon
clang -march=native -O3 -fomit-frame-pointer -fwrapv -Qunused-arguments -fPIC -fPIE T:neon
clang -march=native -O -fomit-frame-pointer -fwrapv -Qunused-arguments -fPIC -fPIE T:neon
clang -march=native -Os -fomit-frame-pointer -fwrapv -Qunused-arguments -fPIC -fPIE T:neon
clang -mcpu=native -O3 -fomit-frame-pointer -fwrapv -Qunused-arguments -fPIC -fPIE T:neon

Compiler output

Implementation: T:neon
Security model: timingleaks
Compiler: gcc -march=native -mtune=native -O2 -fomit-frame-pointer -fwrapv -fPIC -fPIE
blake3.c: In file included from blake3.c:12:0:
blake3.c: blake3_static_dispatch.h:17:0: warning: "MAX_SIMD_DEGREE" redefined
blake3.c: #define MAX_SIMD_DEGREE 4
blake3.c:
blake3.c: In file included from blake3.c:6:0:
blake3.c: blake3_impl.h:49:0: note: this is the location of the previous definition
blake3.c: #define MAX_SIMD_DEGREE 16
blake3.c:
blake3.c: In file included from blake3.c:12:0:
blake3.c: blake3_static_dispatch.h:18:0: warning: "MAX_SIMD_DEGREE_OR_2" redefined
blake3.c: #define MAX_SIMD_DEGREE_OR_2 4
blake3.c:
blake3.c: In file included from blake3.c:6:0:
blake3.c: blake3_impl.h:58:0: note: this is the location of the previous definition
blake3.c: #define MAX_SIMD_DEGREE_OR_2 (MAX_SIMD_DEGREE > 2 ? MAX_SIMD_DEGREE : 2)
blake3.c:
blake3_neon.c: blake3_neon.c:3:10: fatal error: arm_neon.h: No such file or directory
blake3_neon.c: #include <arm_neon.h>
blake3_neon.c: ^~~~~~~~~~~~
blake3_neon.c: compilation terminated.

Number of similar (compiler,implementation) pairs: 4, namely:
CompilerImplementations
gcc -march=native -mtune=native -O2 -fomit-frame-pointer -fwrapv -fPIC -fPIE T:neon
gcc -march=native -mtune=native -O3 -fomit-frame-pointer -fwrapv -fPIC -fPIE T:neon
gcc -march=native -mtune=native -O -fomit-frame-pointer -fwrapv -fPIC -fPIE T:neon
gcc -march=native -mtune=native -Os -fomit-frame-pointer -fwrapv -fPIC -fPIE T:neon

Namespace violations

Implementation: T:avx2
Security model: timingleaks
Compiler: clang -march=native -O2 -fomit-frame-pointer -fwrapv -Qunused-arguments -fPIC -fPIE
blake3.o blake3_compress_subtree_wide T
blake3.o blake3_default_hash T
blake3_avx2_x86-64_unix.o _blake3_hash_many_avx2 T
blake3_avx2_x86-64_unix.o blake3_hash_many_avx2 T
blake3_sse41_x86-64_unix.o _blake3_compress_in_place_sse41 T
blake3_sse41_x86-64_unix.o _blake3_compress_xof_sse41 T
blake3_sse41_x86-64_unix.o _blake3_hash_many_sse41 T
blake3_sse41_x86-64_unix.o blake3_compress_in_place_sse41 T
blake3_sse41_x86-64_unix.o blake3_compress_xof_sse41 T
blake3_sse41_x86-64_unix.o blake3_hash_many_sse41 T

Number of similar (compiler,implementation) pairs: 9, namely:
CompilerImplementations
clang -march=native -O2 -fomit-frame-pointer -fwrapv -Qunused-arguments -fPIC -fPIE T:avx2
clang -march=native -O3 -fomit-frame-pointer -fwrapv -Qunused-arguments -fPIC -fPIE T:avx2
clang -march=native -O -fomit-frame-pointer -fwrapv -Qunused-arguments -fPIC -fPIE T:avx2
clang -march=native -Os -fomit-frame-pointer -fwrapv -Qunused-arguments -fPIC -fPIE T:avx2
clang -mcpu=native -O3 -fomit-frame-pointer -fwrapv -Qunused-arguments -fPIC -fPIE T:avx2
gcc -march=native -mtune=native -O2 -fomit-frame-pointer -fwrapv -fPIC -fPIE T:avx2
gcc -march=native -mtune=native -O3 -fomit-frame-pointer -fwrapv -fPIC -fPIE T:avx2
gcc -march=native -mtune=native -O -fomit-frame-pointer -fwrapv -fPIC -fPIE T:avx2
gcc -march=native -mtune=native -Os -fomit-frame-pointer -fwrapv -fPIC -fPIE T:avx2

Namespace violations

Implementation: T:portable
Security model: timingleaks
Compiler: clang -march=native -O2 -fomit-frame-pointer -fwrapv -Qunused-arguments -fPIC -fPIE
blake3.o blake3_compress_subtree_wide T
blake3.o blake3_default_hash T
blake3_portable.o blake3_compress_in_place_portable T
blake3_portable.o blake3_compress_xof_portable T
blake3_portable.o blake3_hash_many_portable T

Number of similar (compiler,implementation) pairs: 9, namely:
CompilerImplementations
clang -march=native -O2 -fomit-frame-pointer -fwrapv -Qunused-arguments -fPIC -fPIE T:portable
clang -march=native -O3 -fomit-frame-pointer -fwrapv -Qunused-arguments -fPIC -fPIE T:portable
clang -march=native -O -fomit-frame-pointer -fwrapv -Qunused-arguments -fPIC -fPIE T:portable
clang -march=native -Os -fomit-frame-pointer -fwrapv -Qunused-arguments -fPIC -fPIE T:portable
clang -mcpu=native -O3 -fomit-frame-pointer -fwrapv -Qunused-arguments -fPIC -fPIE T:portable
gcc -march=native -mtune=native -O2 -fomit-frame-pointer -fwrapv -fPIC -fPIE T:portable
gcc -march=native -mtune=native -O3 -fomit-frame-pointer -fwrapv -fPIC -fPIE T:portable
gcc -march=native -mtune=native -O -fomit-frame-pointer -fwrapv -fPIC -fPIE T:portable
gcc -march=native -mtune=native -Os -fomit-frame-pointer -fwrapv -fPIC -fPIE T:portable

Namespace violations

Implementation: T:sse41
Security model: timingleaks
Compiler: clang -march=native -O2 -fomit-frame-pointer -fwrapv -Qunused-arguments -fPIC -fPIE
blake3.o blake3_compress_subtree_wide T
blake3.o blake3_default_hash T
blake3_sse41_x86-64_unix.o _blake3_compress_in_place_sse41 T
blake3_sse41_x86-64_unix.o _blake3_compress_xof_sse41 T
blake3_sse41_x86-64_unix.o _blake3_hash_many_sse41 T
blake3_sse41_x86-64_unix.o blake3_compress_in_place_sse41 T
blake3_sse41_x86-64_unix.o blake3_compress_xof_sse41 T
blake3_sse41_x86-64_unix.o blake3_hash_many_sse41 T

Number of similar (compiler,implementation) pairs: 9, namely:
CompilerImplementations
clang -march=native -O2 -fomit-frame-pointer -fwrapv -Qunused-arguments -fPIC -fPIE T:sse41
clang -march=native -O3 -fomit-frame-pointer -fwrapv -Qunused-arguments -fPIC -fPIE T:sse41
clang -march=native -O -fomit-frame-pointer -fwrapv -Qunused-arguments -fPIC -fPIE T:sse41
clang -march=native -Os -fomit-frame-pointer -fwrapv -Qunused-arguments -fPIC -fPIE T:sse41
clang -mcpu=native -O3 -fomit-frame-pointer -fwrapv -Qunused-arguments -fPIC -fPIE T:sse41
gcc -march=native -mtune=native -O2 -fomit-frame-pointer -fwrapv -fPIC -fPIE T:sse41
gcc -march=native -mtune=native -O3 -fomit-frame-pointer -fwrapv -fPIC -fPIE T:sse41
gcc -march=native -mtune=native -O -fomit-frame-pointer -fwrapv -fPIC -fPIE T:sse41
gcc -march=native -mtune=native -Os -fomit-frame-pointer -fwrapv -fPIC -fPIE T:sse41