Implementation notes: amd64, rumba3, crypto_hash/echo256

Computer: rumba3
Architecture: amd64
CPU ID: AuthenticAMD-00800f11-178bfbff
SUPERCOP version: 20200906
Operation: crypto_hash
Primitive: echo256
TimeObject sizeTest sizeImplementationCompilerBenchmark dateSUPERCOP version
60146956 0 017886 776 808T:ccalik/aesnigcc_-march=native_-mtune=native_-O2_-fomit-frame-pointer_-fwrapv_-fPIC_-fPIE2020082920200826
607610657 0 023774 776 808T:ccalik/aesnigcc_-march=native_-mtune=native_-O3_-fomit-frame-pointer_-fwrapv_-fPIC_-fPIE2020082920200826
62626398 0 017110 776 808T:ccalik/aesnigcc_-march=native_-mtune=native_-O_-fomit-frame-pointer_-fwrapv_-fPIC_-fPIE2020082920200826
63557351 0 019729 776 752T:ccalik/aesniclang_-march=native_-O_-fomit-frame-pointer_-fwrapv_-Qunused-arguments_-fPIC_-fPIE2020082920200826
64176036 0 015495 768 736T:ccalik/aesniclang_-march=native_-Os_-fomit-frame-pointer_-fwrapv_-Qunused-arguments_-fPIC_-fPIE2020082920200826
65107351 0 019729 776 752T:ccalik/aesniclang_-march=native_-O2_-fomit-frame-pointer_-fwrapv_-Qunused-arguments_-fPIC_-fPIE2020082920200826
66347367 0 019777 776 752T:ccalik/aesniclang_-march=native_-O3_-fomit-frame-pointer_-fwrapv_-Qunused-arguments_-fPIC_-fPIE2020082920200826
80606507 0 016297 752 776T:ccalik/aesnigcc_-march=native_-mtune=native_-Os_-fomit-frame-pointer_-fwrapv_-fPIC_-fPIE2020082920200826
4315224299 0 036689 776 752T:ccalik/vpermclang_-march=native_-O_-fomit-frame-pointer_-fwrapv_-Qunused-arguments_-fPIC_-fPIE2020082920200826
4318324299 0 036689 776 752T:ccalik/vpermclang_-march=native_-O2_-fomit-frame-pointer_-fwrapv_-Qunused-arguments_-fPIC_-fPIE2020082920200826
4383424987 0 037409 776 752T:ccalik/vpermclang_-march=native_-O3_-fomit-frame-pointer_-fwrapv_-Qunused-arguments_-fPIC_-fPIE2020082920200826
4386522275 0 031727 768 736T:ccalik/vpermclang_-march=native_-Os_-fomit-frame-pointer_-fwrapv_-Qunused-arguments_-fPIC_-fPIE2020082920200826
4395832371 0 045582 776 808T:sphlibgcc_-march=native_-mtune=native_-O3_-fomit-frame-pointer_-fwrapv_-fPIC_-fPIE2020082920200826
4439229160 0 040222 776 808T:sphlibgcc_-march=native_-mtune=native_-O2_-fomit-frame-pointer_-fwrapv_-fPIC_-fPIE2020082920200826
4507427496 0 037409 752 776T:sphlibgcc_-march=native_-mtune=native_-Os_-fomit-frame-pointer_-fwrapv_-fPIC_-fPIE2020082920200826
4526026692 0 039838 776 816T:generic/opt64gcc_-march=native_-mtune=native_-O3_-fomit-frame-pointer_-fwrapv_-fPIC_-fPIE2020082920200826
4529128860 0 039710 776 808T:sphlibgcc_-march=native_-mtune=native_-O_-fomit-frame-pointer_-fwrapv_-fPIC_-fPIE2020082920200826
4572521196 0 032174 776 816T:generic/opt64gcc_-march=native_-mtune=native_-O2_-fomit-frame-pointer_-fwrapv_-fPIC_-fPIE2020082920200826
4578717467 0 030686 776 808T:sphlib-smallgcc_-march=native_-mtune=native_-O3_-fomit-frame-pointer_-fwrapv_-fPIC_-fPIE2020082920200826
4665520745 0 031494 776 816T:generic/opt64gcc_-march=native_-mtune=native_-O_-fomit-frame-pointer_-fwrapv_-fPIC_-fPIE2020082920200826
4705829440 0 042161 776 736T:sphlibclang_-mcpu=native_-O3_-fomit-frame-pointer_-fwrapv_-Qunused-arguments_-fPIC_-fPIE2020082920200826
4743020642 0 030465 752 784T:generic/opt64gcc_-march=native_-mtune=native_-Os_-fomit-frame-pointer_-fwrapv_-fPIC_-fPIE2020082920200826
4780226353 0 039470 776 808T:ccalik/vpermgcc_-march=native_-mtune=native_-O3_-fomit-frame-pointer_-fwrapv_-fPIC_-fPIE2020082920200826
4789521500 0 032430 776 808T:ccalik/vpermgcc_-march=native_-mtune=native_-O2_-fomit-frame-pointer_-fwrapv_-fPIC_-fPIE2020082920200826
4795719530 0 029321 752 776T:ccalik/vpermgcc_-march=native_-mtune=native_-Os_-fomit-frame-pointer_-fwrapv_-fPIC_-fPIE2020082920200826
4801930670 0 043105 776 752T:sphlibclang_-march=native_-O2_-fomit-frame-pointer_-fwrapv_-Qunused-arguments_-fPIC_-fPIE2020082920200826
4805029997 0 042481 776 752T:sphlibclang_-march=native_-O3_-fomit-frame-pointer_-fwrapv_-Qunused-arguments_-fPIC_-fPIE2020082920200826
4814330670 0 043105 776 752T:sphlibclang_-march=native_-O_-fomit-frame-pointer_-fwrapv_-Qunused-arguments_-fPIC_-fPIE2020082920200826
4851520989 0 031702 776 808T:ccalik/vpermgcc_-march=native_-mtune=native_-O_-fomit-frame-pointer_-fwrapv_-fPIC_-fPIE2020082920200826
4922813631 0 026377 776 736T:sphlib-smallclang_-mcpu=native_-O3_-fomit-frame-pointer_-fwrapv_-Qunused-arguments_-fPIC_-fPIE2020082920200826
4994129653 0 039191 768 736T:sphlibclang_-march=native_-Os_-fomit-frame-pointer_-fwrapv_-Qunused-arguments_-fPIC_-fPIE2020082920200826
5087110768 0 021846 776 808T:sphlib-smallgcc_-march=native_-mtune=native_-O2_-fomit-frame-pointer_-fwrapv_-fPIC_-fPIE2020082920200826
5161510606 0 021462 776 808T:sphlib-smallgcc_-march=native_-mtune=native_-O_-fomit-frame-pointer_-fwrapv_-fPIC_-fPIE2020082920200826
5170816267 0 028657 776 752T:ccalik/bitslicedclang_-march=native_-O2_-fomit-frame-pointer_-fwrapv_-Qunused-arguments_-fPIC_-fPIE2020082920200826
5170816267 0 028657 776 752T:ccalik/bitslicedclang_-march=native_-O_-fomit-frame-pointer_-fwrapv_-Qunused-arguments_-fPIC_-fPIE2020082920200826
5214216299 0 028721 776 752T:ccalik/bitslicedclang_-march=native_-O3_-fomit-frame-pointer_-fwrapv_-Qunused-arguments_-fPIC_-fPIE2020082920200826
5288612403 0 024905 776 752T:sphlib-smallclang_-march=native_-O2_-fomit-frame-pointer_-fwrapv_-Qunused-arguments_-fPIC_-fPIE2020082920200826
5288612403 0 024905 776 752T:sphlib-smallclang_-march=native_-O_-fomit-frame-pointer_-fwrapv_-Qunused-arguments_-fPIC_-fPIE2020082920200826
5313419668 0 030725 784 824T:generic/opt32gcc_-march=native_-mtune=native_-O2_-fomit-frame-pointer_-fwrapv_-fPIC_-fPIE2020082920200826
5313412688 0 025225 776 752T:sphlib-smallclang_-march=native_-O3_-fomit-frame-pointer_-fwrapv_-Qunused-arguments_-fPIC_-fPIE2020082920200826
5319623828 0 037037 784 824T:generic/opt32gcc_-march=native_-mtune=native_-O3_-fomit-frame-pointer_-fwrapv_-fPIC_-fPIE2020082920200826
5325815137 0 024591 768 736T:ccalik/bitslicedclang_-march=native_-Os_-fomit-frame-pointer_-fwrapv_-Qunused-arguments_-fPIC_-fPIE2020082920200826
538169643 0 019577 752 776T:sphlib-smallgcc_-march=native_-mtune=native_-Os_-fomit-frame-pointer_-fwrapv_-fPIC_-fPIE2020082920200826
5477719016 0 029845 784 824T:generic/opt32gcc_-march=native_-mtune=native_-O_-fomit-frame-pointer_-fwrapv_-fPIC_-fPIE2020082920200826
5480818585 0 028480 760 792T:generic/opt32gcc_-march=native_-mtune=native_-Os_-fomit-frame-pointer_-fwrapv_-fPIC_-fPIE2020082920200826
5769119329 0 032446 776 808T:ccalik/bitslicedgcc_-march=native_-mtune=native_-O3_-fomit-frame-pointer_-fwrapv_-fPIC_-fPIE2020082920200826
5781516108 0 027038 776 808T:ccalik/bitslicedgcc_-march=native_-mtune=native_-O2_-fomit-frame-pointer_-fwrapv_-fPIC_-fPIE2020082920200826
5843515965 0 026678 776 808T:ccalik/bitslicedgcc_-march=native_-mtune=native_-O_-fomit-frame-pointer_-fwrapv_-fPIC_-fPIE2020082920200826
589319022 0 018599 768 736T:sphlib-smallclang_-march=native_-Os_-fomit-frame-pointer_-fwrapv_-Qunused-arguments_-fPIC_-fPIE2020082920200826
6113222681 0 035353 776 752T:generic/opt32clang_-mcpu=native_-O3_-fomit-frame-pointer_-fwrapv_-Qunused-arguments_-fPIC_-fPIE2020082920200826
6215520356 0 032761 776 768T:generic/opt32clang_-march=native_-O2_-fomit-frame-pointer_-fwrapv_-Qunused-arguments_-fPIC_-fPIE2020082920200826
6234120356 0 032761 776 768T:generic/opt32clang_-march=native_-O_-fomit-frame-pointer_-fwrapv_-Qunused-arguments_-fPIC_-fPIE2020082920200826
6240320381 0 029527 768 752T:generic/opt32clang_-march=native_-Os_-fomit-frame-pointer_-fwrapv_-Qunused-arguments_-fPIC_-fPIE2020082920200826
6246527021 0 036223 768 744T:generic/opt64clang_-march=native_-Os_-fomit-frame-pointer_-fwrapv_-Qunused-arguments_-fPIC_-fPIE2020082920200826
6255820441 0 032889 776 768T:generic/opt32clang_-march=native_-O3_-fomit-frame-pointer_-fwrapv_-Qunused-arguments_-fPIC_-fPIE2020082920200826
6342616168 0 025945 752 776T:ccalik/bitslicedgcc_-march=native_-mtune=native_-Os_-fomit-frame-pointer_-fwrapv_-fPIC_-fPIE2020082920200826
6404630731 0 043385 776 744T:generic/opt64clang_-mcpu=native_-O3_-fomit-frame-pointer_-fwrapv_-Qunused-arguments_-fPIC_-fPIE2020082920200826
6665025406 0 037809 776 760T:generic/opt64clang_-march=native_-O2_-fomit-frame-pointer_-fwrapv_-Qunused-arguments_-fPIC_-fPIE2020082920200826
6665025203 0 037633 776 760T:generic/opt64clang_-march=native_-O3_-fomit-frame-pointer_-fwrapv_-Qunused-arguments_-fPIC_-fPIE2020082920200826
6671225406 0 037809 776 760T:generic/opt64clang_-march=native_-O_-fomit-frame-pointer_-fwrapv_-Qunused-arguments_-fPIC_-fPIE2020082920200826
6727029801 0 042473 776 752T:powerpc/pp32cv2clang_-mcpu=native_-O3_-fomit-frame-pointer_-fwrapv_-Qunused-arguments_-fPIC_-fPIE2020082920200826
6872726836 0 039241 776 768T:powerpc/pp32cv2clang_-march=native_-O2_-fomit-frame-pointer_-fwrapv_-Qunused-arguments_-fPIC_-fPIE2020082920200826
6875826836 0 039241 776 768T:powerpc/pp32cv2clang_-march=native_-O_-fomit-frame-pointer_-fwrapv_-Qunused-arguments_-fPIC_-fPIE2020082920200826
6919226889 0 039337 776 768T:powerpc/pp32cv2clang_-march=native_-O3_-fomit-frame-pointer_-fwrapv_-Qunused-arguments_-fPIC_-fPIE2020082920200826
7663227002 0 036135 768 752T:powerpc/pp32cv2clang_-march=native_-Os_-fomit-frame-pointer_-fwrapv_-Qunused-arguments_-fPIC_-fPIE2020082920200826
7914325775 0 035680 760 792T:powerpc/pp32cv2gcc_-march=native_-mtune=native_-Os_-fomit-frame-pointer_-fwrapv_-fPIC_-fPIE2020082920200826
7929833268 0 046477 784 824T:powerpc/pp32cv2gcc_-march=native_-mtune=native_-O3_-fomit-frame-pointer_-fwrapv_-fPIC_-fPIE2020082920200826
8053821977 0 034649 776 752T:powerpc/pp32cv1clang_-mcpu=native_-O3_-fomit-frame-pointer_-fwrapv_-Qunused-arguments_-fPIC_-fPIE2020082920200826
8342129092 0 040149 784 824T:powerpc/pp32cv2gcc_-march=native_-mtune=native_-O2_-fomit-frame-pointer_-fwrapv_-fPIC_-fPIE2020082920200826
8701727912 0 038741 784 824T:powerpc/pp32cv2gcc_-march=native_-mtune=native_-O_-fomit-frame-pointer_-fwrapv_-fPIC_-fPIE2020082920200826
8707919140 0 031545 776 768T:powerpc/pp32cv1clang_-march=native_-O2_-fomit-frame-pointer_-fwrapv_-Qunused-arguments_-fPIC_-fPIE2020082920200826
8711019193 0 031641 776 768T:powerpc/pp32cv1clang_-march=native_-O3_-fomit-frame-pointer_-fwrapv_-Qunused-arguments_-fPIC_-fPIE2020082920200826
8711019140 0 031545 776 768T:powerpc/pp32cv1clang_-march=native_-O_-fomit-frame-pointer_-fwrapv_-Qunused-arguments_-fPIC_-fPIE2020082920200826
9117122356 0 035565 784 824T:powerpc/pp32cv1gcc_-march=native_-mtune=native_-O3_-fomit-frame-pointer_-fwrapv_-fPIC_-fPIE2020082920200826
9501519207 0 028343 768 752T:powerpc/pp32cv1clang_-march=native_-Os_-fomit-frame-pointer_-fwrapv_-Qunused-arguments_-fPIC_-fPIE2020082920200826
9594518212 0 029269 784 824T:powerpc/pp32cv1gcc_-march=native_-mtune=native_-O2_-fomit-frame-pointer_-fwrapv_-fPIC_-fPIE2020082920200826
10075017637 0 028469 784 824T:powerpc/pp32cv1gcc_-march=native_-mtune=native_-O_-fomit-frame-pointer_-fwrapv_-fPIC_-fPIE2020082920200826
10629916839 0 026736 760 792T:powerpc/pp32cv1gcc_-march=native_-mtune=native_-Os_-fomit-frame-pointer_-fwrapv_-fPIC_-fPIE2020082920200826

Compiler output

Implementation: T:aes/aes64
Security model: timingleaks
Compiler: clang -march=native -O2 -fomit-frame-pointer -fwrapv -Qunused-arguments -fPIC -fPIE
echo64.S: echo64.S:1040:2: error: '.att_syntax noprefix' is not supported: registers must have a '%' prefix in .att_syntax
echo64.S: .att_syntax noprefix
echo64.S: ^
echo64.S: echo64.S:1053:10: error: unknown token in expression
echo64.S: movabsq $-9187201950435737472, %rax
echo64.S: ^
echo64.S: echo64.S:1054:10: error: unknown token in expression
echo64.S: movabsq $-9187201950435737472, %r11
echo64.S: ^
echo64.S: echo64.S:1055:10: error: unknown token in expression
echo64.S: movabsq $7599940337074203, %r10
echo64.S: ^
echo64.S: echo64.S:1056:7: error: unknown token in expression
echo64.S: movq %rax, MEM_CST+16(%rip)
echo64.S: ^
echo64.S: echo64.S:1057:10: error: unknown token in expression
echo64.S: movabsq $7599940337074203, %r9
echo64.S: ^
echo64.S: echo64.S:1058:10: error: unknown token in expression
echo64.S: movabsq $-72340172838076674, %rax
echo64.S: ^
echo64.S: echo64.S:1059:10: error: unknown token in expression
echo64.S: movabsq $72340172838076673, %r8
echo64.S: ^
echo64.S: echo64.S:1060:10: error: unknown token in expression
echo64.S: ...

Number of similar (compiler,implementation) pairs: 5, namely:
CompilerImplementations
clang -march=native -O2 -fomit-frame-pointer -fwrapv -Qunused-arguments -fPIC -fPIE T:aes/aes64
clang -march=native -O3 -fomit-frame-pointer -fwrapv -Qunused-arguments -fPIC -fPIE T:aes/aes64
clang -march=native -O -fomit-frame-pointer -fwrapv -Qunused-arguments -fPIC -fPIE T:aes/aes64
clang -march=native -Os -fomit-frame-pointer -fwrapv -Qunused-arguments -fPIC -fPIE T:aes/aes64
clang -mcpu=native -O3 -fomit-frame-pointer -fwrapv -Qunused-arguments -fPIC -fPIE T:aes/aes64

Compiler output

Implementation: T:aes/aes64
Security model: timingleaks
Compiler: gcc -march=native -mtune=native -O2 -fomit-frame-pointer -fwrapv -fPIC -fPIE
try.c: /usr/bin/ld: crypto_hash_echo256.a(echo64.o): relocation R_X86_64_32S against undefined symbol `OLDCV' can not be used when making a PIE object; recompile with -fPIC
try.c: /usr/bin/ld: final link failed: Nonrepresentable section on output
try.c: collect2: error: ld returned 1 exit status

Number of similar (compiler,implementation) pairs: 4, namely:
CompilerImplementations
gcc -march=native -mtune=native -O2 -fomit-frame-pointer -fwrapv -fPIC -fPIE T:aes/aes64
gcc -march=native -mtune=native -O3 -fomit-frame-pointer -fwrapv -fPIC -fPIE T:aes/aes64
gcc -march=native -mtune=native -O -fomit-frame-pointer -fwrapv -fPIC -fPIE T:aes/aes64
gcc -march=native -mtune=native -Os -fomit-frame-pointer -fwrapv -fPIC -fPIE T:aes/aes64

Compiler output

Implementation: T:athlon/athlon64
Security model: timingleaks
Compiler: clang -march=native -O2 -fomit-frame-pointer -fwrapv -Qunused-arguments -fPIC -fPIE
echo64.S: echo64.S:224:2: error: invalid instruction mnemonic 'movzbl'
echo64.S: movzbl ebp, ah
echo64.S: ^~~~~~
echo64.S: echo64.S:227:2: error: invalid instruction mnemonic 'movzbl'
echo64.S: movzbl esi, al
echo64.S: ^~~~~~
echo64.S: echo64.S:239:2: error: invalid instruction mnemonic 'movzbl'
echo64.S: movzbl ebp, bl
echo64.S: ^~~~~~
echo64.S: echo64.S:242:2: error: invalid instruction mnemonic 'movzbl'
echo64.S: movzbl esi, bh
echo64.S: ^~~~~~
echo64.S: echo64.S:254:2: error: invalid instruction mnemonic 'movzbl'
echo64.S: movzbl ebp, al
echo64.S: ^~~~~~
echo64.S: echo64.S:257:2: error: invalid instruction mnemonic 'movzbl'
echo64.S: movzbl esi, ah
echo64.S: ^~~~~~
echo64.S: echo64.S:269:2: error: invalid instruction mnemonic 'movzbl'
echo64.S: movzbl ebp, bh
echo64.S: ^~~~~~
echo64.S: echo64.S:272:2: error: invalid instruction mnemonic 'movzbl'
echo64.S: movzbl esi, bl
echo64.S: ^~~~~~
echo64.S: echo64.S:284:2: error: invalid instruction mnemonic 'movzbl'
echo64.S: ...

Number of similar (compiler,implementation) pairs: 5, namely:
CompilerImplementations
clang -march=native -O2 -fomit-frame-pointer -fwrapv -Qunused-arguments -fPIC -fPIE T:athlon/athlon64
clang -march=native -O3 -fomit-frame-pointer -fwrapv -Qunused-arguments -fPIC -fPIE T:athlon/athlon64
clang -march=native -O -fomit-frame-pointer -fwrapv -Qunused-arguments -fPIC -fPIE T:athlon/athlon64
clang -march=native -Os -fomit-frame-pointer -fwrapv -Qunused-arguments -fPIC -fPIE T:athlon/athlon64
clang -mcpu=native -O3 -fomit-frame-pointer -fwrapv -Qunused-arguments -fPIC -fPIE T:athlon/athlon64

Compiler output

Implementation: T:athlon/athlon64
Security model: timingleaks
Compiler: gcc -march=native -mtune=native -O2 -fomit-frame-pointer -fwrapv -fPIC -fPIE
echo64.S: echo64.c: Assembler messages:
echo64.S: echo64.c:519: Error: no such instruction: `movzbl ebp,ah'
echo64.S: echo64.c:519: Error: no such instruction: `movzbl esi,al'
echo64.S: echo64.c:519: Error: no such instruction: `movzbl ebp,bl'
echo64.S: echo64.c:519: Error: no such instruction: `movzbl esi,bh'
echo64.S: echo64.c:519: Error: no such instruction: `movzbl ebp,al'
echo64.S: echo64.c:519: Error: no such instruction: `movzbl esi,ah'
echo64.S: echo64.c:519: Error: no such instruction: `movzbl ebp,bh'
echo64.S: echo64.c:519: Error: no such instruction: `movzbl esi,bl'
echo64.S: echo64.c:519: Error: no such instruction: `movzbl ebp,ah'
echo64.S: echo64.c:519: Error: no such instruction: `movzbl esi,al'
echo64.S: echo64.c:519: Error: no such instruction: `movzbl ebp,bl'
echo64.S: echo64.c:519: Error: no such instruction: `movzbl esi,bh'
echo64.S: echo64.c:519: Error: no such instruction: `movzbl ebp,al'
echo64.S: echo64.c:519: Error: no such instruction: `movzbl esi,ah'
echo64.S: echo64.c:519: Error: no such instruction: `movzbl ebp,bl'
echo64.S: echo64.c:519: Error: no such instruction: `movzbl esi,bh'
echo64.S: echo64.c:519: Error: no such instruction: `movzbl ebp,dl'
echo64.S: echo64.c:519: Error: no such instruction: `movzbl esi,dh'
echo64.S: echo64.c:519: Error: no such instruction: `movzbl ebp,ch'
echo64.S: echo64.c:519: Error: no such instruction: `movzbl esi,cl'
echo64.S: echo64.c:519: Error: no such instruction: `movzbl ebp,cl'
echo64.S: echo64.c:519: Error: no such instruction: `movzbl esi,ch'
echo64.S: echo64.c:519: Error: no such instruction: `movzbl ebp,dh'
echo64.S: echo64.c:519: Error: no such instruction: `movzbl esi,dl'
echo64.S: ...

Number of similar (compiler,implementation) pairs: 4, namely:
CompilerImplementations
gcc -march=native -mtune=native -O2 -fomit-frame-pointer -fwrapv -fPIC -fPIE T:athlon/athlon64
gcc -march=native -mtune=native -O3 -fomit-frame-pointer -fwrapv -fPIC -fPIE T:athlon/athlon64
gcc -march=native -mtune=native -O -fomit-frame-pointer -fwrapv -fPIC -fPIE T:athlon/athlon64
gcc -march=native -mtune=native -Os -fomit-frame-pointer -fwrapv -fPIC -fPIE T:athlon/athlon64

Compiler output

Implementation: T:ccalik/aesni
Security model: timingleaks
Compiler: clang -mcpu=native -O3 -fomit-frame-pointer -fwrapv -Qunused-arguments -fPIC -fPIE
hash.c: hash.c:295:4: error: always_inline function '_mm_aesenc_si128' requires target feature 'aes', but would be inlined into function 'Compress' that is compiled without support for 'aes'
hash.c: ECHO_ROUND_UNROLL2;
hash.c: ^
hash.c: hash.c:185:4: note: expanded from macro 'ECHO_ROUND_UNROLL2'
hash.c: ECHO_SUBBYTES(_state, 0, 0);\
hash.c: ^
hash.c: hash.c:114:19: note: expanded from macro 'ECHO_SUBBYTES'
hash.c: state[i][j] = _mm_aesenc_si128(state[i][j], k1);\
hash.c: ^
hash.c: hash.c:295:4: error: always_inline function '_mm_aesenc_si128' requires target feature 'aes', but would be inlined into function 'Compress' that is compiled without support for 'aes'
hash.c: hash.c:185:4: note: expanded from macro 'ECHO_ROUND_UNROLL2'
hash.c: ECHO_SUBBYTES(_state, 0, 0);\
hash.c: ^
hash.c: hash.c:115:19: note: expanded from macro 'ECHO_SUBBYTES'
hash.c: state[i][j] = _mm_aesenc_si128(state[i][j], M128(zero));\
hash.c: ^
hash.c: hash.c:295:4: error: always_inline function '_mm_aesenc_si128' requires target feature 'aes', but would be inlined into function 'Compress' that is compiled without support for 'aes'
hash.c: hash.c:186:4: note: expanded from macro 'ECHO_ROUND_UNROLL2'
hash.c: ECHO_SUBBYTES(_state, 1, 0);\
hash.c: ^
hash.c: hash.c:114:19: note: expanded from macro 'ECHO_SUBBYTES'
hash.c: state[i][j] = _mm_aesenc_si128(state[i][j], k1);\
hash.c: ^
hash.c: hash.c:295:4: error: always_inline function '_mm_aesenc_si128' requires target feature 'aes', but would be inlined into function 'Compress' that is compiled without support for 'aes'
hash.c: hash.c:186:4: note: expanded from macro 'ECHO_ROUND_UNROLL2'
hash.c: ...

Number of similar (compiler,implementation) pairs: 1, namely:
CompilerImplementations
clang -mcpu=native -O3 -fomit-frame-pointer -fwrapv -Qunused-arguments -fPIC -fPIE T:ccalik/aesni

Compiler output

Implementation: T:ccalik/bitsliced
Security model: timingleaks
Compiler: clang -mcpu=native -O3 -fomit-frame-pointer -fwrapv -Qunused-arguments -fPIC -fPIE
hash.c: hash.c:467:4: error: always_inline function '_mm_shuffle_epi8' requires target feature 'ssse3', but would be inlined into function 'Compress' that is compiled without support for 'ssse3'
hash.c: AES_SHIFT_ROWS(_state);
hash.c: ^
hash.c: hash.c:140:14: note: expanded from macro 'AES_SHIFT_ROWS'
hash.c: s[0][0] = _mm_shuffle_epi8(s[0][0], M128(shiftrowsslice));\
hash.c: ^
hash.c: hash.c:467:4: error: always_inline function '_mm_shuffle_epi8' requires target feature 'ssse3', but would be inlined into function 'Compress' that is compiled without support for 'ssse3'
hash.c: hash.c:141:14: note: expanded from macro 'AES_SHIFT_ROWS'
hash.c: s[0][1] = _mm_shuffle_epi8(s[0][1], M128(shiftrowsslice));\
hash.c: ^
hash.c: hash.c:467:4: error: always_inline function '_mm_shuffle_epi8' requires target feature 'ssse3', but would be inlined into function 'Compress' that is compiled without support for 'ssse3'
hash.c: hash.c:142:14: note: expanded from macro 'AES_SHIFT_ROWS'
hash.c: s[0][2] = _mm_shuffle_epi8(s[0][2], M128(shiftrowsslice));\
hash.c: ^
hash.c: hash.c:467:4: error: always_inline function '_mm_shuffle_epi8' requires target feature 'ssse3', but would be inlined into function 'Compress' that is compiled without support for 'ssse3'
hash.c: hash.c:143:14: note: expanded from macro 'AES_SHIFT_ROWS'
hash.c: s[0][3] = _mm_shuffle_epi8(s[0][3], M128(shiftrowsslice));\
hash.c: ^
hash.c: hash.c:467:4: error: always_inline function '_mm_shuffle_epi8' requires target feature 'ssse3', but would be inlined into function 'Compress' that is compiled without support for 'ssse3'
hash.c: hash.c:144:14: note: expanded from macro 'AES_SHIFT_ROWS'
hash.c: s[1][0] = _mm_shuffle_epi8(s[1][0], M128(shiftrowsslice));\
hash.c: ^
hash.c: hash.c:467:4: error: always_inline function '_mm_shuffle_epi8' requires target feature 'ssse3', but would be inlined into function 'Compress' that is compiled without support for 'ssse3'
hash.c: hash.c:145:14: note: expanded from macro 'AES_SHIFT_ROWS'
hash.c: s[1][1] = _mm_shuffle_epi8(s[1][1], M128(shiftrowsslice));\
hash.c: ...

Number of similar (compiler,implementation) pairs: 1, namely:
CompilerImplementations
clang -mcpu=native -O3 -fomit-frame-pointer -fwrapv -Qunused-arguments -fPIC -fPIE T:ccalik/bitsliced

Compiler output

Implementation: T:ccalik/vperm
Security model: timingleaks
Compiler: clang -mcpu=native -O3 -fomit-frame-pointer -fwrapv -Qunused-arguments -fPIC -fPIE
hash.c: hash.c:264:4: error: always_inline function '_mm_shuffle_epi8' requires target feature 'ssse3', but would be inlined into function 'Compress' that is compiled without support for 'ssse3'
hash.c: TRANSFORM(_state[i][j], _k_ipt, t1, t2);
hash.c: ^
hash.c: ./vperm.h:52:7: note: expanded from macro 'TRANSFORM'
hash.c: t1 = _mm_shuffle_epi8(*((__m128i*)table + 1), t1);\
hash.c: ^
hash.c: hash.c:264:4: error: always_inline function '_mm_shuffle_epi8' requires target feature 'ssse3', but would be inlined into function 'Compress' that is compiled without support for 'ssse3'
hash.c: ./vperm.h:53:7: note: expanded from macro 'TRANSFORM'
hash.c: x = _mm_shuffle_epi8(*((__m128i*)table + 0), x);\
hash.c: ^
hash.c: hash.c:281:5: error: always_inline function '_mm_shuffle_epi8' requires target feature 'ssse3', but would be inlined into function 'Compress' that is compiled without support for 'ssse3'
hash.c: TRANSFORM(_state[i][j], _k_ipt, t1, t2);
hash.c: ^
hash.c: ./vperm.h:52:7: note: expanded from macro 'TRANSFORM'
hash.c: t1 = _mm_shuffle_epi8(*((__m128i*)table + 1), t1);\
hash.c: ^
hash.c: hash.c:281:5: error: always_inline function '_mm_shuffle_epi8' requires target feature 'ssse3', but would be inlined into function 'Compress' that is compiled without support for 'ssse3'
hash.c: ./vperm.h:53:7: note: expanded from macro 'TRANSFORM'
hash.c: x = _mm_shuffle_epi8(*((__m128i*)table + 0), x);\
hash.c: ^
hash.c: hash.c:306:4: error: always_inline function '_mm_shuffle_epi8' requires target feature 'ssse3', but would be inlined into function 'Compress' that is compiled without support for 'ssse3'
hash.c: ECHO_SUB_AND_MIX(_state, 0, 0, _state2, 0, 0, 1, 2, 3);
hash.c: ^
hash.c: hash.c:125:5: note: expanded from macro 'ECHO_SUB_AND_MIX'
hash.c: AES_ROUND_VPERM_CORE(state[i][j], t1, t2, t3, t4, s1, s2, s3);\
hash.c: ...

Number of similar (compiler,implementation) pairs: 1, namely:
CompilerImplementations
clang -mcpu=native -O3 -fomit-frame-pointer -fwrapv -Qunused-arguments -fPIC -fPIE T:ccalik/vperm

Compiler output

Implementation: T:core2/core2v64
Security model: timingleaks
Compiler: clang -march=native -O2 -fomit-frame-pointer -fwrapv -Qunused-arguments -fPIC -fPIE
echo64.S: echo64.S:212:2: error: invalid instruction mnemonic 'movzbl'
echo64.S: movzbl ebp, ah
echo64.S: ^~~~~~
echo64.S: echo64.S:218:2: error: invalid instruction mnemonic 'movzbl'
echo64.S: movzbl esi, al
echo64.S: ^~~~~~
echo64.S: echo64.S:227:2: error: invalid instruction mnemonic 'movzbl'
echo64.S: movzbl ebp, bl
echo64.S: ^~~~~~
echo64.S: echo64.S:233:2: error: invalid instruction mnemonic 'movzbl'
echo64.S: movzbl esi, bh
echo64.S: ^~~~~~
echo64.S: echo64.S:242:2: error: invalid instruction mnemonic 'movzbl'
echo64.S: movzbl ebp, al
echo64.S: ^~~~~~
echo64.S: echo64.S:248:2: error: invalid instruction mnemonic 'movzbl'
echo64.S: movzbl esi, ah
echo64.S: ^~~~~~
echo64.S: echo64.S:257:2: error: invalid instruction mnemonic 'movzbl'
echo64.S: movzbl ebp, bh
echo64.S: ^~~~~~
echo64.S: echo64.S:263:2: error: invalid instruction mnemonic 'movzbl'
echo64.S: movzbl esi, bl
echo64.S: ^~~~~~
echo64.S: echo64.S:272:2: error: invalid instruction mnemonic 'movzbl'
echo64.S: ...

Number of similar (compiler,implementation) pairs: 5, namely:
CompilerImplementations
clang -march=native -O2 -fomit-frame-pointer -fwrapv -Qunused-arguments -fPIC -fPIE T:core2/core2v64
clang -march=native -O3 -fomit-frame-pointer -fwrapv -Qunused-arguments -fPIC -fPIE T:core2/core2v64
clang -march=native -O -fomit-frame-pointer -fwrapv -Qunused-arguments -fPIC -fPIE T:core2/core2v64
clang -march=native -Os -fomit-frame-pointer -fwrapv -Qunused-arguments -fPIC -fPIE T:core2/core2v64
clang -mcpu=native -O3 -fomit-frame-pointer -fwrapv -Qunused-arguments -fPIC -fPIE T:core2/core2v64

Compiler output

Implementation: T:core2/core2v64
Security model: timingleaks
Compiler: gcc -march=native -mtune=native -O2 -fomit-frame-pointer -fwrapv -fPIC -fPIE
echo64.S: echo64.c: Assembler messages:
echo64.S: echo64.c:473: Error: no such instruction: `movzbl ebp,ah'
echo64.S: echo64.c:473: Error: no such instruction: `movzbl esi,al'
echo64.S: echo64.c:473: Error: no such instruction: `movzbl ebp,bl'
echo64.S: echo64.c:473: Error: no such instruction: `movzbl esi,bh'
echo64.S: echo64.c:473: Error: no such instruction: `movzbl ebp,al'
echo64.S: echo64.c:473: Error: no such instruction: `movzbl esi,ah'
echo64.S: echo64.c:473: Error: no such instruction: `movzbl ebp,bh'
echo64.S: echo64.c:473: Error: no such instruction: `movzbl esi,bl'
echo64.S: echo64.c:473: Error: no such instruction: `movzbl ebp,ah'
echo64.S: echo64.c:473: Error: no such instruction: `movzbl esi,al'
echo64.S: echo64.c:473: Error: no such instruction: `movzbl ebp,bl'
echo64.S: echo64.c:473: Error: no such instruction: `movzbl esi,bh'
echo64.S: echo64.c:473: Error: no such instruction: `movzbl ebp,al'
echo64.S: echo64.c:473: Error: no such instruction: `movzbl esi,ah'
echo64.S: echo64.c:473: Error: no such instruction: `movzbl ebp,bl'
echo64.S: echo64.c:473: Error: no such instruction: `movzbl esi,bh'
echo64.S: echo64.c:473: Error: no such instruction: `movzbl ebp,dl'
echo64.S: echo64.c:473: Error: no such instruction: `movzbl esi,dh'
echo64.S: echo64.c:473: Error: no such instruction: `movzbl ebp,ch'
echo64.S: echo64.c:473: Error: no such instruction: `movzbl esi,cl'
echo64.S: echo64.c:473: Error: no such instruction: `movzbl ebp,cl'
echo64.S: echo64.c:473: Error: no such instruction: `movzbl esi,ch'
echo64.S: echo64.c:473: Error: no such instruction: `movzbl ebp,dh'
echo64.S: echo64.c:473: Error: no such instruction: `movzbl esi,dl'
echo64.S: ...

Number of similar (compiler,implementation) pairs: 4, namely:
CompilerImplementations
gcc -march=native -mtune=native -O2 -fomit-frame-pointer -fwrapv -fPIC -fPIE T:core2/core2v64
gcc -march=native -mtune=native -O3 -fomit-frame-pointer -fwrapv -fPIC -fPIE T:core2/core2v64
gcc -march=native -mtune=native -O -fomit-frame-pointer -fwrapv -fPIC -fPIE T:core2/core2v64
gcc -march=native -mtune=native -Os -fomit-frame-pointer -fwrapv -fPIC -fPIE T:core2/core2v64

Compiler output

Implementation: T:generic/opt64
Security model: timingleaks
Compiler: clang -march=native -O2 -fomit-frame-pointer -fwrapv -Qunused-arguments -fPIC -fPIE
echo64.c: echo64.c:501:29: warning: passing 'const unsigned char *' to parameter of type 'BitSequence *' (aka 'unsigned char *') discards qualifiers [-Wincompatible-pointer-types-discards-qualifiers]
echo64.c: if (Hash(CRYPTO_BYTES * 8,in,inlen * 8,out) == SUCCESS) return 0;
echo64.c: ^~
echo64.c: echo64.c:488:46: note: passing argument to parameter 'data' here
echo64.c: HashReturn Hash(int hashbitlen, BitSequence *data, DataLength databitlen, BitSequence *hashval)
echo64.c: ^
echo64.c: 1 warning generated.

Number of similar (compiler,implementation) pairs: 5, namely:
CompilerImplementations
clang -march=native -O2 -fomit-frame-pointer -fwrapv -Qunused-arguments -fPIC -fPIE T:generic/opt64
clang -march=native -O3 -fomit-frame-pointer -fwrapv -Qunused-arguments -fPIC -fPIE T:generic/opt64
clang -march=native -O -fomit-frame-pointer -fwrapv -Qunused-arguments -fPIC -fPIE T:generic/opt64
clang -march=native -Os -fomit-frame-pointer -fwrapv -Qunused-arguments -fPIC -fPIE T:generic/opt64
clang -mcpu=native -O3 -fomit-frame-pointer -fwrapv -Qunused-arguments -fPIC -fPIE T:generic/opt64

Compiler output

Implementation: T:generic/opt64
Security model: timingleaks
Compiler: gcc -march=native -mtune=native -O2 -fomit-frame-pointer -fwrapv -fPIC -fPIE
echo64.c: echo64.c: In function 'crypto_hash_echo256_generic_opt64_timingleaks':
echo64.c: echo64.c:501:29: warning: passing argument 2 of 'Hash' discards 'const' qualifier from pointer target type [-Wdiscarded-qualifiers]
echo64.c: if (Hash(CRYPTO_BYTES * 8,in,inlen * 8,out) == SUCCESS) return 0;
echo64.c: ^~
echo64.c: echo64.c:488:12: note: expected 'BitSequence * {aka unsigned char *}' but argument is of type 'const unsigned char *'
echo64.c: HashReturn Hash(int hashbitlen, BitSequence *data, DataLength databitlen, BitSequence *hashval)
echo64.c: ^~~~

Number of similar (compiler,implementation) pairs: 4, namely:
CompilerImplementations
gcc -march=native -mtune=native -O2 -fomit-frame-pointer -fwrapv -fPIC -fPIE T:generic/opt64
gcc -march=native -mtune=native -O3 -fomit-frame-pointer -fwrapv -fPIC -fPIE T:generic/opt64
gcc -march=native -mtune=native -O -fomit-frame-pointer -fwrapv -fPIC -fPIE T:generic/opt64
gcc -march=native -mtune=native -Os -fomit-frame-pointer -fwrapv -fPIC -fPIE T:generic/opt64

Compiler output

Implementation: T:pentium/pentium4v64v1
Security model: timingleaks
Compiler: clang -march=native -O2 -fomit-frame-pointer -fwrapv -Qunused-arguments -fPIC -fPIE
echo32.S: echo32.S:311:2: error: invalid instruction mnemonic 'addd'
echo32.S: addd [SHA3_CNT], 1
echo32.S: ^~~~
echo32.S: echo32.S:575:2: error: invalid instruction mnemonic 'addd'
echo32.S: addd [SHA3_CNT], 1
echo32.S: ^~~~
echo32.S: echo32.S:839:2: error: invalid instruction mnemonic 'addd'
echo32.S: addd [SHA3_CNT], 1
echo32.S: ^~~~
echo32.S: echo32.S:1103:2: error: invalid instruction mnemonic 'addd'
echo32.S: addd [SHA3_CNT], 1
echo32.S: ^~~~
echo32.S: echo32.S:1367:2: error: invalid instruction mnemonic 'addd'
echo32.S: addd [SHA3_CNT], 1
echo32.S: ^~~~
echo32.S: echo32.S:1631:2: error: invalid instruction mnemonic 'addd'
echo32.S: addd [SHA3_CNT], 1
echo32.S: ^~~~
echo32.S: echo32.S:1895:2: error: invalid instruction mnemonic 'addd'
echo32.S: addd [SHA3_CNT], 1
echo32.S: ^~~~
echo32.S: echo32.S:2159:2: error: invalid instruction mnemonic 'addd'
echo32.S: addd [SHA3_CNT], 1
echo32.S: ^~~~
echo32.S: echo32.S:2423:2: error: invalid instruction mnemonic 'addd'
echo32.S: ...

Number of similar (compiler,implementation) pairs: 5, namely:
CompilerImplementations
clang -march=native -O2 -fomit-frame-pointer -fwrapv -Qunused-arguments -fPIC -fPIE T:pentium/pentium4v64v1
clang -march=native -O3 -fomit-frame-pointer -fwrapv -Qunused-arguments -fPIC -fPIE T:pentium/pentium4v64v1
clang -march=native -O -fomit-frame-pointer -fwrapv -Qunused-arguments -fPIC -fPIE T:pentium/pentium4v64v1
clang -march=native -Os -fomit-frame-pointer -fwrapv -Qunused-arguments -fPIC -fPIE T:pentium/pentium4v64v1
clang -mcpu=native -O3 -fomit-frame-pointer -fwrapv -Qunused-arguments -fPIC -fPIE T:pentium/pentium4v64v1

Compiler output

Implementation: T:pentium/pentium4v64v1
Security model: timingleaks
Compiler: gcc -march=native -mtune=native -O2 -fomit-frame-pointer -fwrapv -fPIC -fPIE
try.c: /usr/bin/ld: crypto_hash_echo256.a(echo32.o): relocation R_X86_64_32S against undefined symbol `SHA3_R' can not be used when making a PIE object; recompile with -fPIC
try.c: /usr/bin/ld: final link failed: Nonrepresentable section on output
try.c: collect2: error: ld returned 1 exit status

Number of similar (compiler,implementation) pairs: 4, namely:
CompilerImplementations
gcc -march=native -mtune=native -O2 -fomit-frame-pointer -fwrapv -fPIC -fPIE T:pentium/pentium4v64v1
gcc -march=native -mtune=native -O3 -fomit-frame-pointer -fwrapv -fPIC -fPIE T:pentium/pentium4v64v1
gcc -march=native -mtune=native -O -fomit-frame-pointer -fwrapv -fPIC -fPIE T:pentium/pentium4v64v1
gcc -march=native -mtune=native -Os -fomit-frame-pointer -fwrapv -fPIC -fPIE T:pentium/pentium4v64v1

Compiler output

Implementation: T:pentium/pentium4v64v2
Security model: timingleaks
Compiler: clang -march=native -O2 -fomit-frame-pointer -fwrapv -Qunused-arguments -fPIC -fPIE
echo64.S: echo64.S:371:2: error: invalid instruction mnemonic 'addd'
echo64.S: addd [SHA3_CNT], 1
echo64.S: ^~~~
echo64.S: echo64.S:635:2: error: invalid instruction mnemonic 'addd'
echo64.S: addd [SHA3_CNT], 1
echo64.S: ^~~~
echo64.S: echo64.S:899:2: error: invalid instruction mnemonic 'addd'
echo64.S: addd [SHA3_CNT], 1
echo64.S: ^~~~
echo64.S: echo64.S:1163:2: error: invalid instruction mnemonic 'addd'
echo64.S: addd [SHA3_CNT], 1
echo64.S: ^~~~
echo64.S: echo64.S:1427:2: error: invalid instruction mnemonic 'addd'
echo64.S: addd [SHA3_CNT], 1
echo64.S: ^~~~
echo64.S: echo64.S:1691:2: error: invalid instruction mnemonic 'addd'
echo64.S: addd [SHA3_CNT], 1
echo64.S: ^~~~
echo64.S: echo64.S:1955:2: error: invalid instruction mnemonic 'addd'
echo64.S: addd [SHA3_CNT], 1
echo64.S: ^~~~
echo64.S: echo64.S:2219:2: error: invalid instruction mnemonic 'addd'
echo64.S: addd [SHA3_CNT], 1
echo64.S: ^~~~
echo64.S: echo64.S:2483:2: error: invalid instruction mnemonic 'addd'
echo64.S: ...

Number of similar (compiler,implementation) pairs: 5, namely:
CompilerImplementations
clang -march=native -O2 -fomit-frame-pointer -fwrapv -Qunused-arguments -fPIC -fPIE T:pentium/pentium4v64v2
clang -march=native -O3 -fomit-frame-pointer -fwrapv -Qunused-arguments -fPIC -fPIE T:pentium/pentium4v64v2
clang -march=native -O -fomit-frame-pointer -fwrapv -Qunused-arguments -fPIC -fPIE T:pentium/pentium4v64v2
clang -march=native -Os -fomit-frame-pointer -fwrapv -Qunused-arguments -fPIC -fPIE T:pentium/pentium4v64v2
clang -mcpu=native -O3 -fomit-frame-pointer -fwrapv -Qunused-arguments -fPIC -fPIE T:pentium/pentium4v64v2

Compiler output

Implementation: T:pentium/pentium4v64v2
Security model: timingleaks
Compiler: gcc -march=native -mtune=native -O2 -fomit-frame-pointer -fwrapv -fPIC -fPIE
try.c: /usr/bin/ld: crypto_hash_echo256.a(echo64.o): relocation R_X86_64_32S against undefined symbol `SHA3_R' can not be used when making a PIE object; recompile with -fPIC
try.c: /usr/bin/ld: final link failed: Nonrepresentable section on output
try.c: collect2: error: ld returned 1 exit status

Number of similar (compiler,implementation) pairs: 4, namely:
CompilerImplementations
gcc -march=native -mtune=native -O2 -fomit-frame-pointer -fwrapv -fPIC -fPIE T:pentium/pentium4v64v2
gcc -march=native -mtune=native -O3 -fomit-frame-pointer -fwrapv -fPIC -fPIE T:pentium/pentium4v64v2
gcc -march=native -mtune=native -O -fomit-frame-pointer -fwrapv -fPIC -fPIE T:pentium/pentium4v64v2
gcc -march=native -mtune=native -Os -fomit-frame-pointer -fwrapv -fPIC -fPIE T:pentium/pentium4v64v2

Namespace violations

Implementation: T:ccalik/aesni
Security model: timingleaks
Compiler: clang -march=native -O2 -fomit-frame-pointer -fwrapv -Qunused-arguments -fPIC -fPIE
hash.o Compress T
hash.o Final T
hash.o Hash T
hash.o Init T
hash.o Update T
hash.o _k_aesmix1 R
hash.o _k_aesmix2 R
hash.o _k_aesmix3 R
hash.o _k_aesmix4 R
hash.o _k_h0e R
hash.o _k_h15 R
hash.o _k_h4e R
hash.o _k_h5b R
hash.o _k_h63 R
hash.o _k_hc6 R
hash.o _k_inv R
hash.o _k_ipt R
hash.o _k_opt R
hash.o _k_s0F R
hash.o _k_sb1 R
hash.o _k_sb2 R
hash.o _k_sb3 R
hash.o _k_sb4 R
hash.o _k_sb5 R
hash.o _k_sb7 R
hash.o _k_sbo R
hash.o const1 R
hash.o invshiftrows R
hash.o lsbmask R
hash.o mul2ipt R
hash.o mul2mask R
hash.o zero R

Number of similar (compiler,implementation) pairs: 16, namely:
CompilerImplementations
clang -march=native -O2 -fomit-frame-pointer -fwrapv -Qunused-arguments -fPIC -fPIE T:ccalik/aesni
clang -march=native -O3 -fomit-frame-pointer -fwrapv -Qunused-arguments -fPIC -fPIE T:ccalik/aesni
clang -march=native -O -fomit-frame-pointer -fwrapv -Qunused-arguments -fPIC -fPIE T:ccalik/aesni
clang -march=native -Os -fomit-frame-pointer -fwrapv -Qunused-arguments -fPIC -fPIE T:ccalik/aesni
gcc -march=native -mtune=native -O2 -fomit-frame-pointer -fwrapv -fPIC -fPIE T:ccalik/aesni
gcc -march=native -mtune=native -O3 -fomit-frame-pointer -fwrapv -fPIC -fPIE T:ccalik/aesni
gcc -march=native -mtune=native -O -fomit-frame-pointer -fwrapv -fPIC -fPIE T:ccalik/aesni
gcc -march=native -mtune=native -Os -fomit-frame-pointer -fwrapv -fPIC -fPIE T:ccalik/aesni
clang -march=native -O2 -fomit-frame-pointer -fwrapv -Qunused-arguments -fPIC -fPIE T:ccalik/vperm
clang -march=native -O3 -fomit-frame-pointer -fwrapv -Qunused-arguments -fPIC -fPIE T:ccalik/vperm
clang -march=native -O -fomit-frame-pointer -fwrapv -Qunused-arguments -fPIC -fPIE T:ccalik/vperm
clang -march=native -Os -fomit-frame-pointer -fwrapv -Qunused-arguments -fPIC -fPIE T:ccalik/vperm
gcc -march=native -mtune=native -O2 -fomit-frame-pointer -fwrapv -fPIC -fPIE T:ccalik/vperm
gcc -march=native -mtune=native -O3 -fomit-frame-pointer -fwrapv -fPIC -fPIE T:ccalik/vperm
gcc -march=native -mtune=native -O -fomit-frame-pointer -fwrapv -fPIC -fPIE T:ccalik/vperm
gcc -march=native -mtune=native -Os -fomit-frame-pointer -fwrapv -fPIC -fPIE T:ccalik/vperm

Namespace violations

Implementation: T:ccalik/bitsliced
Security model: timingleaks
Compiler: clang -march=native -O2 -fomit-frame-pointer -fwrapv -Qunused-arguments -fPIC -fPIE
hash.o Compress T
hash.o Final T
hash.o Hash T
hash.o Init T
hash.o Update T
hash.o _BS0 R
hash.o _BS1 R
hash.o _BS2 R
hash.o _ONE R
hash.o bigshiftrows1 R
hash.o bigshiftrows2 R
hash.o bigshiftrows3 R
hash.o const1 R
hash.o lownibblemask R
hash.o mixcol1 R
hash.o mixcol2 R
hash.o mixcol3 R
hash.o shiftrowsslice R

Number of similar (compiler,implementation) pairs: 8, namely:
CompilerImplementations
clang -march=native -O2 -fomit-frame-pointer -fwrapv -Qunused-arguments -fPIC -fPIE T:ccalik/bitsliced
clang -march=native -O3 -fomit-frame-pointer -fwrapv -Qunused-arguments -fPIC -fPIE T:ccalik/bitsliced
clang -march=native -O -fomit-frame-pointer -fwrapv -Qunused-arguments -fPIC -fPIE T:ccalik/bitsliced
clang -march=native -Os -fomit-frame-pointer -fwrapv -Qunused-arguments -fPIC -fPIE T:ccalik/bitsliced
gcc -march=native -mtune=native -O2 -fomit-frame-pointer -fwrapv -fPIC -fPIE T:ccalik/bitsliced
gcc -march=native -mtune=native -O3 -fomit-frame-pointer -fwrapv -fPIC -fPIE T:ccalik/bitsliced
gcc -march=native -mtune=native -O -fomit-frame-pointer -fwrapv -fPIC -fPIE T:ccalik/bitsliced
gcc -march=native -mtune=native -Os -fomit-frame-pointer -fwrapv -fPIC -fPIE T:ccalik/bitsliced

Namespace violations

Implementation: T:generic/opt32
Security model: timingleaks
Compiler: clang -march=native -O2 -fomit-frame-pointer -fwrapv -Qunused-arguments -fPIC -fPIE
echo32.o CNT_r C
echo32.o Compress T
echo32.o Endianess T
echo32.o Final T
echo32.o Hash T
echo32.o Init T
echo32.o PushString T
echo32.o Update T
echo32.o endian C
echo32.o flip_bits T
echo32.o r C

Number of similar (compiler,implementation) pairs: 27, namely:
CompilerImplementations
clang -march=native -O2 -fomit-frame-pointer -fwrapv -Qunused-arguments -fPIC -fPIE T:generic/opt32
clang -march=native -O3 -fomit-frame-pointer -fwrapv -Qunused-arguments -fPIC -fPIE T:generic/opt32
clang -march=native -O -fomit-frame-pointer -fwrapv -Qunused-arguments -fPIC -fPIE T:generic/opt32
clang -march=native -Os -fomit-frame-pointer -fwrapv -Qunused-arguments -fPIC -fPIE T:generic/opt32
clang -mcpu=native -O3 -fomit-frame-pointer -fwrapv -Qunused-arguments -fPIC -fPIE T:generic/opt32
gcc -march=native -mtune=native -O2 -fomit-frame-pointer -fwrapv -fPIC -fPIE T:generic/opt32
gcc -march=native -mtune=native -O3 -fomit-frame-pointer -fwrapv -fPIC -fPIE T:generic/opt32
gcc -march=native -mtune=native -O -fomit-frame-pointer -fwrapv -fPIC -fPIE T:generic/opt32
gcc -march=native -mtune=native -Os -fomit-frame-pointer -fwrapv -fPIC -fPIE T:generic/opt32
clang -march=native -O2 -fomit-frame-pointer -fwrapv -Qunused-arguments -fPIC -fPIE T:powerpc/pp32cv1
clang -march=native -O3 -fomit-frame-pointer -fwrapv -Qunused-arguments -fPIC -fPIE T:powerpc/pp32cv1
clang -march=native -O -fomit-frame-pointer -fwrapv -Qunused-arguments -fPIC -fPIE T:powerpc/pp32cv1
clang -march=native -Os -fomit-frame-pointer -fwrapv -Qunused-arguments -fPIC -fPIE T:powerpc/pp32cv1
clang -mcpu=native -O3 -fomit-frame-pointer -fwrapv -Qunused-arguments -fPIC -fPIE T:powerpc/pp32cv1
gcc -march=native -mtune=native -O2 -fomit-frame-pointer -fwrapv -fPIC -fPIE T:powerpc/pp32cv1
gcc -march=native -mtune=native -O3 -fomit-frame-pointer -fwrapv -fPIC -fPIE T:powerpc/pp32cv1
gcc -march=native -mtune=native -O -fomit-frame-pointer -fwrapv -fPIC -fPIE T:powerpc/pp32cv1
gcc -march=native -mtune=native -Os -fomit-frame-pointer -fwrapv -fPIC -fPIE T:powerpc/pp32cv1
clang -march=native -O2 -fomit-frame-pointer -fwrapv -Qunused-arguments -fPIC -fPIE T:powerpc/pp32cv2
clang -march=native -O3 -fomit-frame-pointer -fwrapv -Qunused-arguments -fPIC -fPIE T:powerpc/pp32cv2
clang -march=native -O -fomit-frame-pointer -fwrapv -Qunused-arguments -fPIC -fPIE T:powerpc/pp32cv2
clang -march=native -Os -fomit-frame-pointer -fwrapv -Qunused-arguments -fPIC -fPIE T:powerpc/pp32cv2
clang -mcpu=native -O3 -fomit-frame-pointer -fwrapv -Qunused-arguments -fPIC -fPIE T:powerpc/pp32cv2
gcc -march=native -mtune=native -O2 -fomit-frame-pointer -fwrapv -fPIC -fPIE T:powerpc/pp32cv2
gcc -march=native -mtune=native -O3 -fomit-frame-pointer -fwrapv -fPIC -fPIE T:powerpc/pp32cv2
gcc -march=native -mtune=native -O -fomit-frame-pointer -fwrapv -fPIC -fPIE T:powerpc/pp32cv2
gcc -march=native -mtune=native -Os -fomit-frame-pointer -fwrapv -fPIC -fPIE T:powerpc/pp32cv2

Namespace violations

Implementation: T:generic/opt64
Security model: timingleaks
Compiler: clang -march=native -O2 -fomit-frame-pointer -fwrapv -Qunused-arguments -fPIC -fPIE
echo64.o Compress T
echo64.o Endianess T
echo64.o Final T
echo64.o Hash T
echo64.o Init T
echo64.o PushString T
echo64.o Update T
echo64.o endian C

Number of similar (compiler,implementation) pairs: 9, namely:
CompilerImplementations
clang -march=native -O2 -fomit-frame-pointer -fwrapv -Qunused-arguments -fPIC -fPIE T:generic/opt64
clang -march=native -O3 -fomit-frame-pointer -fwrapv -Qunused-arguments -fPIC -fPIE T:generic/opt64
clang -march=native -O -fomit-frame-pointer -fwrapv -Qunused-arguments -fPIC -fPIE T:generic/opt64
clang -march=native -Os -fomit-frame-pointer -fwrapv -Qunused-arguments -fPIC -fPIE T:generic/opt64
clang -mcpu=native -O3 -fomit-frame-pointer -fwrapv -Qunused-arguments -fPIC -fPIE T:generic/opt64
gcc -march=native -mtune=native -O2 -fomit-frame-pointer -fwrapv -fPIC -fPIE T:generic/opt64
gcc -march=native -mtune=native -O3 -fomit-frame-pointer -fwrapv -fPIC -fPIE T:generic/opt64
gcc -march=native -mtune=native -O -fomit-frame-pointer -fwrapv -fPIC -fPIE T:generic/opt64
gcc -march=native -mtune=native -Os -fomit-frame-pointer -fwrapv -fPIC -fPIE T:generic/opt64

Namespace violations

Implementation: T:sphlib
Security model: timingleaks
Compiler: clang -march=native -O2 -fomit-frame-pointer -fwrapv -Qunused-arguments -fPIC -fPIE
echo.o sph_echo224 T
echo.o sph_echo224_addbits_and_close T
echo.o sph_echo224_close T
echo.o sph_echo224_init T
echo.o sph_echo256 T
echo.o sph_echo256_addbits_and_close T
echo.o sph_echo256_close T
echo.o sph_echo256_init T
echo.o sph_echo384 T
echo.o sph_echo384_addbits_and_close T
echo.o sph_echo384_close T
echo.o sph_echo384_init T
echo.o sph_echo512 T
echo.o sph_echo512_addbits_and_close T
echo.o sph_echo512_close T
echo.o sph_echo512_init T

Number of similar (compiler,implementation) pairs: 18, namely:
CompilerImplementations
clang -march=native -O2 -fomit-frame-pointer -fwrapv -Qunused-arguments -fPIC -fPIE T:sphlib
clang -march=native -O3 -fomit-frame-pointer -fwrapv -Qunused-arguments -fPIC -fPIE T:sphlib
clang -march=native -O -fomit-frame-pointer -fwrapv -Qunused-arguments -fPIC -fPIE T:sphlib
clang -march=native -Os -fomit-frame-pointer -fwrapv -Qunused-arguments -fPIC -fPIE T:sphlib
clang -mcpu=native -O3 -fomit-frame-pointer -fwrapv -Qunused-arguments -fPIC -fPIE T:sphlib
gcc -march=native -mtune=native -O2 -fomit-frame-pointer -fwrapv -fPIC -fPIE T:sphlib
gcc -march=native -mtune=native -O3 -fomit-frame-pointer -fwrapv -fPIC -fPIE T:sphlib
gcc -march=native -mtune=native -O -fomit-frame-pointer -fwrapv -fPIC -fPIE T:sphlib
gcc -march=native -mtune=native -Os -fomit-frame-pointer -fwrapv -fPIC -fPIE T:sphlib
clang -march=native -O2 -fomit-frame-pointer -fwrapv -Qunused-arguments -fPIC -fPIE T:sphlib-small
clang -march=native -O3 -fomit-frame-pointer -fwrapv -Qunused-arguments -fPIC -fPIE T:sphlib-small
clang -march=native -O -fomit-frame-pointer -fwrapv -Qunused-arguments -fPIC -fPIE T:sphlib-small
clang -march=native -Os -fomit-frame-pointer -fwrapv -Qunused-arguments -fPIC -fPIE T:sphlib-small
clang -mcpu=native -O3 -fomit-frame-pointer -fwrapv -Qunused-arguments -fPIC -fPIE T:sphlib-small
gcc -march=native -mtune=native -O2 -fomit-frame-pointer -fwrapv -fPIC -fPIE T:sphlib-small
gcc -march=native -mtune=native -O3 -fomit-frame-pointer -fwrapv -fPIC -fPIE T:sphlib-small
gcc -march=native -mtune=native -O -fomit-frame-pointer -fwrapv -fPIC -fPIE T:sphlib-small
gcc -march=native -mtune=native -Os -fomit-frame-pointer -fwrapv -fPIC -fPIE T:sphlib-small