Implementation notes: amd64, rumba3, crypto_aead/morus640128v2

Computer: rumba3
Architecture: amd64
CPU ID: AuthenticAMD-00800f11-178bfbff
SUPERCOP version: 20200906
Operation: crypto_aead
Primitive: morus640128v2
TimeObject sizeTest sizeImplementationCompilerBenchmark dateSUPERCOP version
72235815 0 021505 776 872T:sse2clang_-march=native_-O3_-fomit-frame-pointer_-fwrapv_-Qunused-arguments_-fPIC_-fPIE2020082920200826
72236800 0 022641 776 856T:sse2clang_-mcpu=native_-O3_-fomit-frame-pointer_-fwrapv_-Qunused-arguments_-fPIC_-fPIE2020082920200826
72545783 0 021425 776 872T:sse2clang_-march=native_-O2_-fomit-frame-pointer_-fwrapv_-Qunused-arguments_-fPIC_-fPIE2020082920200826
72545783 0 021425 776 872T:sse2clang_-march=native_-O_-fomit-frame-pointer_-fwrapv_-Qunused-arguments_-fPIC_-fPIE2020082920200826
108812853 0 015567 768 856T:sse2clang_-march=native_-Os_-fomit-frame-pointer_-fwrapv_-Qunused-arguments_-fPIC_-fPIE2020082920200826
127725906 0 022557 784 928T:sse2gcc_-march=native_-mtune=native_-O3_-fomit-frame-pointer_-fwrapv_-fPIC_-fPIE2020082920200826
128342431 0 016741 784 928T:sse2gcc_-march=native_-mtune=native_-O_-fomit-frame-pointer_-fwrapv_-fPIC_-fPIE2020082920200826
132681991 0 015216 760 896T:sse2gcc_-march=native_-mtune=native_-Os_-fomit-frame-pointer_-fwrapv_-fPIC_-fPIE2020082920200826
157482374 0 016901 784 928T:sse2gcc_-march=native_-mtune=native_-O2_-fomit-frame-pointer_-fwrapv_-fPIC_-fPIE2020082920200826
2049110791 0 025220 776 928T:refgcc_-march=native_-mtune=native_-O2_-fomit-frame-pointer_-fwrapv_-fPIC_-fPIE2020082920200826
2064613097 0 029741 784 928T:refgcc_-march=native_-mtune=native_-O3_-fomit-frame-pointer_-fwrapv_-fPIC_-fPIE2020082920200826
2108010947 0 025172 776 928T:refgcc_-march=native_-mtune=native_-O_-fomit-frame-pointer_-fwrapv_-fPIC_-fPIE2020082920200826

Compiler output

Implementation: T:ref
Security model: timingleaks
Compiler: clang -march=native -O2 -fomit-frame-pointer -fwrapv -Qunused-arguments -fPIC -fPIE
try.c: crypto_aead_morus640128v2.a(encrypt.o): In function `morus_initialization':
try.c: encrypt.c:(.text+0x...): undefined reference to `morus_stateupdate'
try.c: encrypt.c:(.text+0x...): undefined reference to `morus_stateupdate'
try.c: encrypt.c:(.text+0x...): undefined reference to `morus_stateupdate'
try.c: encrypt.c:(.text+0x...): undefined reference to `morus_stateupdate'
try.c: encrypt.c:(.text+0x...): undefined reference to `morus_stateupdate'
try.c: crypto_aead_morus640128v2.a(encrypt.o):encrypt.c:(.text+0x...): more undefined references to `morus_stateupdate' follow
try.c: clang: error: linker command failed with exit code 1 (use -v to see invocation)

Number of similar (compiler,implementation) pairs: 4, namely:
CompilerImplementations
clang -march=native -O2 -fomit-frame-pointer -fwrapv -Qunused-arguments -fPIC -fPIE T:ref
clang -march=native -O3 -fomit-frame-pointer -fwrapv -Qunused-arguments -fPIC -fPIE T:ref
clang -march=native -O -fomit-frame-pointer -fwrapv -Qunused-arguments -fPIC -fPIE T:ref
clang -mcpu=native -O3 -fomit-frame-pointer -fwrapv -Qunused-arguments -fPIC -fPIE T:ref

Compiler output

Implementation: T:ref
Security model: timingleaks
Compiler: clang -march=native -Os -fomit-frame-pointer -fwrapv -Qunused-arguments -fPIC -fPIE
try.c: crypto_aead_morus640128v2.a(encrypt.o): In function `morus_initialization':
try.c: encrypt.c:(.text+0x...): undefined reference to `morus_stateupdate'
try.c: crypto_aead_morus640128v2.a(encrypt.o): In function `morus_tag_generation':
try.c: encrypt.c:(.text+0x...): undefined reference to `morus_stateupdate'
try.c: crypto_aead_morus640128v2.a(encrypt.o): In function `morus_tag_verification':
try.c: encrypt.c:(.text+0x...): undefined reference to `morus_stateupdate'
try.c: crypto_aead_morus640128v2.a(encrypt.o): In function `morus_enc_aut_partialblock':
try.c: encrypt.c:(.text+0x...): undefined reference to `morus_stateupdate'
try.c: crypto_aead_morus640128v2.a(encrypt.o): In function `morus_dec_aut_partialblock':
try.c: encrypt.c:(.text+0x...): undefined reference to `morus_stateupdate'
try.c: crypto_aead_morus640128v2.a(encrypt.o):encrypt.c:(.text+0x...): more undefined references to `morus_stateupdate' follow
try.c: clang: error: linker command failed with exit code 1 (use -v to see invocation)

Number of similar (compiler,implementation) pairs: 1, namely:
CompilerImplementations
clang -march=native -Os -fomit-frame-pointer -fwrapv -Qunused-arguments -fPIC -fPIE T:ref

Compiler output

Implementation: T:ref
Security model: timingleaks
Compiler: gcc -march=native -mtune=native -Os -fomit-frame-pointer -fwrapv -fPIC -fPIE
try.c: crypto_aead_morus640128v2.a(encrypt.o): In function `morus_initialization':
try.c: encrypt.c:(.text+0x...): undefined reference to `morus_stateupdate'
try.c: crypto_aead_morus640128v2.a(encrypt.o): In function `morus_tag_generation':
try.c: encrypt.c:(.text+0x...): undefined reference to `morus_stateupdate'
try.c: crypto_aead_morus640128v2.a(encrypt.o): In function `morus_tag_verification':
try.c: encrypt.c:(.text+0x...): undefined reference to `morus_stateupdate'
try.c: crypto_aead_morus640128v2.a(encrypt.o): In function `morus_enc_aut_partialblock':
try.c: encrypt.c:(.text+0x...): undefined reference to `morus_stateupdate'
try.c: crypto_aead_morus640128v2.a(encrypt.o): In function `morus_dec_aut_partialblock':
try.c: encrypt.c:(.text+0x...): undefined reference to `morus_stateupdate'
try.c: crypto_aead_morus640128v2.a(encrypt.o): In function `crypto_aead_morus640128v2_ref_timingleaks_encrypt':
try.c: encrypt.c:(.text+0x...): undefined reference to `morus_enc_aut_step'
try.c: encrypt.c:(.text+0x...): undefined reference to `morus_enc_aut_step'
try.c: crypto_aead_morus640128v2.a(encrypt.o): In function `crypto_aead_morus640128v2_ref_timingleaks_decrypt':
try.c: encrypt.c:(.text+0x...): undefined reference to `morus_enc_aut_step'
try.c: encrypt.c:(.text+0x...): undefined reference to `morus_dec_aut_step'
try.c: collect2: error: ld returned 1 exit status

Number of similar (compiler,implementation) pairs: 1, namely:
CompilerImplementations
gcc -march=native -mtune=native -Os -fomit-frame-pointer -fwrapv -fPIC -fPIE T:ref

Namespace violations

Implementation: T:ref
Security model: timingleaks
Compiler: gcc -march=native -mtune=native -O2 -fomit-frame-pointer -fwrapv -fPIC -fPIE
encrypt.o morus_dec_aut_partialblock T
encrypt.o morus_enc_aut_partialblock T
encrypt.o morus_initialization T
encrypt.o morus_tag_generation T
encrypt.o morus_tag_verification T

Number of similar (compiler,implementation) pairs: 3, namely:
CompilerImplementations
gcc -march=native -mtune=native -O2 -fomit-frame-pointer -fwrapv -fPIC -fPIE T:ref
gcc -march=native -mtune=native -O3 -fomit-frame-pointer -fwrapv -fPIC -fPIE T:ref
gcc -march=native -mtune=native -O -fomit-frame-pointer -fwrapv -fPIC -fPIE T:ref

Namespace violations

Implementation: T:sse2
Security model: timingleaks
Compiler: clang -march=native -O2 -fomit-frame-pointer -fwrapv -Qunused-arguments -fPIC -fPIE
encrypt.o morus_dec_aut_partialblock T
encrypt.o morus_enc_aut_partialblock T
encrypt.o morus_initialization T
encrypt.o morus_stateupdate T
encrypt.o morus_tag_generation T
encrypt.o morus_tag_verification T

Number of similar (compiler,implementation) pairs: 9, namely:
CompilerImplementations
clang -march=native -O2 -fomit-frame-pointer -fwrapv -Qunused-arguments -fPIC -fPIE T:sse2
clang -march=native -O3 -fomit-frame-pointer -fwrapv -Qunused-arguments -fPIC -fPIE T:sse2
clang -march=native -O -fomit-frame-pointer -fwrapv -Qunused-arguments -fPIC -fPIE T:sse2
clang -march=native -Os -fomit-frame-pointer -fwrapv -Qunused-arguments -fPIC -fPIE T:sse2
clang -mcpu=native -O3 -fomit-frame-pointer -fwrapv -Qunused-arguments -fPIC -fPIE T:sse2
gcc -march=native -mtune=native -O2 -fomit-frame-pointer -fwrapv -fPIC -fPIE T:sse2
gcc -march=native -mtune=native -O3 -fomit-frame-pointer -fwrapv -fPIC -fPIE T:sse2
gcc -march=native -mtune=native -O -fomit-frame-pointer -fwrapv -fPIC -fPIE T:sse2
gcc -march=native -mtune=native -Os -fomit-frame-pointer -fwrapv -fPIC -fPIE T:sse2