Implementation notes: amd64, rome0, crypto_sign/bluegemss256

Computer: rome0
Microarchitecture: amd64; Zen 2 (830f10)
Architecture: amd64
CPU ID: AuthenticAMD-00830f10-178bfbff
SUPERCOP version: 20240716
Operation: crypto_sign
Primitive: bluegemss256
TimeObject sizeTest sizeImplementationCompilerBenchmark dateSUPERCOP version
764925656146652 0 0147424 804 1784T:skylakegcc_-march=native_-mtune=native_-O3_-fwrapv_-fPIC_-fPIE_-gdwarf-4_-Wall2024062520240625
767414440146446 0 0147200 804 1784T:optgcc_-march=native_-mtune=native_-O3_-fwrapv_-fPIC_-fPIE_-gdwarf-4_-Wall2024062520240625
773276204109512 0 0110392 804 1784T:optgcc_-march=native_-mtune=native_-O2_-fwrapv_-fPIC_-fPIE_-gdwarf-4_-Wall2024062520240625
773800328109718 0 0110552 804 1784T:skylakegcc_-march=native_-mtune=native_-O2_-fwrapv_-fPIC_-fPIE_-gdwarf-4_-Wall2024062520240625
77532880997175 0 098960 796 1752T:optgcc_-march=native_-mtune=native_-Os_-fwrapv_-fPIC_-fPIE_-gdwarf-4_-Wall2024062520240625
77615877697341 0 099152 796 1752T:skylakegcc_-march=native_-mtune=native_-Os_-fwrapv_-fPIC_-fPIE_-gdwarf-4_-Wall2024062520240625
781222182104919 0 0106360 804 1784T:optgcc_-march=native_-mtune=native_-O_-fwrapv_-fPIC_-fPIE_-gdwarf-4_-Wall2024062520240625
781980886105074 0 0106520 804 1784T:skylakegcc_-march=native_-mtune=native_-O_-fwrapv_-fPIC_-fPIE_-gdwarf-4_-Wall2024062520240625
127542600554605 112 71840583 4100 6872T:refclang++_-march=native_-O2_-fwrapv_-Qunused-arguments_-fPIC_-fPIE_-gdwarf-4_-Wall2024062520240625
128167141842263 112 71820937 4092 6872T:refclang++_-march=native_-Os_-fwrapv_-Qunused-arguments_-fPIC_-fPIE_-gdwarf-4_-Wall2024062520240625
128616286151841 112 71836258 4068 6936T:refg++_-march=native_-mtune=native_-O2_-fwrapv_-fPIC_-fPIE_-gdwarf-4_-Wall2024062520240625
128877004961306 112 71849546 4068 6936T:refg++_-march=native_-mtune=native_-O3_-fwrapv_-fPIC_-fPIE_-gdwarf-4_-Wall2024062520240625
129432064543736 112 71828138 4068 6936T:refg++_-march=native_-mtune=native_-O_-fwrapv_-fPIC_-fPIE_-gdwarf-4_-Wall2024062520240625
130075802762489 112 71848783 4100 6872T:refclang++_-march=native_-O3_-fwrapv_-Qunused-arguments_-fPIC_-fPIE_-gdwarf-4_-Wall2024062520240625
131473130438465 112 71822902 4060 6904T:refg++_-march=native_-mtune=native_-Os_-fwrapv_-fPIC_-fPIE_-gdwarf-4_-Wall2024062520240625
132546849066658 112 71834153 4092 6872T:refclang++_-march=native_-O_-fwrapv_-Qunused-arguments_-fPIC_-fPIE_-gdwarf-4_-Wall2024062520240625

Compiler output


mul_gf2x.c: mul_gf2x.c:13:12: warning: implicit declaration of function '_mm_cvtsi128_si64x' is invalid in C99 [-Wimplicit-function-declaration]
mul_gf2x.c:     return MUL64LOW(x,y,0);
mul_gf2x.c:            ^
mul_gf2x.c: ./mul_gf2x.h:905:27: note: expanded from macro 'MUL64LOW'
mul_gf2x.c: #define MUL64LOW(x,y,pos) _mm_cvtsi128_si64x(_mm_clmulepi64_si128(x, y, pos))
mul_gf2x.c:                           ^
mul_gf2x.c: 1 warning generated.
sqr_gf2x.c: sqr_gf2x.c:27:12: warning: implicit declaration of function '_mm_cvtsi128_si64x' is invalid in C99 [-Wimplicit-function-declaration]
sqr_gf2x.c:     return _mm_cvtsi128_si64x(_mm_clmulepi64_si128(x,x,0));
sqr_gf2x.c:            ^
sqr_gf2x.c: sqr_gf2x.c:316:12: warning: implicit declaration of function '_mm_cvtsi128_si64x' is invalid in C99 [-Wimplicit-function-declaration]
sqr_gf2x.c:     return SQR64LOW(x,0);
sqr_gf2x.c:            ^
sqr_gf2x.c: ./sqr_gf2x.h:250:25: note: expanded from macro 'SQR64LOW'
sqr_gf2x.c: #define SQR64LOW(x,pos) _mm_cvtsi128_si64x(_mm_clmulepi64_si128(x, x, pos))
sqr_gf2x.c:                         ^
sqr_gf2x.c: 2 warnings generated.
try.c: /usr/bin/ld: libcrypto_sign_bluegemss256.a(mul_gf2x.o): in function `BlueGeMSS_256U_mul64low':
try.c: .../supercop-data/rome0/amd64/try/c/clang_-march=native_-O2_-fwrapv_-Qunused-arguments_-fPIC_-fPIE_-gdwarf-4_-Wall/timingleaks/crypto_sign/bluegemss256/opt/work/mul_gf2x.c:13: undefined reference to `_mm_cvtsi128_si64x'
try.c: /usr/bin/ld: libcrypto_sign_bluegemss256.a(sqr_gf2x.o): in function `BlueGeMSS_256U_sqr64low':
try.c: .../supercop-data/rome0/amd64/try/c/clang_-march=native_-O2_-fwrapv_-Qunused-arguments_-fPIC_-fPIE_-gdwarf-4_-Wall/timingleaks/crypto_sign/bluegemss256/opt/work/sqr_gf2x.c:27: undefined reference to `_mm_cvtsi128_si64x'
try.c: /usr/bin/ld: libcrypto_sign_bluegemss256.a(sqr_gf2x.o): in function `BlueGeMSS_256U_old_square64low':
try.c: .../supercop-data/rome0/amd64/try/c/clang_-march=native_-O2_-fwrapv_-Qunused-arguments_-fPIC_-fPIE_-gdwarf-4_-Wall/timingleaks/crypto_sign/bluegemss256/opt/work/sqr_gf2x.c:316: undefined reference to `_mm_cvtsi128_si64x'
try.c: clang: error: linker command failed with exit code 1 (use -v to see invocation)

Number of similar (implementation,compiler) pairs: 1, namely:
ImplementationCompiler
T:optclang -march=native -O2 -fwrapv -Qunused-arguments -fPIC -fPIE -gdwarf-4 -Wall (Debian_Clang_11.0.1)

Compiler output


mul_gf2x.c: mul_gf2x.c:13:12: warning: implicit declaration of function '_mm_cvtsi128_si64x' is invalid in C99 [-Wimplicit-function-declaration]
mul_gf2x.c:     return MUL64LOW(x,y,0);
mul_gf2x.c:            ^
mul_gf2x.c: ./mul_gf2x.h:905:27: note: expanded from macro 'MUL64LOW'
mul_gf2x.c: #define MUL64LOW(x,y,pos) _mm_cvtsi128_si64x(_mm_clmulepi64_si128(x, y, pos))
mul_gf2x.c:                           ^
mul_gf2x.c: 1 warning generated.
sqr_gf2x.c: sqr_gf2x.c:27:12: warning: implicit declaration of function '_mm_cvtsi128_si64x' is invalid in C99 [-Wimplicit-function-declaration]
sqr_gf2x.c:     return _mm_cvtsi128_si64x(_mm_clmulepi64_si128(x,x,0));
sqr_gf2x.c:            ^
sqr_gf2x.c: sqr_gf2x.c:316:12: warning: implicit declaration of function '_mm_cvtsi128_si64x' is invalid in C99 [-Wimplicit-function-declaration]
sqr_gf2x.c:     return SQR64LOW(x,0);
sqr_gf2x.c:            ^
sqr_gf2x.c: ./sqr_gf2x.h:250:25: note: expanded from macro 'SQR64LOW'
sqr_gf2x.c: #define SQR64LOW(x,pos) _mm_cvtsi128_si64x(_mm_clmulepi64_si128(x, x, pos))
sqr_gf2x.c:                         ^
sqr_gf2x.c: 2 warnings generated.
try.c: /usr/bin/ld: libcrypto_sign_bluegemss256.a(mul_gf2x.o): in function `BlueGeMSS_256U_mul64low':
try.c: .../supercop-data/rome0/amd64/try/c/clang_-march=native_-O3_-fwrapv_-Qunused-arguments_-fPIC_-fPIE_-gdwarf-4_-Wall/timingleaks/crypto_sign/bluegemss256/opt/work/mul_gf2x.c:13: undefined reference to `_mm_cvtsi128_si64x'
try.c: /usr/bin/ld: libcrypto_sign_bluegemss256.a(sqr_gf2x.o): in function `BlueGeMSS_256U_sqr64low':
try.c: .../supercop-data/rome0/amd64/try/c/clang_-march=native_-O3_-fwrapv_-Qunused-arguments_-fPIC_-fPIE_-gdwarf-4_-Wall/timingleaks/crypto_sign/bluegemss256/opt/work/sqr_gf2x.c:27: undefined reference to `_mm_cvtsi128_si64x'
try.c: /usr/bin/ld: libcrypto_sign_bluegemss256.a(sqr_gf2x.o): in function `BlueGeMSS_256U_old_square64low':
try.c: .../supercop-data/rome0/amd64/try/c/clang_-march=native_-O3_-fwrapv_-Qunused-arguments_-fPIC_-fPIE_-gdwarf-4_-Wall/timingleaks/crypto_sign/bluegemss256/opt/work/sqr_gf2x.c:316: undefined reference to `_mm_cvtsi128_si64x'
try.c: clang: error: linker command failed with exit code 1 (use -v to see invocation)

Number of similar (implementation,compiler) pairs: 1, namely:
ImplementationCompiler
T:optclang -march=native -O3 -fwrapv -Qunused-arguments -fPIC -fPIE -gdwarf-4 -Wall (Debian_Clang_11.0.1)

Compiler output


mul_gf2x.c: mul_gf2x.c:13:12: warning: implicit declaration of function '_mm_cvtsi128_si64x' is invalid in C99 [-Wimplicit-function-declaration]
mul_gf2x.c:     return MUL64LOW(x,y,0);
mul_gf2x.c:            ^
mul_gf2x.c: ./mul_gf2x.h:905:27: note: expanded from macro 'MUL64LOW'
mul_gf2x.c: #define MUL64LOW(x,y,pos) _mm_cvtsi128_si64x(_mm_clmulepi64_si128(x, y, pos))
mul_gf2x.c:                           ^
mul_gf2x.c: 1 warning generated.
sqr_gf2x.c: sqr_gf2x.c:27:12: warning: implicit declaration of function '_mm_cvtsi128_si64x' is invalid in C99 [-Wimplicit-function-declaration]
sqr_gf2x.c:     return _mm_cvtsi128_si64x(_mm_clmulepi64_si128(x,x,0));
sqr_gf2x.c:            ^
sqr_gf2x.c: sqr_gf2x.c:316:12: warning: implicit declaration of function '_mm_cvtsi128_si64x' is invalid in C99 [-Wimplicit-function-declaration]
sqr_gf2x.c:     return SQR64LOW(x,0);
sqr_gf2x.c:            ^
sqr_gf2x.c: ./sqr_gf2x.h:250:25: note: expanded from macro 'SQR64LOW'
sqr_gf2x.c: #define SQR64LOW(x,pos) _mm_cvtsi128_si64x(_mm_clmulepi64_si128(x, x, pos))
sqr_gf2x.c:                         ^
sqr_gf2x.c: 2 warnings generated.
try.c: /usr/bin/ld: libcrypto_sign_bluegemss256.a(mul_gf2x.o): in function `BlueGeMSS_256U_mul64low':
try.c: .../supercop-data/rome0/amd64/try/c/clang_-march=native_-O_-fwrapv_-Qunused-arguments_-fPIC_-fPIE_-gdwarf-4_-Wall/timingleaks/crypto_sign/bluegemss256/opt/work/mul_gf2x.c:13: undefined reference to `_mm_cvtsi128_si64x'
try.c: /usr/bin/ld: libcrypto_sign_bluegemss256.a(sqr_gf2x.o): in function `BlueGeMSS_256U_sqr64low':
try.c: .../supercop-data/rome0/amd64/try/c/clang_-march=native_-O_-fwrapv_-Qunused-arguments_-fPIC_-fPIE_-gdwarf-4_-Wall/timingleaks/crypto_sign/bluegemss256/opt/work/sqr_gf2x.c:27: undefined reference to `_mm_cvtsi128_si64x'
try.c: /usr/bin/ld: libcrypto_sign_bluegemss256.a(sqr_gf2x.o): in function `BlueGeMSS_256U_old_square64low':
try.c: .../supercop-data/rome0/amd64/try/c/clang_-march=native_-O_-fwrapv_-Qunused-arguments_-fPIC_-fPIE_-gdwarf-4_-Wall/timingleaks/crypto_sign/bluegemss256/opt/work/sqr_gf2x.c:316: undefined reference to `_mm_cvtsi128_si64x'
try.c: clang: error: linker command failed with exit code 1 (use -v to see invocation)

Number of similar (implementation,compiler) pairs: 1, namely:
ImplementationCompiler
T:optclang -march=native -O -fwrapv -Qunused-arguments -fPIC -fPIE -gdwarf-4 -Wall (Debian_Clang_11.0.1)

Compiler output


mul_gf2x.c: mul_gf2x.c:13:12: warning: implicit declaration of function '_mm_cvtsi128_si64x' is invalid in C99 [-Wimplicit-function-declaration]
mul_gf2x.c:     return MUL64LOW(x,y,0);
mul_gf2x.c:            ^
mul_gf2x.c: ./mul_gf2x.h:905:27: note: expanded from macro 'MUL64LOW'
mul_gf2x.c: #define MUL64LOW(x,y,pos) _mm_cvtsi128_si64x(_mm_clmulepi64_si128(x, y, pos))
mul_gf2x.c:                           ^
mul_gf2x.c: 1 warning generated.
sqr_gf2x.c: sqr_gf2x.c:27:12: warning: implicit declaration of function '_mm_cvtsi128_si64x' is invalid in C99 [-Wimplicit-function-declaration]
sqr_gf2x.c:     return _mm_cvtsi128_si64x(_mm_clmulepi64_si128(x,x,0));
sqr_gf2x.c:            ^
sqr_gf2x.c: sqr_gf2x.c:316:12: warning: implicit declaration of function '_mm_cvtsi128_si64x' is invalid in C99 [-Wimplicit-function-declaration]
sqr_gf2x.c:     return SQR64LOW(x,0);
sqr_gf2x.c:            ^
sqr_gf2x.c: ./sqr_gf2x.h:250:25: note: expanded from macro 'SQR64LOW'
sqr_gf2x.c: #define SQR64LOW(x,pos) _mm_cvtsi128_si64x(_mm_clmulepi64_si128(x, x, pos))
sqr_gf2x.c:                         ^
sqr_gf2x.c: 2 warnings generated.
try.c: /usr/bin/ld: libcrypto_sign_bluegemss256.a(mul_gf2x.o): in function `BlueGeMSS_256U_mul64low':
try.c: .../supercop-data/rome0/amd64/try/c/clang_-march=native_-Os_-fwrapv_-Qunused-arguments_-fPIC_-fPIE_-gdwarf-4_-Wall/timingleaks/crypto_sign/bluegemss256/opt/work/mul_gf2x.c:13: undefined reference to `_mm_cvtsi128_si64x'
try.c: /usr/bin/ld: libcrypto_sign_bluegemss256.a(sqr_gf2x.o): in function `BlueGeMSS_256U_sqr64low':
try.c: .../supercop-data/rome0/amd64/try/c/clang_-march=native_-Os_-fwrapv_-Qunused-arguments_-fPIC_-fPIE_-gdwarf-4_-Wall/timingleaks/crypto_sign/bluegemss256/opt/work/sqr_gf2x.c:27: undefined reference to `_mm_cvtsi128_si64x'
try.c: /usr/bin/ld: libcrypto_sign_bluegemss256.a(sqr_gf2x.o): in function `BlueGeMSS_256U_old_square64low':
try.c: .../supercop-data/rome0/amd64/try/c/clang_-march=native_-Os_-fwrapv_-Qunused-arguments_-fPIC_-fPIE_-gdwarf-4_-Wall/timingleaks/crypto_sign/bluegemss256/opt/work/sqr_gf2x.c:316: undefined reference to `_mm_cvtsi128_si64x'
try.c: clang: error: linker command failed with exit code 1 (use -v to see invocation)

Number of similar (implementation,compiler) pairs: 1, namely:
ImplementationCompiler
T:optclang -march=native -Os -fwrapv -Qunused-arguments -fPIC -fPIE -gdwarf-4 -Wall (Debian_Clang_11.0.1)

Compiler output


arith_gf2n.c: In file included from arith_gf2n.c:1:
arith_gf2n.c: In file included from ./arith_gf2n.h:9:
arith_gf2n.c: In file included from ./tools_gf2n.h:162:
arith_gf2n.c: ./mul_gf2x.h:17:14: fatal error: 'gf2x/gf2x_mul1.h' file not found
arith_gf2n.c:     #include <gf2x/gf2x_mul1.h>
arith_gf2n.c:              ^~~~~~~~~~~~~~~~~~
arith_gf2n.c: 1 error generated.

Number of similar (implementation,compiler) pairs: 2, namely:
ImplementationCompiler
T:optclang -mcpu=native -O3 -fwrapv -Qunused-arguments -fPIC -fPIE -gdwarf-4 -Wall (Debian_Clang_11.0.1)
T:skylakeclang -mcpu=native -O3 -fwrapv -Qunused-arguments -fPIC -fPIE -gdwarf-4 -Wall (Debian_Clang_11.0.1)

Compiler output


KAT_int.c: clang: warning: treating 'c' input as 'c++' when in C++ mode, this behavior is deprecated [-Wdeprecated]
bit.c: clang: warning: treating 'c' input as 'c++' when in C++ mode, this behavior is deprecated [-Wdeprecated]
convMQS_gf2.c: clang: warning: treating 'c' input as 'c++' when in C++ mode, this behavior is deprecated [-Wdeprecated]
evalMQnocst_gf2.c: clang: warning: treating 'c' input as 'c++' when in C++ mode, this behavior is deprecated [-Wdeprecated]
printgf2x.c: clang: warning: treating 'c' input as 'c++' when in C++ mode, this behavior is deprecated [-Wdeprecated]
sign.c: clang: warning: treating 'c' input as 'c++' when in C++ mode, this behavior is deprecated [-Wdeprecated]
sign_openHFE.c: clang: warning: treating 'c' input as 'c++' when in C++ mode, this behavior is deprecated [-Wdeprecated]

Number of similar (implementation,compiler) pairs: 4, namely:
ImplementationCompiler
T:refclang++ -march=native -O2 -fwrapv -Qunused-arguments -fPIC -fPIE -gdwarf-4 -Wall (Debian_Clang_11.0.1)
T:refclang++ -march=native -O3 -fwrapv -Qunused-arguments -fPIC -fPIE -gdwarf-4 -Wall (Debian_Clang_11.0.1)
T:refclang++ -march=native -O -fwrapv -Qunused-arguments -fPIC -fPIE -gdwarf-4 -Wall (Debian_Clang_11.0.1)
T:refclang++ -march=native -Os -fwrapv -Qunused-arguments -fPIC -fPIE -gdwarf-4 -Wall (Debian_Clang_11.0.1)

Compiler output


mul_gf2x.c: mul_gf2x.c:13:12: warning: implicit declaration of function '_mm_cvtsi128_si64x' is invalid in C99 [-Wimplicit-function-declaration]
mul_gf2x.c:     return MUL64LOW(x,y,0);
mul_gf2x.c:            ^
mul_gf2x.c: ./mul_gf2x.h:905:27: note: expanded from macro 'MUL64LOW'
mul_gf2x.c: #define MUL64LOW(x,y,pos) _mm_cvtsi128_si64x(_mm_clmulepi64_si128(x, y, pos))
mul_gf2x.c:                           ^
mul_gf2x.c: 1 warning generated.
sqr_gf2x.c: sqr_gf2x.c:27:12: warning: implicit declaration of function '_mm_cvtsi128_si64x' is invalid in C99 [-Wimplicit-function-declaration]
sqr_gf2x.c:     return _mm_cvtsi128_si64x(_mm_clmulepi64_si128(x,x,0));
sqr_gf2x.c:            ^
sqr_gf2x.c: sqr_gf2x.c:316:12: warning: implicit declaration of function '_mm_cvtsi128_si64x' is invalid in C99 [-Wimplicit-function-declaration]
sqr_gf2x.c:     return SQR64LOW(x,0);
sqr_gf2x.c:            ^
sqr_gf2x.c: ./sqr_gf2x.h:250:25: note: expanded from macro 'SQR64LOW'
sqr_gf2x.c: #define SQR64LOW(x,pos) _mm_cvtsi128_si64x(_mm_clmulepi64_si128(x, x, pos))
sqr_gf2x.c:                         ^
sqr_gf2x.c: 2 warnings generated.
try.c: /usr/bin/ld: libcrypto_sign_bluegemss256.a(mul_gf2x.o): in function `BlueGeMSS_256U_mul64low':
try.c: .../supercop-data/rome0/amd64/try/c/clang_-march=native_-O2_-fwrapv_-Qunused-arguments_-fPIC_-fPIE_-gdwarf-4_-Wall/timingleaks/crypto_sign/bluegemss256/skylake/work/mul_gf2x.c:13: undefined reference to `_mm_cvtsi128_si64x'
try.c: /usr/bin/ld: libcrypto_sign_bluegemss256.a(sqr_gf2x.o): in function `BlueGeMSS_256U_sqr64low':
try.c: .../supercop-data/rome0/amd64/try/c/clang_-march=native_-O2_-fwrapv_-Qunused-arguments_-fPIC_-fPIE_-gdwarf-4_-Wall/timingleaks/crypto_sign/bluegemss256/skylake/work/sqr_gf2x.c:27: undefined reference to `_mm_cvtsi128_si64x'
try.c: /usr/bin/ld: libcrypto_sign_bluegemss256.a(sqr_gf2x.o): in function `BlueGeMSS_256U_old_square64low':
try.c: .../supercop-data/rome0/amd64/try/c/clang_-march=native_-O2_-fwrapv_-Qunused-arguments_-fPIC_-fPIE_-gdwarf-4_-Wall/timingleaks/crypto_sign/bluegemss256/skylake/work/sqr_gf2x.c:316: undefined reference to `_mm_cvtsi128_si64x'
try.c: clang: error: linker command failed with exit code 1 (use -v to see invocation)

Number of similar (implementation,compiler) pairs: 1, namely:
ImplementationCompiler
T:skylakeclang -march=native -O2 -fwrapv -Qunused-arguments -fPIC -fPIE -gdwarf-4 -Wall (Debian_Clang_11.0.1)

Compiler output


mul_gf2x.c: mul_gf2x.c:13:12: warning: implicit declaration of function '_mm_cvtsi128_si64x' is invalid in C99 [-Wimplicit-function-declaration]
mul_gf2x.c:     return MUL64LOW(x,y,0);
mul_gf2x.c:            ^
mul_gf2x.c: ./mul_gf2x.h:905:27: note: expanded from macro 'MUL64LOW'
mul_gf2x.c: #define MUL64LOW(x,y,pos) _mm_cvtsi128_si64x(_mm_clmulepi64_si128(x, y, pos))
mul_gf2x.c:                           ^
mul_gf2x.c: 1 warning generated.
sqr_gf2x.c: sqr_gf2x.c:27:12: warning: implicit declaration of function '_mm_cvtsi128_si64x' is invalid in C99 [-Wimplicit-function-declaration]
sqr_gf2x.c:     return _mm_cvtsi128_si64x(_mm_clmulepi64_si128(x,x,0));
sqr_gf2x.c:            ^
sqr_gf2x.c: sqr_gf2x.c:316:12: warning: implicit declaration of function '_mm_cvtsi128_si64x' is invalid in C99 [-Wimplicit-function-declaration]
sqr_gf2x.c:     return SQR64LOW(x,0);
sqr_gf2x.c:            ^
sqr_gf2x.c: ./sqr_gf2x.h:250:25: note: expanded from macro 'SQR64LOW'
sqr_gf2x.c: #define SQR64LOW(x,pos) _mm_cvtsi128_si64x(_mm_clmulepi64_si128(x, x, pos))
sqr_gf2x.c:                         ^
sqr_gf2x.c: 2 warnings generated.
try.c: /usr/bin/ld: libcrypto_sign_bluegemss256.a(mul_gf2x.o): in function `BlueGeMSS_256U_mul64low':
try.c: .../supercop-data/rome0/amd64/try/c/clang_-march=native_-O3_-fwrapv_-Qunused-arguments_-fPIC_-fPIE_-gdwarf-4_-Wall/timingleaks/crypto_sign/bluegemss256/skylake/work/mul_gf2x.c:13: undefined reference to `_mm_cvtsi128_si64x'
try.c: /usr/bin/ld: libcrypto_sign_bluegemss256.a(sqr_gf2x.o): in function `BlueGeMSS_256U_sqr64low':
try.c: .../supercop-data/rome0/amd64/try/c/clang_-march=native_-O3_-fwrapv_-Qunused-arguments_-fPIC_-fPIE_-gdwarf-4_-Wall/timingleaks/crypto_sign/bluegemss256/skylake/work/sqr_gf2x.c:27: undefined reference to `_mm_cvtsi128_si64x'
try.c: /usr/bin/ld: libcrypto_sign_bluegemss256.a(sqr_gf2x.o): in function `BlueGeMSS_256U_old_square64low':
try.c: .../supercop-data/rome0/amd64/try/c/clang_-march=native_-O3_-fwrapv_-Qunused-arguments_-fPIC_-fPIE_-gdwarf-4_-Wall/timingleaks/crypto_sign/bluegemss256/skylake/work/sqr_gf2x.c:316: undefined reference to `_mm_cvtsi128_si64x'
try.c: clang: error: linker command failed with exit code 1 (use -v to see invocation)

Number of similar (implementation,compiler) pairs: 1, namely:
ImplementationCompiler
T:skylakeclang -march=native -O3 -fwrapv -Qunused-arguments -fPIC -fPIE -gdwarf-4 -Wall (Debian_Clang_11.0.1)

Compiler output


mul_gf2x.c: mul_gf2x.c:13:12: warning: implicit declaration of function '_mm_cvtsi128_si64x' is invalid in C99 [-Wimplicit-function-declaration]
mul_gf2x.c:     return MUL64LOW(x,y,0);
mul_gf2x.c:            ^
mul_gf2x.c: ./mul_gf2x.h:905:27: note: expanded from macro 'MUL64LOW'
mul_gf2x.c: #define MUL64LOW(x,y,pos) _mm_cvtsi128_si64x(_mm_clmulepi64_si128(x, y, pos))
mul_gf2x.c:                           ^
mul_gf2x.c: 1 warning generated.
sqr_gf2x.c: sqr_gf2x.c:27:12: warning: implicit declaration of function '_mm_cvtsi128_si64x' is invalid in C99 [-Wimplicit-function-declaration]
sqr_gf2x.c:     return _mm_cvtsi128_si64x(_mm_clmulepi64_si128(x,x,0));
sqr_gf2x.c:            ^
sqr_gf2x.c: sqr_gf2x.c:316:12: warning: implicit declaration of function '_mm_cvtsi128_si64x' is invalid in C99 [-Wimplicit-function-declaration]
sqr_gf2x.c:     return SQR64LOW(x,0);
sqr_gf2x.c:            ^
sqr_gf2x.c: ./sqr_gf2x.h:250:25: note: expanded from macro 'SQR64LOW'
sqr_gf2x.c: #define SQR64LOW(x,pos) _mm_cvtsi128_si64x(_mm_clmulepi64_si128(x, x, pos))
sqr_gf2x.c:                         ^
sqr_gf2x.c: 2 warnings generated.
try.c: /usr/bin/ld: libcrypto_sign_bluegemss256.a(mul_gf2x.o): in function `BlueGeMSS_256U_mul64low':
try.c: .../supercop-data/rome0/amd64/try/c/clang_-march=native_-O_-fwrapv_-Qunused-arguments_-fPIC_-fPIE_-gdwarf-4_-Wall/timingleaks/crypto_sign/bluegemss256/skylake/work/mul_gf2x.c:13: undefined reference to `_mm_cvtsi128_si64x'
try.c: /usr/bin/ld: libcrypto_sign_bluegemss256.a(sqr_gf2x.o): in function `BlueGeMSS_256U_sqr64low':
try.c: .../supercop-data/rome0/amd64/try/c/clang_-march=native_-O_-fwrapv_-Qunused-arguments_-fPIC_-fPIE_-gdwarf-4_-Wall/timingleaks/crypto_sign/bluegemss256/skylake/work/sqr_gf2x.c:27: undefined reference to `_mm_cvtsi128_si64x'
try.c: /usr/bin/ld: libcrypto_sign_bluegemss256.a(sqr_gf2x.o): in function `BlueGeMSS_256U_old_square64low':
try.c: .../supercop-data/rome0/amd64/try/c/clang_-march=native_-O_-fwrapv_-Qunused-arguments_-fPIC_-fPIE_-gdwarf-4_-Wall/timingleaks/crypto_sign/bluegemss256/skylake/work/sqr_gf2x.c:316: undefined reference to `_mm_cvtsi128_si64x'
try.c: clang: error: linker command failed with exit code 1 (use -v to see invocation)

Number of similar (implementation,compiler) pairs: 1, namely:
ImplementationCompiler
T:skylakeclang -march=native -O -fwrapv -Qunused-arguments -fPIC -fPIE -gdwarf-4 -Wall (Debian_Clang_11.0.1)

Compiler output


mul_gf2x.c: mul_gf2x.c:13:12: warning: implicit declaration of function '_mm_cvtsi128_si64x' is invalid in C99 [-Wimplicit-function-declaration]
mul_gf2x.c:     return MUL64LOW(x,y,0);
mul_gf2x.c:            ^
mul_gf2x.c: ./mul_gf2x.h:905:27: note: expanded from macro 'MUL64LOW'
mul_gf2x.c: #define MUL64LOW(x,y,pos) _mm_cvtsi128_si64x(_mm_clmulepi64_si128(x, y, pos))
mul_gf2x.c:                           ^
mul_gf2x.c: 1 warning generated.
sqr_gf2x.c: sqr_gf2x.c:27:12: warning: implicit declaration of function '_mm_cvtsi128_si64x' is invalid in C99 [-Wimplicit-function-declaration]
sqr_gf2x.c:     return _mm_cvtsi128_si64x(_mm_clmulepi64_si128(x,x,0));
sqr_gf2x.c:            ^
sqr_gf2x.c: sqr_gf2x.c:316:12: warning: implicit declaration of function '_mm_cvtsi128_si64x' is invalid in C99 [-Wimplicit-function-declaration]
sqr_gf2x.c:     return SQR64LOW(x,0);
sqr_gf2x.c:            ^
sqr_gf2x.c: ./sqr_gf2x.h:250:25: note: expanded from macro 'SQR64LOW'
sqr_gf2x.c: #define SQR64LOW(x,pos) _mm_cvtsi128_si64x(_mm_clmulepi64_si128(x, x, pos))
sqr_gf2x.c:                         ^
sqr_gf2x.c: 2 warnings generated.
try.c: /usr/bin/ld: libcrypto_sign_bluegemss256.a(mul_gf2x.o): in function `BlueGeMSS_256U_mul64low':
try.c: .../supercop-data/rome0/amd64/try/c/clang_-march=native_-Os_-fwrapv_-Qunused-arguments_-fPIC_-fPIE_-gdwarf-4_-Wall/timingleaks/crypto_sign/bluegemss256/skylake/work/mul_gf2x.c:13: undefined reference to `_mm_cvtsi128_si64x'
try.c: /usr/bin/ld: libcrypto_sign_bluegemss256.a(sqr_gf2x.o): in function `BlueGeMSS_256U_sqr64low':
try.c: .../supercop-data/rome0/amd64/try/c/clang_-march=native_-Os_-fwrapv_-Qunused-arguments_-fPIC_-fPIE_-gdwarf-4_-Wall/timingleaks/crypto_sign/bluegemss256/skylake/work/sqr_gf2x.c:27: undefined reference to `_mm_cvtsi128_si64x'
try.c: /usr/bin/ld: libcrypto_sign_bluegemss256.a(sqr_gf2x.o): in function `BlueGeMSS_256U_old_square64low':
try.c: .../supercop-data/rome0/amd64/try/c/clang_-march=native_-Os_-fwrapv_-Qunused-arguments_-fPIC_-fPIE_-gdwarf-4_-Wall/timingleaks/crypto_sign/bluegemss256/skylake/work/sqr_gf2x.c:316: undefined reference to `_mm_cvtsi128_si64x'
try.c: clang: error: linker command failed with exit code 1 (use -v to see invocation)

Number of similar (implementation,compiler) pairs: 1, namely:
ImplementationCompiler
T:skylakeclang -march=native -Os -fwrapv -Qunused-arguments -fPIC -fPIE -gdwarf-4 -Wall (Debian_Clang_11.0.1)