Implementation notes: amd64, rome0, crypto_kem/rqc256

Computer: rome0
Microarchitecture: amd64; Zen 2 (830f10)
Architecture: amd64
CPU ID: AuthenticAMD-00830f10-178bfbff
SUPERCOP version: 20240425
Operation: crypto_kem
Primitive: rqc256
TimeObject sizeTest sizeImplementationCompilerBenchmark dateSUPERCOP version
1748602738034 0 2492234 908 1720T:avxclang_-march=native_-O2_-fomit-frame-pointer_-fwrapv_-Qunused-arguments_-fPIC_-fPIE2024042520240425
1801198440458 0 2494770 908 1720T:avxclang_-march=native_-O3_-fomit-frame-pointer_-fwrapv_-Qunused-arguments_-fPIC_-fPIE2024042520240425
1849717043151 0 2497709 884 1784T:avxgcc_-march=native_-mtune=native_-O3_-fomit-frame-pointer_-fwrapv_-fPIC_-fPIE2024042520240425
1901731630051 0 2481690 892 1720T:avxclang_-march=native_-Os_-fomit-frame-pointer_-fwrapv_-Qunused-arguments_-fPIC_-fPIE2024042520240425
1904205638710 0 2491645 884 1784T:avxgcc_-march=native_-mtune=native_-O2_-fomit-frame-pointer_-fwrapv_-fPIC_-fPIE2024042520240425
1995483130937 0 2482938 892 1720T:avxclang_-march=native_-O_-fomit-frame-pointer_-fwrapv_-Qunused-arguments_-fPIC_-fPIE2024042520240425
2047157531107 0 2483237 884 1784T:avxgcc_-march=native_-mtune=native_-O_-fomit-frame-pointer_-fwrapv_-fPIC_-fPIE2024042520240425
2097247227429 0 2478533 876 1752T:avxgcc_-march=native_-mtune=native_-Os_-fomit-frame-pointer_-fwrapv_-fPIC_-fPIE2024042520240425

Compiler output

Implementation: T:avx
Security model: timingleaks
Compiler: clang -mcpu=native -O3 -fomit-frame-pointer -fwrapv -Qunused-arguments -fPIC -fPIE
rbc_elt.c: rbc_elt.c:526:19: error: '__builtin_ia32_pclmulqdq128' needs target feature pclmul
rbc_elt.c: __m128i a0_b0 = _mm_clmulepi64_si128(a, b, 0x00);
rbc_elt.c: ^
rbc_elt.c: /usr/lib/llvm-11/lib/clang/11.0.1/include/__wmmintrin_pclmul.h:45:13: note: expanded from macro '_mm_clmulepi64_si128'
rbc_elt.c: ((__m128i)__builtin_ia32_pclmulqdq128((__v2di)(__m128i)(X), \
rbc_elt.c: ^
rbc_elt.c: rbc_elt.c:528:19: error: '__builtin_ia32_pclmulqdq128' needs target feature pclmul
rbc_elt.c: __m128i a0_b1 = _mm_clmulepi64_si128(a, b, 0x10);
rbc_elt.c: ^
rbc_elt.c: /usr/lib/llvm-11/lib/clang/11.0.1/include/__wmmintrin_pclmul.h:45:13: note: expanded from macro '_mm_clmulepi64_si128'
rbc_elt.c: ((__m128i)__builtin_ia32_pclmulqdq128((__v2di)(__m128i)(X), \
rbc_elt.c: ^
rbc_elt.c: rbc_elt.c:529:19: error: '__builtin_ia32_pclmulqdq128' needs target feature pclmul
rbc_elt.c: __m128i a1_b0 = _mm_clmulepi64_si128(a, b, 0x01);
rbc_elt.c: ^
rbc_elt.c: /usr/lib/llvm-11/lib/clang/11.0.1/include/__wmmintrin_pclmul.h:45:13: note: expanded from macro '_mm_clmulepi64_si128'
rbc_elt.c: ((__m128i)__builtin_ia32_pclmulqdq128((__v2di)(__m128i)(X), \
rbc_elt.c: ^
rbc_elt.c: rbc_elt.c:531:19: error: '__builtin_ia32_pclmulqdq128' needs target feature pclmul
rbc_elt.c: __m128i a0_b2 = _mm_clmulepi64_si128(a, d, 0x00);
rbc_elt.c: ^
rbc_elt.c: /usr/lib/llvm-11/lib/clang/11.0.1/include/__wmmintrin_pclmul.h:45:13: note: expanded from macro '_mm_clmulepi64_si128'
rbc_elt.c: ((__m128i)__builtin_ia32_pclmulqdq128((__v2di)(__m128i)(X), \
rbc_elt.c: ^
rbc_elt.c: rbc_elt.c:532:19: error: '__builtin_ia32_pclmulqdq128' needs target feature pclmul
rbc_elt.c: ...

Number of similar (compiler,implementation) pairs: 1, namely:
CompilerImplementations
clang -mcpu=native -O3 -fomit-frame-pointer -fwrapv -Qunused-arguments -fPIC -fPIE T:avx

Compiler output

Implementation: T:ref
Security model: timingleaks
Compiler: clang -march=native -O2 -fomit-frame-pointer -fwrapv -Qunused-arguments -fPIC -fPIE
try.c: /usr/bin/ld: libcrypto_kem_rqc256.a(parsing.o):(.bss+0x0): multiple definition of `RBC_SQR_LOOKUP_TABLE'; libcrypto_kem_rqc256.a(kem.o):(.bss+0x0): first defined here
try.c: /usr/bin/ld: libcrypto_kem_rqc256.a(rbc_elt.o):(.bss+0x10): multiple definition of `RBC_SQR_LOOKUP_TABLE'; libcrypto_kem_rqc256.a(kem.o):(.bss+0x0): first defined here
try.c: /usr/bin/ld: libcrypto_kem_rqc256.a(rbc_qre.o):(.bss+0x20): multiple definition of `RBC_SQR_LOOKUP_TABLE'; libcrypto_kem_rqc256.a(kem.o):(.bss+0x0): first defined here
try.c: /usr/bin/ld: libcrypto_kem_rqc256.a(rbc_vec.o):(.bss+0x0): multiple definition of `RBC_SQR_LOOKUP_TABLE'; libcrypto_kem_rqc256.a(kem.o):(.bss+0x0): first defined here
try.c: /usr/bin/ld: libcrypto_kem_rqc256.a(rbc_vspace.o):(.bss+0x0): multiple definition of `RBC_SQR_LOOKUP_TABLE'; libcrypto_kem_rqc256.a(kem.o):(.bss+0x0): first defined here
try.c: /usr/bin/ld: libcrypto_kem_rqc256.a(rqc.o):(.bss+0x0): multiple definition of `RBC_SQR_LOOKUP_TABLE'; libcrypto_kem_rqc256.a(kem.o):(.bss+0x0): first defined here
try.c: /usr/bin/ld: libcrypto_kem_rqc256.a(gabidulin.o):(.bss+0x0): multiple definition of `RBC_SQR_LOOKUP_TABLE'; libcrypto_kem_rqc256.a(kem.o):(.bss+0x0): first defined here
try.c: /usr/bin/ld: libcrypto_kem_rqc256.a(qpoly.o):(.bss+0x0): multiple definition of `RBC_SQR_LOOKUP_TABLE'; libcrypto_kem_rqc256.a(kem.o):(.bss+0x0): first defined here
try.c: /usr/bin/ld: libcrypto_kem_rqc256.a(rbc_poly.o):(.bss+0x0): multiple definition of `RBC_SQR_LOOKUP_TABLE'; libcrypto_kem_rqc256.a(kem.o):(.bss+0x0): first defined here
try.c: clang: error: linker command failed with exit code 1 (use -v to see invocation)

Number of similar (compiler,implementation) pairs: 5, namely:
CompilerImplementations
clang -march=native -O2 -fomit-frame-pointer -fwrapv -Qunused-arguments -fPIC -fPIE T:ref
clang -march=native -O3 -fomit-frame-pointer -fwrapv -Qunused-arguments -fPIC -fPIE T:ref
clang -march=native -O -fomit-frame-pointer -fwrapv -Qunused-arguments -fPIC -fPIE T:ref
clang -march=native -Os -fomit-frame-pointer -fwrapv -Qunused-arguments -fPIC -fPIE T:ref
clang -mcpu=native -O3 -fomit-frame-pointer -fwrapv -Qunused-arguments -fPIC -fPIE T:ref

Compiler output

Implementation: T:ref
Security model: timingleaks
Compiler: gcc -march=native -mtune=native -O2 -fomit-frame-pointer -fwrapv -fPIC -fPIE
try.c: /usr/bin/ld: libcrypto_kem_rqc256.a(parsing.o):(.bss+0x0): multiple definition of `RBC_SQR_LOOKUP_TABLE'; libcrypto_kem_rqc256.a(kem.o):(.bss+0x0): first defined here
try.c: /usr/bin/ld: libcrypto_kem_rqc256.a(rbc_elt.o):(.bss+0x0): multiple definition of `RBC_SQR_LOOKUP_TABLE'; libcrypto_kem_rqc256.a(kem.o):(.bss+0x0): first defined here
try.c: /usr/bin/ld: libcrypto_kem_rqc256.a(rbc_qre.o):(.bss+0x0): multiple definition of `RBC_SQR_LOOKUP_TABLE'; libcrypto_kem_rqc256.a(kem.o):(.bss+0x0): first defined here
try.c: /usr/bin/ld: libcrypto_kem_rqc256.a(rbc_vec.o):(.bss+0x0): multiple definition of `RBC_SQR_LOOKUP_TABLE'; libcrypto_kem_rqc256.a(kem.o):(.bss+0x0): first defined here
try.c: /usr/bin/ld: libcrypto_kem_rqc256.a(rbc_vspace.o):(.bss+0x0): multiple definition of `RBC_SQR_LOOKUP_TABLE'; libcrypto_kem_rqc256.a(kem.o):(.bss+0x0): first defined here
try.c: /usr/bin/ld: libcrypto_kem_rqc256.a(rqc.o):(.bss+0x0): multiple definition of `RBC_SQR_LOOKUP_TABLE'; libcrypto_kem_rqc256.a(kem.o):(.bss+0x0): first defined here
try.c: /usr/bin/ld: libcrypto_kem_rqc256.a(gabidulin.o):(.bss+0x0): multiple definition of `RBC_SQR_LOOKUP_TABLE'; libcrypto_kem_rqc256.a(kem.o):(.bss+0x0): first defined here
try.c: /usr/bin/ld: libcrypto_kem_rqc256.a(qpoly.o):(.bss+0x0): multiple definition of `RBC_SQR_LOOKUP_TABLE'; libcrypto_kem_rqc256.a(kem.o):(.bss+0x0): first defined here
try.c: /usr/bin/ld: libcrypto_kem_rqc256.a(rbc_poly.o):(.bss+0x0): multiple definition of `RBC_SQR_LOOKUP_TABLE'; libcrypto_kem_rqc256.a(kem.o):(.bss+0x0): first defined here
try.c: collect2: error: ld returned 1 exit status

Number of similar (compiler,implementation) pairs: 4, namely:
CompilerImplementations
gcc -march=native -mtune=native -O2 -fomit-frame-pointer -fwrapv -fPIC -fPIE T:ref
gcc -march=native -mtune=native -O3 -fomit-frame-pointer -fwrapv -fPIC -fPIE T:ref
gcc -march=native -mtune=native -O -fomit-frame-pointer -fwrapv -fPIC -fPIE T:ref
gcc -march=native -mtune=native -Os -fomit-frame-pointer -fwrapv -fPIC -fPIE T:ref