Implementation notes: amd64, rome0, crypto_kem/r5nd5kem0d

Computer: rome0
Microarchitecture: amd64; Zen 2 (830f10)
Architecture: amd64
CPU ID: AuthenticAMD-00830f10-178bfbff
SUPERCOP version: 20240716
Operation: crypto_kem
Primitive: r5nd5kem0d
TimeObject sizeTest sizeImplementationCompilerBenchmark dateSUPERCOP version
52337732536 0 0172554 868 1752T:avx2gcc_-march=native_-mtune=native_-O3_-fwrapv_-fPIC_-fPIE_-gdwarf-4_-Wall2024062520240625
52442832536 0 0172554 868 1752T:optgcc_-march=native_-mtune=native_-O3_-fwrapv_-fPIC_-fPIE_-gdwarf-4_-Wall2024062520240625
54315925940 0 0169041 884 1720T:avx2clang_-march=native_-O2_-fwrapv_-Qunused-arguments_-fPIC_-fPIE_-gdwarf-4_-Wall2024062520240625
54559725940 0 0169041 884 1720T:optclang_-march=native_-O2_-fwrapv_-Qunused-arguments_-fPIC_-fPIE_-gdwarf-4_-Wall2024062520240625
54904629913 0 0169649 884 1720T:avx2clang_-march=native_-O3_-fwrapv_-Qunused-arguments_-fPIC_-fPIE_-gdwarf-4_-Wall2024062520240625
55317229913 0 0169649 884 1720T:optclang_-march=native_-O3_-fwrapv_-Qunused-arguments_-fPIC_-fPIE_-gdwarf-4_-Wall2024062520240625
67094831115 0 0169881 884 1720T:optclang_-mcpu=native_-O3_-fwrapv_-Qunused-arguments_-fPIC_-fPIE_-gdwarf-4_-Wall2024062520240625
67228531115 0 0169881 884 1720T:avx2clang_-mcpu=native_-O3_-fwrapv_-Qunused-arguments_-fPIC_-fPIE_-gdwarf-4_-Wall2024062520240625
223522220346 0 0164911 876 1720T:optclang_-march=native_-O_-fwrapv_-Qunused-arguments_-fPIC_-fPIE_-gdwarf-4_-Wall2024062520240625
223576620346 0 0164911 876 1720T:avx2clang_-march=native_-O_-fwrapv_-Qunused-arguments_-fPIC_-fPIE_-gdwarf-4_-Wall2024062520240625
225600620644 0 0164279 876 1720T:optclang_-march=native_-Os_-fwrapv_-Qunused-arguments_-fPIC_-fPIE_-gdwarf-4_-Wall2024062520240625
225870820644 0 0164279 876 1720T:avx2clang_-march=native_-Os_-fwrapv_-Qunused-arguments_-fPIC_-fPIE_-gdwarf-4_-Wall2024062520240625
244114121768 0 0165642 868 1752T:avx2gcc_-march=native_-mtune=native_-O_-fwrapv_-fPIC_-fPIE_-gdwarf-4_-Wall2024062520240625
244229321768 0 0165642 868 1752T:optgcc_-march=native_-mtune=native_-O_-fwrapv_-fPIC_-fPIE_-gdwarf-4_-Wall2024062520240625
247411723998 0 0167018 868 1752T:optgcc_-march=native_-mtune=native_-O2_-fwrapv_-fPIC_-fPIE_-gdwarf-4_-Wall2024062520240625
247436323998 0 0167018 868 1752T:avx2gcc_-march=native_-mtune=native_-O2_-fwrapv_-fPIC_-fPIE_-gdwarf-4_-Wall2024062520240625
277626320402 0 0163842 860 1720T:avx2gcc_-march=native_-mtune=native_-Os_-fwrapv_-fPIC_-fPIE_-gdwarf-4_-Wall2024062520240625
277707220402 0 0163842 860 1720T:optgcc_-march=native_-mtune=native_-Os_-fwrapv_-fPIC_-fPIE_-gdwarf-4_-Wall2024062520240625

Compiler output


a_fixed.c: In file included from a_fixed.c:10:
a_fixed.c: In file included from ./a_fixed.h:13:
a_fixed.c: ./r5_parameter_sets.h:139:2: warning: AVX2 not supported by platform [-W#warnings]
a_fixed.c: #warning AVX2 not supported by platform
a_fixed.c:  ^
a_fixed.c: 1 warning generated.
a_random.c: In file included from a_random.c:10:
a_random.c: In file included from ./a_random.h:13:
a_random.c: ./r5_parameter_sets.h:139:2: warning: AVX2 not supported by platform [-W#warnings]
a_random.c: #warning AVX2 not supported by platform
a_random.c:  ^
a_random.c: 1 warning generated.
cca_encrypt.c: In file included from cca_encrypt.c:11:
cca_encrypt.c: In file included from ./cca_encrypt.h:14:
cca_encrypt.c: ./r5_parameter_sets.h:139:2: warning: AVX2 not supported by platform [-W#warnings]
cca_encrypt.c: #warning AVX2 not supported by platform
cca_encrypt.c:  ^
cca_encrypt.c: 1 warning generated.
cpa_kem.c: In file included from cpa_kem.c:12:
cpa_kem.c: In file included from ./cpa_kem.h:13:
cpa_kem.c: ./r5_parameter_sets.h:139:2: warning: AVX2 not supported by platform [-W#warnings]
cpa_kem.c: #warning AVX2 not supported by platform
cpa_kem.c:  ^
cpa_kem.c: 1 warning generated.
drbg.c: In file included from drbg.c:18:
drbg.c: In file included from ./drbg.h:13:
drbg.c: ./r5_parameter_sets.h:139:2: warning: AVX2 not supported by platform [-W#warnings]
drbg.c: #warning AVX2 not supported by platform
drbg.c:  ^
drbg.c: 1 warning generated.
matmul.c: In file included from matmul.c:8:
matmul.c: In file included from ./matmul.h:8:
matmul.c: ./r5_parameter_sets.h:139:2: warning: AVX2 not supported by platform [-W#warnings]
matmul.c: #warning AVX2 not supported by platform
matmul.c:  ^
matmul.c: 1 warning generated.
matmul_avx2.c: In file included from matmul_avx2.c:8:
matmul_avx2.c: In file included from ./matmul.h:8:
matmul_avx2.c: ./r5_parameter_sets.h:139:2: warning: AVX2 not supported by platform [-W#warnings]
matmul_avx2.c: #warning AVX2 not supported by platform
matmul_avx2.c:  ^
matmul_avx2.c: 1 warning generated.
matmul_cm.c: In file included from matmul_cm.c:7:
matmul_cm.c: In file included from ./matmul.h:8:
matmul_cm.c: ./r5_parameter_sets.h:139:2: warning: AVX2 not supported by platform [-W#warnings]
matmul_cm.c: #warning AVX2 not supported by platform
matmul_cm.c:  ^
matmul_cm.c: 1 warning generated.
probe_cm.c: In file included from probe_cm.c:6:
probe_cm.c: ./r5_parameter_sets.h:139:2: warning: AVX2 not supported by platform [-W#warnings]
probe_cm.c: #warning AVX2 not supported by platform
probe_cm.c:  ^
probe_cm.c: 1 warning generated.
r5_cca_kem.c: In file included from r5_cca_kem.c:7:
r5_cca_kem.c: ./r5_parameter_sets.h:139:2: warning: AVX2 not supported by platform [-W#warnings]
r5_cca_kem.c: #warning AVX2 not supported by platform
r5_cca_kem.c:  ^
r5_cca_kem.c: 1 warning generated.
r5_cca_pke.c: In file included from r5_cca_pke.c:12:
r5_cca_pke.c: ./r5_parameter_sets.h:139:2: warning: AVX2 not supported by platform [-W#warnings]
r5_cca_pke.c: #warning AVX2 not supported by platform
r5_cca_pke.c:  ^
r5_cca_pke.c: 1 warning generated.
r5_cpa_kem.c: In file included from r5_cpa_kem.c:9:
r5_cpa_kem.c: ./r5_parameter_sets.h:139:2: warning: AVX2 not supported by platform [-W#warnings]
r5_cpa_kem.c: #warning AVX2 not supported by platform
r5_cpa_kem.c:  ^
r5_cpa_kem.c: 1 warning generated.
r5_cpa_pke_n1.c: In file included from r5_cpa_pke_n1.c:6:
r5_cpa_pke_n1.c: ./r5_parameter_sets.h:139:2: warning: AVX2 not supported by platform [-W#warnings]
r5_cpa_pke_n1.c: #warning AVX2 not supported by platform
r5_cpa_pke_n1.c:  ^
r5_cpa_pke_n1.c: 1 warning generated.
r5_cpa_pke_nd.c: In file included from r5_cpa_pke_nd.c:7:
r5_cpa_pke_nd.c: ./r5_parameter_sets.h:139:2: warning: AVX2 not supported by platform [-W#warnings]
r5_cpa_pke_nd.c: #warning AVX2 not supported by platform
r5_cpa_pke_nd.c:  ^
r5_cpa_pke_nd.c: 1 warning generated.
r5_dem.c: In file included from r5_dem.c:11:
r5_dem.c: ./r5_parameter_sets.h:139:2: warning: AVX2 not supported by platform [-W#warnings]
r5_dem.c: #warning AVX2 not supported by platform
r5_dem.c:  ^
r5_dem.c: 1 warning generated.
ringmul.c: In file included from ringmul.c:8:
ringmul.c: In file included from ./ringmul.h:9:
ringmul.c: ./r5_parameter_sets.h:139:2: warning: AVX2 not supported by platform [-W#warnings]
ringmul.c: #warning AVX2 not supported by platform
ringmul.c:  ^
ringmul.c: 1 warning generated.
ringmul_cm.c: In file included from ringmul_cm.c:8:
ringmul_cm.c: In file included from ./ringmul.h:9:
ringmul_cm.c: ./r5_parameter_sets.h:139:2: warning: AVX2 not supported by platform [-W#warnings]
ringmul_cm.c: #warning AVX2 not supported by platform
ringmul_cm.c:  ^
ringmul_cm.c: 1 warning generated.

Number of similar (implementation,compiler) pairs: 1, namely:
ImplementationCompiler
T:avx2clang -mcpu=native -O3 -fwrapv -Qunused-arguments -fPIC -fPIE -gdwarf-4 -Wall (Debian_Clang_11.0.1)

Compiler output


try.c: /usr/bin/ld: libcrypto_kem_r5nd5kem0d.a(parameters.o):.../supercop-data/rome0/amd64/try/c/clang_-march=native_-O2_-fwrapv_-Qunused-arguments_-fPIC_-fPIE_-gdwarf-4_-Wall/timingleaks/crypto_kem/r5nd5kem0d/ref/work/./r5_parameter_sets.h:66: multiple definition of `r5_parameter_set_names'; libcrypto_kem_r5nd5kem0d.a(cpa_kem.o):.../supercop-data/rome0/amd64/try/c/clang_-march=native_-O2_-fwrapv_-Qunused-arguments_-fPIC_-fPIE_-gdwarf-4_-Wall/timingleaks/crypto_kem/r5nd5kem0d/ref/work/./r5_parameter_sets.h:66: first defined here
try.c: /usr/bin/ld: libcrypto_kem_r5nd5kem0d.a(parameters.o):.../supercop-data/rome0/amd64/try/c/clang_-march=native_-O2_-fwrapv_-Qunused-arguments_-fPIC_-fPIE_-gdwarf-4_-Wall/timingleaks/crypto_kem/r5nd5kem0d/ref/work/./r5_parameter_sets.h:63: multiple definition of `r5_parameter_sets'; libcrypto_kem_r5nd5kem0d.a(cpa_kem.o):.../supercop-data/rome0/amd64/try/c/clang_-march=native_-O2_-fwrapv_-Qunused-arguments_-fPIC_-fPIE_-gdwarf-4_-Wall/timingleaks/crypto_kem/r5nd5kem0d/ref/work/./r5_parameter_sets.h:63: first defined here
try.c: /usr/bin/ld: libcrypto_kem_r5nd5kem0d.a(r5_cpa_kem.o):.../supercop-data/rome0/amd64/try/c/clang_-march=native_-O2_-fwrapv_-Qunused-arguments_-fPIC_-fPIE_-gdwarf-4_-Wall/timingleaks/crypto_kem/r5nd5kem0d/ref/work/./r5_parameter_sets.h:66: multiple definition of `r5_parameter_set_names'; libcrypto_kem_r5nd5kem0d.a(cpa_kem.o):.../supercop-data/rome0/amd64/try/c/clang_-march=native_-O2_-fwrapv_-Qunused-arguments_-fPIC_-fPIE_-gdwarf-4_-Wall/timingleaks/crypto_kem/r5nd5kem0d/ref/work/./r5_parameter_sets.h:66: first defined here
try.c: /usr/bin/ld: libcrypto_kem_r5nd5kem0d.a(r5_cpa_kem.o):.../supercop-data/rome0/amd64/try/c/clang_-march=native_-O2_-fwrapv_-Qunused-arguments_-fPIC_-fPIE_-gdwarf-4_-Wall/timingleaks/crypto_kem/r5nd5kem0d/ref/work/./r5_parameter_sets.h:63: multiple definition of `r5_parameter_sets'; libcrypto_kem_r5nd5kem0d.a(cpa_kem.o):.../supercop-data/rome0/amd64/try/c/clang_-march=native_-O2_-fwrapv_-Qunused-arguments_-fPIC_-fPIE_-gdwarf-4_-Wall/timingleaks/crypto_kem/r5nd5kem0d/ref/work/./r5_parameter_sets.h:63: first defined here
try.c: /usr/bin/ld: libcrypto_kem_r5nd5kem0d.a(r5_cpa_pke.o):.../supercop-data/rome0/amd64/try/c/clang_-march=native_-O2_-fwrapv_-Qunused-arguments_-fPIC_-fPIE_-gdwarf-4_-Wall/timingleaks/crypto_kem/r5nd5kem0d/ref/work/./r5_parameter_sets.h:66: multiple definition of `r5_parameter_set_names'; libcrypto_kem_r5nd5kem0d.a(cpa_kem.o):.../supercop-data/rome0/amd64/try/c/clang_-march=native_-O2_-fwrapv_-Qunused-arguments_-fPIC_-fPIE_-gdwarf-4_-Wall/timingleaks/crypto_kem/r5nd5kem0d/ref/work/./r5_parameter_sets.h:66: first defined here
try.c: /usr/bin/ld: libcrypto_kem_r5nd5kem0d.a(r5_cpa_pke.o):.../supercop-data/rome0/amd64/try/c/clang_-march=native_-O2_-fwrapv_-Qunused-arguments_-fPIC_-fPIE_-gdwarf-4_-Wall/timingleaks/crypto_kem/r5nd5kem0d/ref/work/./r5_parameter_sets.h:63: multiple definition of `r5_parameter_sets'; libcrypto_kem_r5nd5kem0d.a(cpa_kem.o):.../supercop-data/rome0/amd64/try/c/clang_-march=native_-O2_-fwrapv_-Qunused-arguments_-fPIC_-fPIE_-gdwarf-4_-Wall/timingleaks/crypto_kem/r5nd5kem0d/ref/work/./r5_parameter_sets.h:63: first defined here
try.c: /usr/bin/ld: libcrypto_kem_r5nd5kem0d.a(r5_core.o):.../supercop-data/rome0/amd64/try/c/clang_-march=native_-O2_-fwrapv_-Qunused-arguments_-fPIC_-fPIE_-gdwarf-4_-Wall/timingleaks/crypto_kem/r5nd5kem0d/ref/work/./r5_parameter_sets.h:66: multiple definition of `r5_parameter_set_names'; libcrypto_kem_r5nd5kem0d.a(cpa_kem.o):.../supercop-data/rome0/amd64/try/c/clang_-march=native_-O2_-fwrapv_-Qunused-arguments_-fPIC_-fPIE_-gdwarf-4_-Wall/timingleaks/crypto_kem/r5nd5kem0d/ref/work/./r5_parameter_sets.h:66: first defined here
try.c: /usr/bin/ld: libcrypto_kem_r5nd5kem0d.a(r5_core.o):.../supercop-data/rome0/amd64/try/c/clang_-march=native_-O2_-fwrapv_-Qunused-arguments_-fPIC_-fPIE_-gdwarf-4_-Wall/timingleaks/crypto_kem/r5nd5kem0d/ref/work/./r5_parameter_sets.h:63: multiple definition of `r5_parameter_sets'; libcrypto_kem_r5nd5kem0d.a(cpa_kem.o):.../supercop-data/rome0/amd64/try/c/clang_-march=native_-O2_-fwrapv_-Qunused-arguments_-fPIC_-fPIE_-gdwarf-4_-Wall/timingleaks/crypto_kem/r5nd5kem0d/ref/work/./r5_parameter_sets.h:63: first defined here
try.c: /usr/bin/ld: libcrypto_kem_r5nd5kem0d.a(a_fixed.o):.../supercop-data/rome0/amd64/try/c/clang_-march=native_-O2_-fwrapv_-Qunused-arguments_-fPIC_-fPIE_-gdwarf-4_-Wall/timingleaks/crypto_kem/r5nd5kem0d/ref/work/./r5_parameter_sets.h:66: multiple definition of `r5_parameter_set_names'; libcrypto_kem_r5nd5kem0d.a(cpa_kem.o):.../supercop-data/rome0/amd64/try/c/clang_-march=native_-O2_-fwrapv_-Qunused-arguments_-fPIC_-fPIE_-gdwarf-4_-Wall/timingleaks/crypto_kem/r5nd5kem0d/ref/work/./r5_parameter_sets.h:66: first defined here
try.c: /usr/bin/ld: libcrypto_kem_r5nd5kem0d.a(a_fixed.o):.../supercop-data/rome0/amd64/try/c/clang_-march=native_-O2_-fwrapv_-Qunused-arguments_-fPIC_-fPIE_-gdwarf-4_-Wall/timingleaks/crypto_kem/r5nd5kem0d/ref/work/./r5_parameter_sets.h:63: multiple definition of `r5_parameter_sets'; libcrypto_kem_r5nd5kem0d.a(cpa_kem.o):.../supercop-data/rome0/amd64/try/c/clang_-march=native_-O2_-fwrapv_-Qunused-arguments_-fPIC_-fPIE_-gdwarf-4_-Wall/timingleaks/crypto_kem/r5nd5kem0d/ref/work/./r5_parameter_sets.h:63: first defined here
try.c: /usr/bin/ld: libcrypto_kem_r5nd5kem0d.a(a_random.o):.../supercop-data/rome0/amd64/try/c/clang_-march=native_-O2_-fwrapv_-Qunused-arguments_-fPIC_-fPIE_-gdwarf-4_-Wall/timingleaks/crypto_kem/r5nd5kem0d/ref/work/./r5_parameter_sets.h:66: multiple definition of `r5_parameter_set_names'; libcrypto_kem_r5nd5kem0d.a(cpa_kem.o):.../supercop-data/rome0/amd64/try/c/clang_-march=native_-O2_-fwrapv_-Qunused-arguments_-fPIC_-fPIE_-gdwarf-4_-Wall/timingleaks/crypto_kem/r5nd5kem0d/ref/work/./r5_parameter_sets.h:66: first defined here
try.c: /usr/bin/ld: libcrypto_kem_r5nd5kem0d.a(a_random.o):.../supercop-data/rome0/amd64/try/c/clang_-march=native_-O2_-fwrapv_-Qunused-arguments_-fPIC_-fPIE_-gdwarf-4_-Wall/timingleaks/crypto_kem/r5nd5kem0d/ref/work/./r5_parameter_sets.h:63: multiple definition of `r5_parameter_sets'; libcrypto_kem_r5nd5kem0d.a(cpa_kem.o):.../supercop-data/rome0/amd64/try/c/clang_-march=native_-O2_-fwrapv_-Qunused-arguments_-fPIC_-fPIE_-gdwarf-4_-Wall/timingleaks/crypto_kem/r5nd5kem0d/ref/work/./r5_parameter_sets.h:63: first defined here
try.c: clang: error: linker command failed with exit code 1 (use -v to see invocation)

Number of similar (implementation,compiler) pairs: 1, namely:
ImplementationCompiler
T:refclang -march=native -O2 -fwrapv -Qunused-arguments -fPIC -fPIE -gdwarf-4 -Wall (Debian_Clang_11.0.1)

Compiler output


try.c: /usr/bin/ld: libcrypto_kem_r5nd5kem0d.a(parameters.o):.../supercop-data/rome0/amd64/try/c/clang_-march=native_-O3_-fwrapv_-Qunused-arguments_-fPIC_-fPIE_-gdwarf-4_-Wall/timingleaks/crypto_kem/r5nd5kem0d/ref/work/./r5_parameter_sets.h:66: multiple definition of `r5_parameter_set_names'; libcrypto_kem_r5nd5kem0d.a(cpa_kem.o):.../supercop-data/rome0/amd64/try/c/clang_-march=native_-O3_-fwrapv_-Qunused-arguments_-fPIC_-fPIE_-gdwarf-4_-Wall/timingleaks/crypto_kem/r5nd5kem0d/ref/work/./r5_parameter_sets.h:66: first defined here
try.c: /usr/bin/ld: libcrypto_kem_r5nd5kem0d.a(parameters.o):.../supercop-data/rome0/amd64/try/c/clang_-march=native_-O3_-fwrapv_-Qunused-arguments_-fPIC_-fPIE_-gdwarf-4_-Wall/timingleaks/crypto_kem/r5nd5kem0d/ref/work/./r5_parameter_sets.h:63: multiple definition of `r5_parameter_sets'; libcrypto_kem_r5nd5kem0d.a(cpa_kem.o):.../supercop-data/rome0/amd64/try/c/clang_-march=native_-O3_-fwrapv_-Qunused-arguments_-fPIC_-fPIE_-gdwarf-4_-Wall/timingleaks/crypto_kem/r5nd5kem0d/ref/work/./r5_parameter_sets.h:63: first defined here
try.c: /usr/bin/ld: libcrypto_kem_r5nd5kem0d.a(r5_cpa_kem.o):.../supercop-data/rome0/amd64/try/c/clang_-march=native_-O3_-fwrapv_-Qunused-arguments_-fPIC_-fPIE_-gdwarf-4_-Wall/timingleaks/crypto_kem/r5nd5kem0d/ref/work/./r5_parameter_sets.h:66: multiple definition of `r5_parameter_set_names'; libcrypto_kem_r5nd5kem0d.a(cpa_kem.o):.../supercop-data/rome0/amd64/try/c/clang_-march=native_-O3_-fwrapv_-Qunused-arguments_-fPIC_-fPIE_-gdwarf-4_-Wall/timingleaks/crypto_kem/r5nd5kem0d/ref/work/./r5_parameter_sets.h:66: first defined here
try.c: /usr/bin/ld: libcrypto_kem_r5nd5kem0d.a(r5_cpa_kem.o):.../supercop-data/rome0/amd64/try/c/clang_-march=native_-O3_-fwrapv_-Qunused-arguments_-fPIC_-fPIE_-gdwarf-4_-Wall/timingleaks/crypto_kem/r5nd5kem0d/ref/work/./r5_parameter_sets.h:63: multiple definition of `r5_parameter_sets'; libcrypto_kem_r5nd5kem0d.a(cpa_kem.o):.../supercop-data/rome0/amd64/try/c/clang_-march=native_-O3_-fwrapv_-Qunused-arguments_-fPIC_-fPIE_-gdwarf-4_-Wall/timingleaks/crypto_kem/r5nd5kem0d/ref/work/./r5_parameter_sets.h:63: first defined here
try.c: /usr/bin/ld: libcrypto_kem_r5nd5kem0d.a(r5_cpa_pke.o):.../supercop-data/rome0/amd64/try/c/clang_-march=native_-O3_-fwrapv_-Qunused-arguments_-fPIC_-fPIE_-gdwarf-4_-Wall/timingleaks/crypto_kem/r5nd5kem0d/ref/work/./r5_parameter_sets.h:66: multiple definition of `r5_parameter_set_names'; libcrypto_kem_r5nd5kem0d.a(cpa_kem.o):.../supercop-data/rome0/amd64/try/c/clang_-march=native_-O3_-fwrapv_-Qunused-arguments_-fPIC_-fPIE_-gdwarf-4_-Wall/timingleaks/crypto_kem/r5nd5kem0d/ref/work/./r5_parameter_sets.h:66: first defined here
try.c: /usr/bin/ld: libcrypto_kem_r5nd5kem0d.a(r5_cpa_pke.o):.../supercop-data/rome0/amd64/try/c/clang_-march=native_-O3_-fwrapv_-Qunused-arguments_-fPIC_-fPIE_-gdwarf-4_-Wall/timingleaks/crypto_kem/r5nd5kem0d/ref/work/./r5_parameter_sets.h:63: multiple definition of `r5_parameter_sets'; libcrypto_kem_r5nd5kem0d.a(cpa_kem.o):.../supercop-data/rome0/amd64/try/c/clang_-march=native_-O3_-fwrapv_-Qunused-arguments_-fPIC_-fPIE_-gdwarf-4_-Wall/timingleaks/crypto_kem/r5nd5kem0d/ref/work/./r5_parameter_sets.h:63: first defined here
try.c: /usr/bin/ld: libcrypto_kem_r5nd5kem0d.a(r5_core.o):.../supercop-data/rome0/amd64/try/c/clang_-march=native_-O3_-fwrapv_-Qunused-arguments_-fPIC_-fPIE_-gdwarf-4_-Wall/timingleaks/crypto_kem/r5nd5kem0d/ref/work/./r5_parameter_sets.h:66: multiple definition of `r5_parameter_set_names'; libcrypto_kem_r5nd5kem0d.a(cpa_kem.o):.../supercop-data/rome0/amd64/try/c/clang_-march=native_-O3_-fwrapv_-Qunused-arguments_-fPIC_-fPIE_-gdwarf-4_-Wall/timingleaks/crypto_kem/r5nd5kem0d/ref/work/./r5_parameter_sets.h:66: first defined here
try.c: /usr/bin/ld: libcrypto_kem_r5nd5kem0d.a(r5_core.o):.../supercop-data/rome0/amd64/try/c/clang_-march=native_-O3_-fwrapv_-Qunused-arguments_-fPIC_-fPIE_-gdwarf-4_-Wall/timingleaks/crypto_kem/r5nd5kem0d/ref/work/./r5_parameter_sets.h:63: multiple definition of `r5_parameter_sets'; libcrypto_kem_r5nd5kem0d.a(cpa_kem.o):.../supercop-data/rome0/amd64/try/c/clang_-march=native_-O3_-fwrapv_-Qunused-arguments_-fPIC_-fPIE_-gdwarf-4_-Wall/timingleaks/crypto_kem/r5nd5kem0d/ref/work/./r5_parameter_sets.h:63: first defined here
try.c: /usr/bin/ld: libcrypto_kem_r5nd5kem0d.a(a_fixed.o):.../supercop-data/rome0/amd64/try/c/clang_-march=native_-O3_-fwrapv_-Qunused-arguments_-fPIC_-fPIE_-gdwarf-4_-Wall/timingleaks/crypto_kem/r5nd5kem0d/ref/work/./r5_parameter_sets.h:66: multiple definition of `r5_parameter_set_names'; libcrypto_kem_r5nd5kem0d.a(cpa_kem.o):.../supercop-data/rome0/amd64/try/c/clang_-march=native_-O3_-fwrapv_-Qunused-arguments_-fPIC_-fPIE_-gdwarf-4_-Wall/timingleaks/crypto_kem/r5nd5kem0d/ref/work/./r5_parameter_sets.h:66: first defined here
try.c: /usr/bin/ld: libcrypto_kem_r5nd5kem0d.a(a_fixed.o):.../supercop-data/rome0/amd64/try/c/clang_-march=native_-O3_-fwrapv_-Qunused-arguments_-fPIC_-fPIE_-gdwarf-4_-Wall/timingleaks/crypto_kem/r5nd5kem0d/ref/work/./r5_parameter_sets.h:63: multiple definition of `r5_parameter_sets'; libcrypto_kem_r5nd5kem0d.a(cpa_kem.o):.../supercop-data/rome0/amd64/try/c/clang_-march=native_-O3_-fwrapv_-Qunused-arguments_-fPIC_-fPIE_-gdwarf-4_-Wall/timingleaks/crypto_kem/r5nd5kem0d/ref/work/./r5_parameter_sets.h:63: first defined here
try.c: /usr/bin/ld: libcrypto_kem_r5nd5kem0d.a(a_random.o):.../supercop-data/rome0/amd64/try/c/clang_-march=native_-O3_-fwrapv_-Qunused-arguments_-fPIC_-fPIE_-gdwarf-4_-Wall/timingleaks/crypto_kem/r5nd5kem0d/ref/work/./r5_parameter_sets.h:66: multiple definition of `r5_parameter_set_names'; libcrypto_kem_r5nd5kem0d.a(cpa_kem.o):.../supercop-data/rome0/amd64/try/c/clang_-march=native_-O3_-fwrapv_-Qunused-arguments_-fPIC_-fPIE_-gdwarf-4_-Wall/timingleaks/crypto_kem/r5nd5kem0d/ref/work/./r5_parameter_sets.h:66: first defined here
try.c: /usr/bin/ld: libcrypto_kem_r5nd5kem0d.a(a_random.o):.../supercop-data/rome0/amd64/try/c/clang_-march=native_-O3_-fwrapv_-Qunused-arguments_-fPIC_-fPIE_-gdwarf-4_-Wall/timingleaks/crypto_kem/r5nd5kem0d/ref/work/./r5_parameter_sets.h:63: multiple definition of `r5_parameter_sets'; libcrypto_kem_r5nd5kem0d.a(cpa_kem.o):.../supercop-data/rome0/amd64/try/c/clang_-march=native_-O3_-fwrapv_-Qunused-arguments_-fPIC_-fPIE_-gdwarf-4_-Wall/timingleaks/crypto_kem/r5nd5kem0d/ref/work/./r5_parameter_sets.h:63: first defined here
try.c: clang: error: linker command failed with exit code 1 (use -v to see invocation)

Number of similar (implementation,compiler) pairs: 1, namely:
ImplementationCompiler
T:refclang -march=native -O3 -fwrapv -Qunused-arguments -fPIC -fPIE -gdwarf-4 -Wall (Debian_Clang_11.0.1)

Compiler output


try.c: /usr/bin/ld: libcrypto_kem_r5nd5kem0d.a(parameters.o):.../supercop-data/rome0/amd64/try/c/clang_-march=native_-O_-fwrapv_-Qunused-arguments_-fPIC_-fPIE_-gdwarf-4_-Wall/timingleaks/crypto_kem/r5nd5kem0d/ref/work/./r5_parameter_sets.h:66: multiple definition of `r5_parameter_set_names'; libcrypto_kem_r5nd5kem0d.a(cpa_kem.o):.../supercop-data/rome0/amd64/try/c/clang_-march=native_-O_-fwrapv_-Qunused-arguments_-fPIC_-fPIE_-gdwarf-4_-Wall/timingleaks/crypto_kem/r5nd5kem0d/ref/work/./r5_parameter_sets.h:66: first defined here
try.c: /usr/bin/ld: libcrypto_kem_r5nd5kem0d.a(parameters.o):.../supercop-data/rome0/amd64/try/c/clang_-march=native_-O_-fwrapv_-Qunused-arguments_-fPIC_-fPIE_-gdwarf-4_-Wall/timingleaks/crypto_kem/r5nd5kem0d/ref/work/./r5_parameter_sets.h:63: multiple definition of `r5_parameter_sets'; libcrypto_kem_r5nd5kem0d.a(cpa_kem.o):.../supercop-data/rome0/amd64/try/c/clang_-march=native_-O_-fwrapv_-Qunused-arguments_-fPIC_-fPIE_-gdwarf-4_-Wall/timingleaks/crypto_kem/r5nd5kem0d/ref/work/./r5_parameter_sets.h:63: first defined here
try.c: /usr/bin/ld: libcrypto_kem_r5nd5kem0d.a(r5_cpa_kem.o):.../supercop-data/rome0/amd64/try/c/clang_-march=native_-O_-fwrapv_-Qunused-arguments_-fPIC_-fPIE_-gdwarf-4_-Wall/timingleaks/crypto_kem/r5nd5kem0d/ref/work/./r5_parameter_sets.h:66: multiple definition of `r5_parameter_set_names'; libcrypto_kem_r5nd5kem0d.a(cpa_kem.o):.../supercop-data/rome0/amd64/try/c/clang_-march=native_-O_-fwrapv_-Qunused-arguments_-fPIC_-fPIE_-gdwarf-4_-Wall/timingleaks/crypto_kem/r5nd5kem0d/ref/work/./r5_parameter_sets.h:66: first defined here
try.c: /usr/bin/ld: libcrypto_kem_r5nd5kem0d.a(r5_cpa_kem.o):.../supercop-data/rome0/amd64/try/c/clang_-march=native_-O_-fwrapv_-Qunused-arguments_-fPIC_-fPIE_-gdwarf-4_-Wall/timingleaks/crypto_kem/r5nd5kem0d/ref/work/./r5_parameter_sets.h:63: multiple definition of `r5_parameter_sets'; libcrypto_kem_r5nd5kem0d.a(cpa_kem.o):.../supercop-data/rome0/amd64/try/c/clang_-march=native_-O_-fwrapv_-Qunused-arguments_-fPIC_-fPIE_-gdwarf-4_-Wall/timingleaks/crypto_kem/r5nd5kem0d/ref/work/./r5_parameter_sets.h:63: first defined here
try.c: /usr/bin/ld: libcrypto_kem_r5nd5kem0d.a(r5_cpa_pke.o):.../supercop-data/rome0/amd64/try/c/clang_-march=native_-O_-fwrapv_-Qunused-arguments_-fPIC_-fPIE_-gdwarf-4_-Wall/timingleaks/crypto_kem/r5nd5kem0d/ref/work/./r5_parameter_sets.h:66: multiple definition of `r5_parameter_set_names'; libcrypto_kem_r5nd5kem0d.a(cpa_kem.o):.../supercop-data/rome0/amd64/try/c/clang_-march=native_-O_-fwrapv_-Qunused-arguments_-fPIC_-fPIE_-gdwarf-4_-Wall/timingleaks/crypto_kem/r5nd5kem0d/ref/work/./r5_parameter_sets.h:66: first defined here
try.c: /usr/bin/ld: libcrypto_kem_r5nd5kem0d.a(r5_cpa_pke.o):.../supercop-data/rome0/amd64/try/c/clang_-march=native_-O_-fwrapv_-Qunused-arguments_-fPIC_-fPIE_-gdwarf-4_-Wall/timingleaks/crypto_kem/r5nd5kem0d/ref/work/./r5_parameter_sets.h:63: multiple definition of `r5_parameter_sets'; libcrypto_kem_r5nd5kem0d.a(cpa_kem.o):.../supercop-data/rome0/amd64/try/c/clang_-march=native_-O_-fwrapv_-Qunused-arguments_-fPIC_-fPIE_-gdwarf-4_-Wall/timingleaks/crypto_kem/r5nd5kem0d/ref/work/./r5_parameter_sets.h:63: first defined here
try.c: /usr/bin/ld: libcrypto_kem_r5nd5kem0d.a(r5_core.o):.../supercop-data/rome0/amd64/try/c/clang_-march=native_-O_-fwrapv_-Qunused-arguments_-fPIC_-fPIE_-gdwarf-4_-Wall/timingleaks/crypto_kem/r5nd5kem0d/ref/work/./r5_parameter_sets.h:66: multiple definition of `r5_parameter_set_names'; libcrypto_kem_r5nd5kem0d.a(cpa_kem.o):.../supercop-data/rome0/amd64/try/c/clang_-march=native_-O_-fwrapv_-Qunused-arguments_-fPIC_-fPIE_-gdwarf-4_-Wall/timingleaks/crypto_kem/r5nd5kem0d/ref/work/./r5_parameter_sets.h:66: first defined here
try.c: /usr/bin/ld: libcrypto_kem_r5nd5kem0d.a(r5_core.o):.../supercop-data/rome0/amd64/try/c/clang_-march=native_-O_-fwrapv_-Qunused-arguments_-fPIC_-fPIE_-gdwarf-4_-Wall/timingleaks/crypto_kem/r5nd5kem0d/ref/work/./r5_parameter_sets.h:63: multiple definition of `r5_parameter_sets'; libcrypto_kem_r5nd5kem0d.a(cpa_kem.o):.../supercop-data/rome0/amd64/try/c/clang_-march=native_-O_-fwrapv_-Qunused-arguments_-fPIC_-fPIE_-gdwarf-4_-Wall/timingleaks/crypto_kem/r5nd5kem0d/ref/work/./r5_parameter_sets.h:63: first defined here
try.c: /usr/bin/ld: libcrypto_kem_r5nd5kem0d.a(a_fixed.o):.../supercop-data/rome0/amd64/try/c/clang_-march=native_-O_-fwrapv_-Qunused-arguments_-fPIC_-fPIE_-gdwarf-4_-Wall/timingleaks/crypto_kem/r5nd5kem0d/ref/work/./r5_parameter_sets.h:66: multiple definition of `r5_parameter_set_names'; libcrypto_kem_r5nd5kem0d.a(cpa_kem.o):.../supercop-data/rome0/amd64/try/c/clang_-march=native_-O_-fwrapv_-Qunused-arguments_-fPIC_-fPIE_-gdwarf-4_-Wall/timingleaks/crypto_kem/r5nd5kem0d/ref/work/./r5_parameter_sets.h:66: first defined here
try.c: /usr/bin/ld: libcrypto_kem_r5nd5kem0d.a(a_fixed.o):.../supercop-data/rome0/amd64/try/c/clang_-march=native_-O_-fwrapv_-Qunused-arguments_-fPIC_-fPIE_-gdwarf-4_-Wall/timingleaks/crypto_kem/r5nd5kem0d/ref/work/./r5_parameter_sets.h:63: multiple definition of `r5_parameter_sets'; libcrypto_kem_r5nd5kem0d.a(cpa_kem.o):.../supercop-data/rome0/amd64/try/c/clang_-march=native_-O_-fwrapv_-Qunused-arguments_-fPIC_-fPIE_-gdwarf-4_-Wall/timingleaks/crypto_kem/r5nd5kem0d/ref/work/./r5_parameter_sets.h:63: first defined here
try.c: /usr/bin/ld: libcrypto_kem_r5nd5kem0d.a(a_random.o):.../supercop-data/rome0/amd64/try/c/clang_-march=native_-O_-fwrapv_-Qunused-arguments_-fPIC_-fPIE_-gdwarf-4_-Wall/timingleaks/crypto_kem/r5nd5kem0d/ref/work/./r5_parameter_sets.h:66: multiple definition of `r5_parameter_set_names'; libcrypto_kem_r5nd5kem0d.a(cpa_kem.o):.../supercop-data/rome0/amd64/try/c/clang_-march=native_-O_-fwrapv_-Qunused-arguments_-fPIC_-fPIE_-gdwarf-4_-Wall/timingleaks/crypto_kem/r5nd5kem0d/ref/work/./r5_parameter_sets.h:66: first defined here
try.c: /usr/bin/ld: libcrypto_kem_r5nd5kem0d.a(a_random.o):.../supercop-data/rome0/amd64/try/c/clang_-march=native_-O_-fwrapv_-Qunused-arguments_-fPIC_-fPIE_-gdwarf-4_-Wall/timingleaks/crypto_kem/r5nd5kem0d/ref/work/./r5_parameter_sets.h:63: multiple definition of `r5_parameter_sets'; libcrypto_kem_r5nd5kem0d.a(cpa_kem.o):.../supercop-data/rome0/amd64/try/c/clang_-march=native_-O_-fwrapv_-Qunused-arguments_-fPIC_-fPIE_-gdwarf-4_-Wall/timingleaks/crypto_kem/r5nd5kem0d/ref/work/./r5_parameter_sets.h:63: first defined here
try.c: clang: error: linker command failed with exit code 1 (use -v to see invocation)

Number of similar (implementation,compiler) pairs: 1, namely:
ImplementationCompiler
T:refclang -march=native -O -fwrapv -Qunused-arguments -fPIC -fPIE -gdwarf-4 -Wall (Debian_Clang_11.0.1)

Compiler output


try.c: /usr/bin/ld: libcrypto_kem_r5nd5kem0d.a(parameters.o):.../supercop-data/rome0/amd64/try/c/clang_-march=native_-Os_-fwrapv_-Qunused-arguments_-fPIC_-fPIE_-gdwarf-4_-Wall/timingleaks/crypto_kem/r5nd5kem0d/ref/work/./r5_parameter_sets.h:66: multiple definition of `r5_parameter_set_names'; libcrypto_kem_r5nd5kem0d.a(cpa_kem.o):.../supercop-data/rome0/amd64/try/c/clang_-march=native_-Os_-fwrapv_-Qunused-arguments_-fPIC_-fPIE_-gdwarf-4_-Wall/timingleaks/crypto_kem/r5nd5kem0d/ref/work/./r5_parameter_sets.h:66: first defined here
try.c: /usr/bin/ld: libcrypto_kem_r5nd5kem0d.a(parameters.o):.../supercop-data/rome0/amd64/try/c/clang_-march=native_-Os_-fwrapv_-Qunused-arguments_-fPIC_-fPIE_-gdwarf-4_-Wall/timingleaks/crypto_kem/r5nd5kem0d/ref/work/./r5_parameter_sets.h:63: multiple definition of `r5_parameter_sets'; libcrypto_kem_r5nd5kem0d.a(cpa_kem.o):.../supercop-data/rome0/amd64/try/c/clang_-march=native_-Os_-fwrapv_-Qunused-arguments_-fPIC_-fPIE_-gdwarf-4_-Wall/timingleaks/crypto_kem/r5nd5kem0d/ref/work/./r5_parameter_sets.h:63: first defined here
try.c: /usr/bin/ld: libcrypto_kem_r5nd5kem0d.a(r5_cpa_kem.o):.../supercop-data/rome0/amd64/try/c/clang_-march=native_-Os_-fwrapv_-Qunused-arguments_-fPIC_-fPIE_-gdwarf-4_-Wall/timingleaks/crypto_kem/r5nd5kem0d/ref/work/./r5_parameter_sets.h:66: multiple definition of `r5_parameter_set_names'; libcrypto_kem_r5nd5kem0d.a(cpa_kem.o):.../supercop-data/rome0/amd64/try/c/clang_-march=native_-Os_-fwrapv_-Qunused-arguments_-fPIC_-fPIE_-gdwarf-4_-Wall/timingleaks/crypto_kem/r5nd5kem0d/ref/work/./r5_parameter_sets.h:66: first defined here
try.c: /usr/bin/ld: libcrypto_kem_r5nd5kem0d.a(r5_cpa_kem.o):.../supercop-data/rome0/amd64/try/c/clang_-march=native_-Os_-fwrapv_-Qunused-arguments_-fPIC_-fPIE_-gdwarf-4_-Wall/timingleaks/crypto_kem/r5nd5kem0d/ref/work/./r5_parameter_sets.h:63: multiple definition of `r5_parameter_sets'; libcrypto_kem_r5nd5kem0d.a(cpa_kem.o):.../supercop-data/rome0/amd64/try/c/clang_-march=native_-Os_-fwrapv_-Qunused-arguments_-fPIC_-fPIE_-gdwarf-4_-Wall/timingleaks/crypto_kem/r5nd5kem0d/ref/work/./r5_parameter_sets.h:63: first defined here
try.c: /usr/bin/ld: libcrypto_kem_r5nd5kem0d.a(r5_cpa_pke.o):.../supercop-data/rome0/amd64/try/c/clang_-march=native_-Os_-fwrapv_-Qunused-arguments_-fPIC_-fPIE_-gdwarf-4_-Wall/timingleaks/crypto_kem/r5nd5kem0d/ref/work/./r5_parameter_sets.h:66: multiple definition of `r5_parameter_set_names'; libcrypto_kem_r5nd5kem0d.a(cpa_kem.o):.../supercop-data/rome0/amd64/try/c/clang_-march=native_-Os_-fwrapv_-Qunused-arguments_-fPIC_-fPIE_-gdwarf-4_-Wall/timingleaks/crypto_kem/r5nd5kem0d/ref/work/./r5_parameter_sets.h:66: first defined here
try.c: /usr/bin/ld: libcrypto_kem_r5nd5kem0d.a(r5_cpa_pke.o):.../supercop-data/rome0/amd64/try/c/clang_-march=native_-Os_-fwrapv_-Qunused-arguments_-fPIC_-fPIE_-gdwarf-4_-Wall/timingleaks/crypto_kem/r5nd5kem0d/ref/work/./r5_parameter_sets.h:63: multiple definition of `r5_parameter_sets'; libcrypto_kem_r5nd5kem0d.a(cpa_kem.o):.../supercop-data/rome0/amd64/try/c/clang_-march=native_-Os_-fwrapv_-Qunused-arguments_-fPIC_-fPIE_-gdwarf-4_-Wall/timingleaks/crypto_kem/r5nd5kem0d/ref/work/./r5_parameter_sets.h:63: first defined here
try.c: /usr/bin/ld: libcrypto_kem_r5nd5kem0d.a(r5_core.o):.../supercop-data/rome0/amd64/try/c/clang_-march=native_-Os_-fwrapv_-Qunused-arguments_-fPIC_-fPIE_-gdwarf-4_-Wall/timingleaks/crypto_kem/r5nd5kem0d/ref/work/./r5_parameter_sets.h:66: multiple definition of `r5_parameter_set_names'; libcrypto_kem_r5nd5kem0d.a(cpa_kem.o):.../supercop-data/rome0/amd64/try/c/clang_-march=native_-Os_-fwrapv_-Qunused-arguments_-fPIC_-fPIE_-gdwarf-4_-Wall/timingleaks/crypto_kem/r5nd5kem0d/ref/work/./r5_parameter_sets.h:66: first defined here
try.c: /usr/bin/ld: libcrypto_kem_r5nd5kem0d.a(r5_core.o):.../supercop-data/rome0/amd64/try/c/clang_-march=native_-Os_-fwrapv_-Qunused-arguments_-fPIC_-fPIE_-gdwarf-4_-Wall/timingleaks/crypto_kem/r5nd5kem0d/ref/work/./r5_parameter_sets.h:63: multiple definition of `r5_parameter_sets'; libcrypto_kem_r5nd5kem0d.a(cpa_kem.o):.../supercop-data/rome0/amd64/try/c/clang_-march=native_-Os_-fwrapv_-Qunused-arguments_-fPIC_-fPIE_-gdwarf-4_-Wall/timingleaks/crypto_kem/r5nd5kem0d/ref/work/./r5_parameter_sets.h:63: first defined here
try.c: /usr/bin/ld: libcrypto_kem_r5nd5kem0d.a(a_fixed.o):.../supercop-data/rome0/amd64/try/c/clang_-march=native_-Os_-fwrapv_-Qunused-arguments_-fPIC_-fPIE_-gdwarf-4_-Wall/timingleaks/crypto_kem/r5nd5kem0d/ref/work/./r5_parameter_sets.h:66: multiple definition of `r5_parameter_set_names'; libcrypto_kem_r5nd5kem0d.a(cpa_kem.o):.../supercop-data/rome0/amd64/try/c/clang_-march=native_-Os_-fwrapv_-Qunused-arguments_-fPIC_-fPIE_-gdwarf-4_-Wall/timingleaks/crypto_kem/r5nd5kem0d/ref/work/./r5_parameter_sets.h:66: first defined here
try.c: /usr/bin/ld: libcrypto_kem_r5nd5kem0d.a(a_fixed.o):.../supercop-data/rome0/amd64/try/c/clang_-march=native_-Os_-fwrapv_-Qunused-arguments_-fPIC_-fPIE_-gdwarf-4_-Wall/timingleaks/crypto_kem/r5nd5kem0d/ref/work/./r5_parameter_sets.h:63: multiple definition of `r5_parameter_sets'; libcrypto_kem_r5nd5kem0d.a(cpa_kem.o):.../supercop-data/rome0/amd64/try/c/clang_-march=native_-Os_-fwrapv_-Qunused-arguments_-fPIC_-fPIE_-gdwarf-4_-Wall/timingleaks/crypto_kem/r5nd5kem0d/ref/work/./r5_parameter_sets.h:63: first defined here
try.c: /usr/bin/ld: libcrypto_kem_r5nd5kem0d.a(a_random.o):.../supercop-data/rome0/amd64/try/c/clang_-march=native_-Os_-fwrapv_-Qunused-arguments_-fPIC_-fPIE_-gdwarf-4_-Wall/timingleaks/crypto_kem/r5nd5kem0d/ref/work/./r5_parameter_sets.h:66: multiple definition of `r5_parameter_set_names'; libcrypto_kem_r5nd5kem0d.a(cpa_kem.o):.../supercop-data/rome0/amd64/try/c/clang_-march=native_-Os_-fwrapv_-Qunused-arguments_-fPIC_-fPIE_-gdwarf-4_-Wall/timingleaks/crypto_kem/r5nd5kem0d/ref/work/./r5_parameter_sets.h:66: first defined here
try.c: /usr/bin/ld: libcrypto_kem_r5nd5kem0d.a(a_random.o):.../supercop-data/rome0/amd64/try/c/clang_-march=native_-Os_-fwrapv_-Qunused-arguments_-fPIC_-fPIE_-gdwarf-4_-Wall/timingleaks/crypto_kem/r5nd5kem0d/ref/work/./r5_parameter_sets.h:63: multiple definition of `r5_parameter_sets'; libcrypto_kem_r5nd5kem0d.a(cpa_kem.o):.../supercop-data/rome0/amd64/try/c/clang_-march=native_-Os_-fwrapv_-Qunused-arguments_-fPIC_-fPIE_-gdwarf-4_-Wall/timingleaks/crypto_kem/r5nd5kem0d/ref/work/./r5_parameter_sets.h:63: first defined here
try.c: clang: error: linker command failed with exit code 1 (use -v to see invocation)

Number of similar (implementation,compiler) pairs: 1, namely:
ImplementationCompiler
T:refclang -march=native -Os -fwrapv -Qunused-arguments -fPIC -fPIE -gdwarf-4 -Wall (Debian_Clang_11.0.1)

Compiler output


try.c: /usr/bin/ld: libcrypto_kem_r5nd5kem0d.a(parameters.o):.../supercop-data/rome0/amd64/try/c/clang_-mcpu=native_-O3_-fwrapv_-Qunused-arguments_-fPIC_-fPIE_-gdwarf-4_-Wall/timingleaks/crypto_kem/r5nd5kem0d/ref/work/./r5_parameter_sets.h:66: multiple definition of `r5_parameter_set_names'; libcrypto_kem_r5nd5kem0d.a(cpa_kem.o):.../supercop-data/rome0/amd64/try/c/clang_-mcpu=native_-O3_-fwrapv_-Qunused-arguments_-fPIC_-fPIE_-gdwarf-4_-Wall/timingleaks/crypto_kem/r5nd5kem0d/ref/work/./r5_parameter_sets.h:66: first defined here
try.c: /usr/bin/ld: libcrypto_kem_r5nd5kem0d.a(parameters.o):.../supercop-data/rome0/amd64/try/c/clang_-mcpu=native_-O3_-fwrapv_-Qunused-arguments_-fPIC_-fPIE_-gdwarf-4_-Wall/timingleaks/crypto_kem/r5nd5kem0d/ref/work/./r5_parameter_sets.h:63: multiple definition of `r5_parameter_sets'; libcrypto_kem_r5nd5kem0d.a(cpa_kem.o):.../supercop-data/rome0/amd64/try/c/clang_-mcpu=native_-O3_-fwrapv_-Qunused-arguments_-fPIC_-fPIE_-gdwarf-4_-Wall/timingleaks/crypto_kem/r5nd5kem0d/ref/work/./r5_parameter_sets.h:63: first defined here
try.c: /usr/bin/ld: libcrypto_kem_r5nd5kem0d.a(r5_cpa_kem.o):.../supercop-data/rome0/amd64/try/c/clang_-mcpu=native_-O3_-fwrapv_-Qunused-arguments_-fPIC_-fPIE_-gdwarf-4_-Wall/timingleaks/crypto_kem/r5nd5kem0d/ref/work/./r5_parameter_sets.h:66: multiple definition of `r5_parameter_set_names'; libcrypto_kem_r5nd5kem0d.a(cpa_kem.o):.../supercop-data/rome0/amd64/try/c/clang_-mcpu=native_-O3_-fwrapv_-Qunused-arguments_-fPIC_-fPIE_-gdwarf-4_-Wall/timingleaks/crypto_kem/r5nd5kem0d/ref/work/./r5_parameter_sets.h:66: first defined here
try.c: /usr/bin/ld: libcrypto_kem_r5nd5kem0d.a(r5_cpa_kem.o):.../supercop-data/rome0/amd64/try/c/clang_-mcpu=native_-O3_-fwrapv_-Qunused-arguments_-fPIC_-fPIE_-gdwarf-4_-Wall/timingleaks/crypto_kem/r5nd5kem0d/ref/work/./r5_parameter_sets.h:63: multiple definition of `r5_parameter_sets'; libcrypto_kem_r5nd5kem0d.a(cpa_kem.o):.../supercop-data/rome0/amd64/try/c/clang_-mcpu=native_-O3_-fwrapv_-Qunused-arguments_-fPIC_-fPIE_-gdwarf-4_-Wall/timingleaks/crypto_kem/r5nd5kem0d/ref/work/./r5_parameter_sets.h:63: first defined here
try.c: /usr/bin/ld: libcrypto_kem_r5nd5kem0d.a(r5_cpa_pke.o):.../supercop-data/rome0/amd64/try/c/clang_-mcpu=native_-O3_-fwrapv_-Qunused-arguments_-fPIC_-fPIE_-gdwarf-4_-Wall/timingleaks/crypto_kem/r5nd5kem0d/ref/work/./r5_parameter_sets.h:66: multiple definition of `r5_parameter_set_names'; libcrypto_kem_r5nd5kem0d.a(cpa_kem.o):.../supercop-data/rome0/amd64/try/c/clang_-mcpu=native_-O3_-fwrapv_-Qunused-arguments_-fPIC_-fPIE_-gdwarf-4_-Wall/timingleaks/crypto_kem/r5nd5kem0d/ref/work/./r5_parameter_sets.h:66: first defined here
try.c: /usr/bin/ld: libcrypto_kem_r5nd5kem0d.a(r5_cpa_pke.o):.../supercop-data/rome0/amd64/try/c/clang_-mcpu=native_-O3_-fwrapv_-Qunused-arguments_-fPIC_-fPIE_-gdwarf-4_-Wall/timingleaks/crypto_kem/r5nd5kem0d/ref/work/./r5_parameter_sets.h:63: multiple definition of `r5_parameter_sets'; libcrypto_kem_r5nd5kem0d.a(cpa_kem.o):.../supercop-data/rome0/amd64/try/c/clang_-mcpu=native_-O3_-fwrapv_-Qunused-arguments_-fPIC_-fPIE_-gdwarf-4_-Wall/timingleaks/crypto_kem/r5nd5kem0d/ref/work/./r5_parameter_sets.h:63: first defined here
try.c: /usr/bin/ld: libcrypto_kem_r5nd5kem0d.a(r5_core.o):.../supercop-data/rome0/amd64/try/c/clang_-mcpu=native_-O3_-fwrapv_-Qunused-arguments_-fPIC_-fPIE_-gdwarf-4_-Wall/timingleaks/crypto_kem/r5nd5kem0d/ref/work/./r5_parameter_sets.h:66: multiple definition of `r5_parameter_set_names'; libcrypto_kem_r5nd5kem0d.a(cpa_kem.o):.../supercop-data/rome0/amd64/try/c/clang_-mcpu=native_-O3_-fwrapv_-Qunused-arguments_-fPIC_-fPIE_-gdwarf-4_-Wall/timingleaks/crypto_kem/r5nd5kem0d/ref/work/./r5_parameter_sets.h:66: first defined here
try.c: /usr/bin/ld: libcrypto_kem_r5nd5kem0d.a(r5_core.o):.../supercop-data/rome0/amd64/try/c/clang_-mcpu=native_-O3_-fwrapv_-Qunused-arguments_-fPIC_-fPIE_-gdwarf-4_-Wall/timingleaks/crypto_kem/r5nd5kem0d/ref/work/./r5_parameter_sets.h:63: multiple definition of `r5_parameter_sets'; libcrypto_kem_r5nd5kem0d.a(cpa_kem.o):.../supercop-data/rome0/amd64/try/c/clang_-mcpu=native_-O3_-fwrapv_-Qunused-arguments_-fPIC_-fPIE_-gdwarf-4_-Wall/timingleaks/crypto_kem/r5nd5kem0d/ref/work/./r5_parameter_sets.h:63: first defined here
try.c: /usr/bin/ld: libcrypto_kem_r5nd5kem0d.a(a_fixed.o):.../supercop-data/rome0/amd64/try/c/clang_-mcpu=native_-O3_-fwrapv_-Qunused-arguments_-fPIC_-fPIE_-gdwarf-4_-Wall/timingleaks/crypto_kem/r5nd5kem0d/ref/work/./r5_parameter_sets.h:66: multiple definition of `r5_parameter_set_names'; libcrypto_kem_r5nd5kem0d.a(cpa_kem.o):.../supercop-data/rome0/amd64/try/c/clang_-mcpu=native_-O3_-fwrapv_-Qunused-arguments_-fPIC_-fPIE_-gdwarf-4_-Wall/timingleaks/crypto_kem/r5nd5kem0d/ref/work/./r5_parameter_sets.h:66: first defined here
try.c: /usr/bin/ld: libcrypto_kem_r5nd5kem0d.a(a_fixed.o):.../supercop-data/rome0/amd64/try/c/clang_-mcpu=native_-O3_-fwrapv_-Qunused-arguments_-fPIC_-fPIE_-gdwarf-4_-Wall/timingleaks/crypto_kem/r5nd5kem0d/ref/work/./r5_parameter_sets.h:63: multiple definition of `r5_parameter_sets'; libcrypto_kem_r5nd5kem0d.a(cpa_kem.o):.../supercop-data/rome0/amd64/try/c/clang_-mcpu=native_-O3_-fwrapv_-Qunused-arguments_-fPIC_-fPIE_-gdwarf-4_-Wall/timingleaks/crypto_kem/r5nd5kem0d/ref/work/./r5_parameter_sets.h:63: first defined here
try.c: /usr/bin/ld: libcrypto_kem_r5nd5kem0d.a(a_random.o):.../supercop-data/rome0/amd64/try/c/clang_-mcpu=native_-O3_-fwrapv_-Qunused-arguments_-fPIC_-fPIE_-gdwarf-4_-Wall/timingleaks/crypto_kem/r5nd5kem0d/ref/work/./r5_parameter_sets.h:66: multiple definition of `r5_parameter_set_names'; libcrypto_kem_r5nd5kem0d.a(cpa_kem.o):.../supercop-data/rome0/amd64/try/c/clang_-mcpu=native_-O3_-fwrapv_-Qunused-arguments_-fPIC_-fPIE_-gdwarf-4_-Wall/timingleaks/crypto_kem/r5nd5kem0d/ref/work/./r5_parameter_sets.h:66: first defined here
try.c: /usr/bin/ld: libcrypto_kem_r5nd5kem0d.a(a_random.o):.../supercop-data/rome0/amd64/try/c/clang_-mcpu=native_-O3_-fwrapv_-Qunused-arguments_-fPIC_-fPIE_-gdwarf-4_-Wall/timingleaks/crypto_kem/r5nd5kem0d/ref/work/./r5_parameter_sets.h:63: multiple definition of `r5_parameter_sets'; libcrypto_kem_r5nd5kem0d.a(cpa_kem.o):.../supercop-data/rome0/amd64/try/c/clang_-mcpu=native_-O3_-fwrapv_-Qunused-arguments_-fPIC_-fPIE_-gdwarf-4_-Wall/timingleaks/crypto_kem/r5nd5kem0d/ref/work/./r5_parameter_sets.h:63: first defined here
try.c: clang: error: linker command failed with exit code 1 (use -v to see invocation)

Number of similar (implementation,compiler) pairs: 1, namely:
ImplementationCompiler
T:refclang -mcpu=native -O3 -fwrapv -Qunused-arguments -fPIC -fPIE -gdwarf-4 -Wall (Debian_Clang_11.0.1)

Compiler output


try.c: /usr/bin/ld: libcrypto_kem_r5nd5kem0d.a(parameters.o):.../supercop-data/rome0/amd64/try/c/gcc_-march=native_-mtune=native_-O2_-fwrapv_-fPIC_-fPIE_-gdwarf-4_-Wall/timingleaks/crypto_kem/r5nd5kem0d/ref/work/r5_parameter_sets.h:66: multiple definition of `r5_parameter_set_names'; libcrypto_kem_r5nd5kem0d.a(cpa_kem.o):.../supercop-data/rome0/amd64/try/c/gcc_-march=native_-mtune=native_-O2_-fwrapv_-fPIC_-fPIE_-gdwarf-4_-Wall/timingleaks/crypto_kem/r5nd5kem0d/ref/work/r5_parameter_sets.h:66: first defined here
try.c: /usr/bin/ld: libcrypto_kem_r5nd5kem0d.a(parameters.o):.../supercop-data/rome0/amd64/try/c/gcc_-march=native_-mtune=native_-O2_-fwrapv_-fPIC_-fPIE_-gdwarf-4_-Wall/timingleaks/crypto_kem/r5nd5kem0d/ref/work/r5_parameter_sets.h:63: multiple definition of `r5_parameter_sets'; libcrypto_kem_r5nd5kem0d.a(cpa_kem.o):.../supercop-data/rome0/amd64/try/c/gcc_-march=native_-mtune=native_-O2_-fwrapv_-fPIC_-fPIE_-gdwarf-4_-Wall/timingleaks/crypto_kem/r5nd5kem0d/ref/work/r5_parameter_sets.h:63: first defined here
try.c: /usr/bin/ld: libcrypto_kem_r5nd5kem0d.a(r5_cpa_kem.o):.../supercop-data/rome0/amd64/try/c/gcc_-march=native_-mtune=native_-O2_-fwrapv_-fPIC_-fPIE_-gdwarf-4_-Wall/timingleaks/crypto_kem/r5nd5kem0d/ref/work/r5_parameter_sets.h:66: multiple definition of `r5_parameter_set_names'; libcrypto_kem_r5nd5kem0d.a(cpa_kem.o):.../supercop-data/rome0/amd64/try/c/gcc_-march=native_-mtune=native_-O2_-fwrapv_-fPIC_-fPIE_-gdwarf-4_-Wall/timingleaks/crypto_kem/r5nd5kem0d/ref/work/r5_parameter_sets.h:66: first defined here
try.c: /usr/bin/ld: libcrypto_kem_r5nd5kem0d.a(r5_cpa_kem.o):.../supercop-data/rome0/amd64/try/c/gcc_-march=native_-mtune=native_-O2_-fwrapv_-fPIC_-fPIE_-gdwarf-4_-Wall/timingleaks/crypto_kem/r5nd5kem0d/ref/work/r5_parameter_sets.h:63: multiple definition of `r5_parameter_sets'; libcrypto_kem_r5nd5kem0d.a(cpa_kem.o):.../supercop-data/rome0/amd64/try/c/gcc_-march=native_-mtune=native_-O2_-fwrapv_-fPIC_-fPIE_-gdwarf-4_-Wall/timingleaks/crypto_kem/r5nd5kem0d/ref/work/r5_parameter_sets.h:63: first defined here
try.c: /usr/bin/ld: libcrypto_kem_r5nd5kem0d.a(r5_cpa_pke.o):.../supercop-data/rome0/amd64/try/c/gcc_-march=native_-mtune=native_-O2_-fwrapv_-fPIC_-fPIE_-gdwarf-4_-Wall/timingleaks/crypto_kem/r5nd5kem0d/ref/work/r5_parameter_sets.h:66: multiple definition of `r5_parameter_set_names'; libcrypto_kem_r5nd5kem0d.a(cpa_kem.o):.../supercop-data/rome0/amd64/try/c/gcc_-march=native_-mtune=native_-O2_-fwrapv_-fPIC_-fPIE_-gdwarf-4_-Wall/timingleaks/crypto_kem/r5nd5kem0d/ref/work/r5_parameter_sets.h:66: first defined here
try.c: /usr/bin/ld: libcrypto_kem_r5nd5kem0d.a(r5_cpa_pke.o):.../supercop-data/rome0/amd64/try/c/gcc_-march=native_-mtune=native_-O2_-fwrapv_-fPIC_-fPIE_-gdwarf-4_-Wall/timingleaks/crypto_kem/r5nd5kem0d/ref/work/r5_parameter_sets.h:63: multiple definition of `r5_parameter_sets'; libcrypto_kem_r5nd5kem0d.a(cpa_kem.o):.../supercop-data/rome0/amd64/try/c/gcc_-march=native_-mtune=native_-O2_-fwrapv_-fPIC_-fPIE_-gdwarf-4_-Wall/timingleaks/crypto_kem/r5nd5kem0d/ref/work/r5_parameter_sets.h:63: first defined here
try.c: /usr/bin/ld: libcrypto_kem_r5nd5kem0d.a(r5_core.o):.../supercop-data/rome0/amd64/try/c/gcc_-march=native_-mtune=native_-O2_-fwrapv_-fPIC_-fPIE_-gdwarf-4_-Wall/timingleaks/crypto_kem/r5nd5kem0d/ref/work/r5_parameter_sets.h:66: multiple definition of `r5_parameter_set_names'; libcrypto_kem_r5nd5kem0d.a(cpa_kem.o):.../supercop-data/rome0/amd64/try/c/gcc_-march=native_-mtune=native_-O2_-fwrapv_-fPIC_-fPIE_-gdwarf-4_-Wall/timingleaks/crypto_kem/r5nd5kem0d/ref/work/r5_parameter_sets.h:66: first defined here
try.c: /usr/bin/ld: libcrypto_kem_r5nd5kem0d.a(r5_core.o):.../supercop-data/rome0/amd64/try/c/gcc_-march=native_-mtune=native_-O2_-fwrapv_-fPIC_-fPIE_-gdwarf-4_-Wall/timingleaks/crypto_kem/r5nd5kem0d/ref/work/r5_parameter_sets.h:63: multiple definition of `r5_parameter_sets'; libcrypto_kem_r5nd5kem0d.a(cpa_kem.o):.../supercop-data/rome0/amd64/try/c/gcc_-march=native_-mtune=native_-O2_-fwrapv_-fPIC_-fPIE_-gdwarf-4_-Wall/timingleaks/crypto_kem/r5nd5kem0d/ref/work/r5_parameter_sets.h:63: first defined here
try.c: /usr/bin/ld: libcrypto_kem_r5nd5kem0d.a(a_fixed.o):.../supercop-data/rome0/amd64/try/c/gcc_-march=native_-mtune=native_-O2_-fwrapv_-fPIC_-fPIE_-gdwarf-4_-Wall/timingleaks/crypto_kem/r5nd5kem0d/ref/work/r5_parameter_sets.h:66: multiple definition of `r5_parameter_set_names'; libcrypto_kem_r5nd5kem0d.a(cpa_kem.o):.../supercop-data/rome0/amd64/try/c/gcc_-march=native_-mtune=native_-O2_-fwrapv_-fPIC_-fPIE_-gdwarf-4_-Wall/timingleaks/crypto_kem/r5nd5kem0d/ref/work/r5_parameter_sets.h:66: first defined here
try.c: /usr/bin/ld: libcrypto_kem_r5nd5kem0d.a(a_fixed.o):.../supercop-data/rome0/amd64/try/c/gcc_-march=native_-mtune=native_-O2_-fwrapv_-fPIC_-fPIE_-gdwarf-4_-Wall/timingleaks/crypto_kem/r5nd5kem0d/ref/work/r5_parameter_sets.h:63: multiple definition of `r5_parameter_sets'; libcrypto_kem_r5nd5kem0d.a(cpa_kem.o):.../supercop-data/rome0/amd64/try/c/gcc_-march=native_-mtune=native_-O2_-fwrapv_-fPIC_-fPIE_-gdwarf-4_-Wall/timingleaks/crypto_kem/r5nd5kem0d/ref/work/r5_parameter_sets.h:63: first defined here
try.c: /usr/bin/ld: libcrypto_kem_r5nd5kem0d.a(a_random.o):.../supercop-data/rome0/amd64/try/c/gcc_-march=native_-mtune=native_-O2_-fwrapv_-fPIC_-fPIE_-gdwarf-4_-Wall/timingleaks/crypto_kem/r5nd5kem0d/ref/work/r5_parameter_sets.h:66: multiple definition of `r5_parameter_set_names'; libcrypto_kem_r5nd5kem0d.a(cpa_kem.o):.../supercop-data/rome0/amd64/try/c/gcc_-march=native_-mtune=native_-O2_-fwrapv_-fPIC_-fPIE_-gdwarf-4_-Wall/timingleaks/crypto_kem/r5nd5kem0d/ref/work/r5_parameter_sets.h:66: first defined here
try.c: /usr/bin/ld: libcrypto_kem_r5nd5kem0d.a(a_random.o):.../supercop-data/rome0/amd64/try/c/gcc_-march=native_-mtune=native_-O2_-fwrapv_-fPIC_-fPIE_-gdwarf-4_-Wall/timingleaks/crypto_kem/r5nd5kem0d/ref/work/r5_parameter_sets.h:63: multiple definition of `r5_parameter_sets'; libcrypto_kem_r5nd5kem0d.a(cpa_kem.o):.../supercop-data/rome0/amd64/try/c/gcc_-march=native_-mtune=native_-O2_-fwrapv_-fPIC_-fPIE_-gdwarf-4_-Wall/timingleaks/crypto_kem/r5nd5kem0d/ref/work/r5_parameter_sets.h:63: first defined here
try.c: collect2: error: ld returned 1 exit status

Number of similar (implementation,compiler) pairs: 1, namely:
ImplementationCompiler
T:refgcc -march=native -mtune=native -O2 -fwrapv -fPIC -fPIE -gdwarf-4 -Wall (10.2.1_20210110)

Compiler output


try.c: /usr/bin/ld: libcrypto_kem_r5nd5kem0d.a(parameters.o):.../supercop-data/rome0/amd64/try/c/gcc_-march=native_-mtune=native_-O3_-fwrapv_-fPIC_-fPIE_-gdwarf-4_-Wall/timingleaks/crypto_kem/r5nd5kem0d/ref/work/r5_parameter_sets.h:66: multiple definition of `r5_parameter_set_names'; libcrypto_kem_r5nd5kem0d.a(cpa_kem.o):.../supercop-data/rome0/amd64/try/c/gcc_-march=native_-mtune=native_-O3_-fwrapv_-fPIC_-fPIE_-gdwarf-4_-Wall/timingleaks/crypto_kem/r5nd5kem0d/ref/work/r5_parameter_sets.h:66: first defined here
try.c: /usr/bin/ld: libcrypto_kem_r5nd5kem0d.a(parameters.o):.../supercop-data/rome0/amd64/try/c/gcc_-march=native_-mtune=native_-O3_-fwrapv_-fPIC_-fPIE_-gdwarf-4_-Wall/timingleaks/crypto_kem/r5nd5kem0d/ref/work/r5_parameter_sets.h:63: multiple definition of `r5_parameter_sets'; libcrypto_kem_r5nd5kem0d.a(cpa_kem.o):.../supercop-data/rome0/amd64/try/c/gcc_-march=native_-mtune=native_-O3_-fwrapv_-fPIC_-fPIE_-gdwarf-4_-Wall/timingleaks/crypto_kem/r5nd5kem0d/ref/work/r5_parameter_sets.h:63: first defined here
try.c: /usr/bin/ld: libcrypto_kem_r5nd5kem0d.a(r5_cpa_kem.o):.../supercop-data/rome0/amd64/try/c/gcc_-march=native_-mtune=native_-O3_-fwrapv_-fPIC_-fPIE_-gdwarf-4_-Wall/timingleaks/crypto_kem/r5nd5kem0d/ref/work/r5_parameter_sets.h:66: multiple definition of `r5_parameter_set_names'; libcrypto_kem_r5nd5kem0d.a(cpa_kem.o):.../supercop-data/rome0/amd64/try/c/gcc_-march=native_-mtune=native_-O3_-fwrapv_-fPIC_-fPIE_-gdwarf-4_-Wall/timingleaks/crypto_kem/r5nd5kem0d/ref/work/r5_parameter_sets.h:66: first defined here
try.c: /usr/bin/ld: libcrypto_kem_r5nd5kem0d.a(r5_cpa_kem.o):.../supercop-data/rome0/amd64/try/c/gcc_-march=native_-mtune=native_-O3_-fwrapv_-fPIC_-fPIE_-gdwarf-4_-Wall/timingleaks/crypto_kem/r5nd5kem0d/ref/work/r5_parameter_sets.h:63: multiple definition of `r5_parameter_sets'; libcrypto_kem_r5nd5kem0d.a(cpa_kem.o):.../supercop-data/rome0/amd64/try/c/gcc_-march=native_-mtune=native_-O3_-fwrapv_-fPIC_-fPIE_-gdwarf-4_-Wall/timingleaks/crypto_kem/r5nd5kem0d/ref/work/r5_parameter_sets.h:63: first defined here
try.c: /usr/bin/ld: libcrypto_kem_r5nd5kem0d.a(r5_cpa_pke.o):.../supercop-data/rome0/amd64/try/c/gcc_-march=native_-mtune=native_-O3_-fwrapv_-fPIC_-fPIE_-gdwarf-4_-Wall/timingleaks/crypto_kem/r5nd5kem0d/ref/work/r5_parameter_sets.h:66: multiple definition of `r5_parameter_set_names'; libcrypto_kem_r5nd5kem0d.a(cpa_kem.o):.../supercop-data/rome0/amd64/try/c/gcc_-march=native_-mtune=native_-O3_-fwrapv_-fPIC_-fPIE_-gdwarf-4_-Wall/timingleaks/crypto_kem/r5nd5kem0d/ref/work/r5_parameter_sets.h:66: first defined here
try.c: /usr/bin/ld: libcrypto_kem_r5nd5kem0d.a(r5_cpa_pke.o):.../supercop-data/rome0/amd64/try/c/gcc_-march=native_-mtune=native_-O3_-fwrapv_-fPIC_-fPIE_-gdwarf-4_-Wall/timingleaks/crypto_kem/r5nd5kem0d/ref/work/r5_parameter_sets.h:63: multiple definition of `r5_parameter_sets'; libcrypto_kem_r5nd5kem0d.a(cpa_kem.o):.../supercop-data/rome0/amd64/try/c/gcc_-march=native_-mtune=native_-O3_-fwrapv_-fPIC_-fPIE_-gdwarf-4_-Wall/timingleaks/crypto_kem/r5nd5kem0d/ref/work/r5_parameter_sets.h:63: first defined here
try.c: /usr/bin/ld: libcrypto_kem_r5nd5kem0d.a(r5_core.o):.../supercop-data/rome0/amd64/try/c/gcc_-march=native_-mtune=native_-O3_-fwrapv_-fPIC_-fPIE_-gdwarf-4_-Wall/timingleaks/crypto_kem/r5nd5kem0d/ref/work/r5_parameter_sets.h:66: multiple definition of `r5_parameter_set_names'; libcrypto_kem_r5nd5kem0d.a(cpa_kem.o):.../supercop-data/rome0/amd64/try/c/gcc_-march=native_-mtune=native_-O3_-fwrapv_-fPIC_-fPIE_-gdwarf-4_-Wall/timingleaks/crypto_kem/r5nd5kem0d/ref/work/r5_parameter_sets.h:66: first defined here
try.c: /usr/bin/ld: libcrypto_kem_r5nd5kem0d.a(r5_core.o):.../supercop-data/rome0/amd64/try/c/gcc_-march=native_-mtune=native_-O3_-fwrapv_-fPIC_-fPIE_-gdwarf-4_-Wall/timingleaks/crypto_kem/r5nd5kem0d/ref/work/r5_parameter_sets.h:63: multiple definition of `r5_parameter_sets'; libcrypto_kem_r5nd5kem0d.a(cpa_kem.o):.../supercop-data/rome0/amd64/try/c/gcc_-march=native_-mtune=native_-O3_-fwrapv_-fPIC_-fPIE_-gdwarf-4_-Wall/timingleaks/crypto_kem/r5nd5kem0d/ref/work/r5_parameter_sets.h:63: first defined here
try.c: /usr/bin/ld: libcrypto_kem_r5nd5kem0d.a(a_fixed.o):.../supercop-data/rome0/amd64/try/c/gcc_-march=native_-mtune=native_-O3_-fwrapv_-fPIC_-fPIE_-gdwarf-4_-Wall/timingleaks/crypto_kem/r5nd5kem0d/ref/work/r5_parameter_sets.h:66: multiple definition of `r5_parameter_set_names'; libcrypto_kem_r5nd5kem0d.a(cpa_kem.o):.../supercop-data/rome0/amd64/try/c/gcc_-march=native_-mtune=native_-O3_-fwrapv_-fPIC_-fPIE_-gdwarf-4_-Wall/timingleaks/crypto_kem/r5nd5kem0d/ref/work/r5_parameter_sets.h:66: first defined here
try.c: /usr/bin/ld: libcrypto_kem_r5nd5kem0d.a(a_fixed.o):.../supercop-data/rome0/amd64/try/c/gcc_-march=native_-mtune=native_-O3_-fwrapv_-fPIC_-fPIE_-gdwarf-4_-Wall/timingleaks/crypto_kem/r5nd5kem0d/ref/work/r5_parameter_sets.h:63: multiple definition of `r5_parameter_sets'; libcrypto_kem_r5nd5kem0d.a(cpa_kem.o):.../supercop-data/rome0/amd64/try/c/gcc_-march=native_-mtune=native_-O3_-fwrapv_-fPIC_-fPIE_-gdwarf-4_-Wall/timingleaks/crypto_kem/r5nd5kem0d/ref/work/r5_parameter_sets.h:63: first defined here
try.c: /usr/bin/ld: libcrypto_kem_r5nd5kem0d.a(a_random.o):.../supercop-data/rome0/amd64/try/c/gcc_-march=native_-mtune=native_-O3_-fwrapv_-fPIC_-fPIE_-gdwarf-4_-Wall/timingleaks/crypto_kem/r5nd5kem0d/ref/work/r5_parameter_sets.h:66: multiple definition of `r5_parameter_set_names'; libcrypto_kem_r5nd5kem0d.a(cpa_kem.o):.../supercop-data/rome0/amd64/try/c/gcc_-march=native_-mtune=native_-O3_-fwrapv_-fPIC_-fPIE_-gdwarf-4_-Wall/timingleaks/crypto_kem/r5nd5kem0d/ref/work/r5_parameter_sets.h:66: first defined here
try.c: /usr/bin/ld: libcrypto_kem_r5nd5kem0d.a(a_random.o):.../supercop-data/rome0/amd64/try/c/gcc_-march=native_-mtune=native_-O3_-fwrapv_-fPIC_-fPIE_-gdwarf-4_-Wall/timingleaks/crypto_kem/r5nd5kem0d/ref/work/r5_parameter_sets.h:63: multiple definition of `r5_parameter_sets'; libcrypto_kem_r5nd5kem0d.a(cpa_kem.o):.../supercop-data/rome0/amd64/try/c/gcc_-march=native_-mtune=native_-O3_-fwrapv_-fPIC_-fPIE_-gdwarf-4_-Wall/timingleaks/crypto_kem/r5nd5kem0d/ref/work/r5_parameter_sets.h:63: first defined here
try.c: collect2: error: ld returned 1 exit status

Number of similar (implementation,compiler) pairs: 1, namely:
ImplementationCompiler
T:refgcc -march=native -mtune=native -O3 -fwrapv -fPIC -fPIE -gdwarf-4 -Wall (10.2.1_20210110)

Compiler output


try.c: /usr/bin/ld: libcrypto_kem_r5nd5kem0d.a(parameters.o):.../supercop-data/rome0/amd64/try/c/gcc_-march=native_-mtune=native_-O_-fwrapv_-fPIC_-fPIE_-gdwarf-4_-Wall/timingleaks/crypto_kem/r5nd5kem0d/ref/work/r5_parameter_sets.h:66: multiple definition of `r5_parameter_set_names'; libcrypto_kem_r5nd5kem0d.a(cpa_kem.o):.../supercop-data/rome0/amd64/try/c/gcc_-march=native_-mtune=native_-O_-fwrapv_-fPIC_-fPIE_-gdwarf-4_-Wall/timingleaks/crypto_kem/r5nd5kem0d/ref/work/r5_parameter_sets.h:66: first defined here
try.c: /usr/bin/ld: libcrypto_kem_r5nd5kem0d.a(parameters.o):.../supercop-data/rome0/amd64/try/c/gcc_-march=native_-mtune=native_-O_-fwrapv_-fPIC_-fPIE_-gdwarf-4_-Wall/timingleaks/crypto_kem/r5nd5kem0d/ref/work/r5_parameter_sets.h:63: multiple definition of `r5_parameter_sets'; libcrypto_kem_r5nd5kem0d.a(cpa_kem.o):.../supercop-data/rome0/amd64/try/c/gcc_-march=native_-mtune=native_-O_-fwrapv_-fPIC_-fPIE_-gdwarf-4_-Wall/timingleaks/crypto_kem/r5nd5kem0d/ref/work/r5_parameter_sets.h:63: first defined here
try.c: /usr/bin/ld: libcrypto_kem_r5nd5kem0d.a(r5_cpa_kem.o):.../supercop-data/rome0/amd64/try/c/gcc_-march=native_-mtune=native_-O_-fwrapv_-fPIC_-fPIE_-gdwarf-4_-Wall/timingleaks/crypto_kem/r5nd5kem0d/ref/work/r5_parameter_sets.h:66: multiple definition of `r5_parameter_set_names'; libcrypto_kem_r5nd5kem0d.a(cpa_kem.o):.../supercop-data/rome0/amd64/try/c/gcc_-march=native_-mtune=native_-O_-fwrapv_-fPIC_-fPIE_-gdwarf-4_-Wall/timingleaks/crypto_kem/r5nd5kem0d/ref/work/r5_parameter_sets.h:66: first defined here
try.c: /usr/bin/ld: libcrypto_kem_r5nd5kem0d.a(r5_cpa_kem.o):.../supercop-data/rome0/amd64/try/c/gcc_-march=native_-mtune=native_-O_-fwrapv_-fPIC_-fPIE_-gdwarf-4_-Wall/timingleaks/crypto_kem/r5nd5kem0d/ref/work/r5_parameter_sets.h:63: multiple definition of `r5_parameter_sets'; libcrypto_kem_r5nd5kem0d.a(cpa_kem.o):.../supercop-data/rome0/amd64/try/c/gcc_-march=native_-mtune=native_-O_-fwrapv_-fPIC_-fPIE_-gdwarf-4_-Wall/timingleaks/crypto_kem/r5nd5kem0d/ref/work/r5_parameter_sets.h:63: first defined here
try.c: /usr/bin/ld: libcrypto_kem_r5nd5kem0d.a(r5_cpa_pke.o):.../supercop-data/rome0/amd64/try/c/gcc_-march=native_-mtune=native_-O_-fwrapv_-fPIC_-fPIE_-gdwarf-4_-Wall/timingleaks/crypto_kem/r5nd5kem0d/ref/work/r5_parameter_sets.h:66: multiple definition of `r5_parameter_set_names'; libcrypto_kem_r5nd5kem0d.a(cpa_kem.o):.../supercop-data/rome0/amd64/try/c/gcc_-march=native_-mtune=native_-O_-fwrapv_-fPIC_-fPIE_-gdwarf-4_-Wall/timingleaks/crypto_kem/r5nd5kem0d/ref/work/r5_parameter_sets.h:66: first defined here
try.c: /usr/bin/ld: libcrypto_kem_r5nd5kem0d.a(r5_cpa_pke.o):.../supercop-data/rome0/amd64/try/c/gcc_-march=native_-mtune=native_-O_-fwrapv_-fPIC_-fPIE_-gdwarf-4_-Wall/timingleaks/crypto_kem/r5nd5kem0d/ref/work/r5_parameter_sets.h:63: multiple definition of `r5_parameter_sets'; libcrypto_kem_r5nd5kem0d.a(cpa_kem.o):.../supercop-data/rome0/amd64/try/c/gcc_-march=native_-mtune=native_-O_-fwrapv_-fPIC_-fPIE_-gdwarf-4_-Wall/timingleaks/crypto_kem/r5nd5kem0d/ref/work/r5_parameter_sets.h:63: first defined here
try.c: /usr/bin/ld: libcrypto_kem_r5nd5kem0d.a(r5_core.o):.../supercop-data/rome0/amd64/try/c/gcc_-march=native_-mtune=native_-O_-fwrapv_-fPIC_-fPIE_-gdwarf-4_-Wall/timingleaks/crypto_kem/r5nd5kem0d/ref/work/r5_parameter_sets.h:66: multiple definition of `r5_parameter_set_names'; libcrypto_kem_r5nd5kem0d.a(cpa_kem.o):.../supercop-data/rome0/amd64/try/c/gcc_-march=native_-mtune=native_-O_-fwrapv_-fPIC_-fPIE_-gdwarf-4_-Wall/timingleaks/crypto_kem/r5nd5kem0d/ref/work/r5_parameter_sets.h:66: first defined here
try.c: /usr/bin/ld: libcrypto_kem_r5nd5kem0d.a(r5_core.o):.../supercop-data/rome0/amd64/try/c/gcc_-march=native_-mtune=native_-O_-fwrapv_-fPIC_-fPIE_-gdwarf-4_-Wall/timingleaks/crypto_kem/r5nd5kem0d/ref/work/r5_parameter_sets.h:63: multiple definition of `r5_parameter_sets'; libcrypto_kem_r5nd5kem0d.a(cpa_kem.o):.../supercop-data/rome0/amd64/try/c/gcc_-march=native_-mtune=native_-O_-fwrapv_-fPIC_-fPIE_-gdwarf-4_-Wall/timingleaks/crypto_kem/r5nd5kem0d/ref/work/r5_parameter_sets.h:63: first defined here
try.c: /usr/bin/ld: libcrypto_kem_r5nd5kem0d.a(a_fixed.o):.../supercop-data/rome0/amd64/try/c/gcc_-march=native_-mtune=native_-O_-fwrapv_-fPIC_-fPIE_-gdwarf-4_-Wall/timingleaks/crypto_kem/r5nd5kem0d/ref/work/r5_parameter_sets.h:66: multiple definition of `r5_parameter_set_names'; libcrypto_kem_r5nd5kem0d.a(cpa_kem.o):.../supercop-data/rome0/amd64/try/c/gcc_-march=native_-mtune=native_-O_-fwrapv_-fPIC_-fPIE_-gdwarf-4_-Wall/timingleaks/crypto_kem/r5nd5kem0d/ref/work/r5_parameter_sets.h:66: first defined here
try.c: /usr/bin/ld: libcrypto_kem_r5nd5kem0d.a(a_fixed.o):.../supercop-data/rome0/amd64/try/c/gcc_-march=native_-mtune=native_-O_-fwrapv_-fPIC_-fPIE_-gdwarf-4_-Wall/timingleaks/crypto_kem/r5nd5kem0d/ref/work/r5_parameter_sets.h:63: multiple definition of `r5_parameter_sets'; libcrypto_kem_r5nd5kem0d.a(cpa_kem.o):.../supercop-data/rome0/amd64/try/c/gcc_-march=native_-mtune=native_-O_-fwrapv_-fPIC_-fPIE_-gdwarf-4_-Wall/timingleaks/crypto_kem/r5nd5kem0d/ref/work/r5_parameter_sets.h:63: first defined here
try.c: /usr/bin/ld: libcrypto_kem_r5nd5kem0d.a(a_random.o):.../supercop-data/rome0/amd64/try/c/gcc_-march=native_-mtune=native_-O_-fwrapv_-fPIC_-fPIE_-gdwarf-4_-Wall/timingleaks/crypto_kem/r5nd5kem0d/ref/work/r5_parameter_sets.h:66: multiple definition of `r5_parameter_set_names'; libcrypto_kem_r5nd5kem0d.a(cpa_kem.o):.../supercop-data/rome0/amd64/try/c/gcc_-march=native_-mtune=native_-O_-fwrapv_-fPIC_-fPIE_-gdwarf-4_-Wall/timingleaks/crypto_kem/r5nd5kem0d/ref/work/r5_parameter_sets.h:66: first defined here
try.c: /usr/bin/ld: libcrypto_kem_r5nd5kem0d.a(a_random.o):.../supercop-data/rome0/amd64/try/c/gcc_-march=native_-mtune=native_-O_-fwrapv_-fPIC_-fPIE_-gdwarf-4_-Wall/timingleaks/crypto_kem/r5nd5kem0d/ref/work/r5_parameter_sets.h:63: multiple definition of `r5_parameter_sets'; libcrypto_kem_r5nd5kem0d.a(cpa_kem.o):.../supercop-data/rome0/amd64/try/c/gcc_-march=native_-mtune=native_-O_-fwrapv_-fPIC_-fPIE_-gdwarf-4_-Wall/timingleaks/crypto_kem/r5nd5kem0d/ref/work/r5_parameter_sets.h:63: first defined here
try.c: collect2: error: ld returned 1 exit status

Number of similar (implementation,compiler) pairs: 1, namely:
ImplementationCompiler
T:refgcc -march=native -mtune=native -O -fwrapv -fPIC -fPIE -gdwarf-4 -Wall (10.2.1_20210110)

Compiler output


try.c: /usr/bin/ld: libcrypto_kem_r5nd5kem0d.a(parameters.o):.../supercop-data/rome0/amd64/try/c/gcc_-march=native_-mtune=native_-Os_-fwrapv_-fPIC_-fPIE_-gdwarf-4_-Wall/timingleaks/crypto_kem/r5nd5kem0d/ref/work/r5_parameter_sets.h:66: multiple definition of `r5_parameter_set_names'; libcrypto_kem_r5nd5kem0d.a(cpa_kem.o):.../supercop-data/rome0/amd64/try/c/gcc_-march=native_-mtune=native_-Os_-fwrapv_-fPIC_-fPIE_-gdwarf-4_-Wall/timingleaks/crypto_kem/r5nd5kem0d/ref/work/r5_parameter_sets.h:66: first defined here
try.c: /usr/bin/ld: libcrypto_kem_r5nd5kem0d.a(parameters.o):.../supercop-data/rome0/amd64/try/c/gcc_-march=native_-mtune=native_-Os_-fwrapv_-fPIC_-fPIE_-gdwarf-4_-Wall/timingleaks/crypto_kem/r5nd5kem0d/ref/work/r5_parameter_sets.h:63: multiple definition of `r5_parameter_sets'; libcrypto_kem_r5nd5kem0d.a(cpa_kem.o):.../supercop-data/rome0/amd64/try/c/gcc_-march=native_-mtune=native_-Os_-fwrapv_-fPIC_-fPIE_-gdwarf-4_-Wall/timingleaks/crypto_kem/r5nd5kem0d/ref/work/r5_parameter_sets.h:63: first defined here
try.c: /usr/bin/ld: libcrypto_kem_r5nd5kem0d.a(r5_cpa_kem.o):.../supercop-data/rome0/amd64/try/c/gcc_-march=native_-mtune=native_-Os_-fwrapv_-fPIC_-fPIE_-gdwarf-4_-Wall/timingleaks/crypto_kem/r5nd5kem0d/ref/work/r5_parameter_sets.h:66: multiple definition of `r5_parameter_set_names'; libcrypto_kem_r5nd5kem0d.a(cpa_kem.o):.../supercop-data/rome0/amd64/try/c/gcc_-march=native_-mtune=native_-Os_-fwrapv_-fPIC_-fPIE_-gdwarf-4_-Wall/timingleaks/crypto_kem/r5nd5kem0d/ref/work/r5_parameter_sets.h:66: first defined here
try.c: /usr/bin/ld: libcrypto_kem_r5nd5kem0d.a(r5_cpa_kem.o):.../supercop-data/rome0/amd64/try/c/gcc_-march=native_-mtune=native_-Os_-fwrapv_-fPIC_-fPIE_-gdwarf-4_-Wall/timingleaks/crypto_kem/r5nd5kem0d/ref/work/r5_parameter_sets.h:63: multiple definition of `r5_parameter_sets'; libcrypto_kem_r5nd5kem0d.a(cpa_kem.o):.../supercop-data/rome0/amd64/try/c/gcc_-march=native_-mtune=native_-Os_-fwrapv_-fPIC_-fPIE_-gdwarf-4_-Wall/timingleaks/crypto_kem/r5nd5kem0d/ref/work/r5_parameter_sets.h:63: first defined here
try.c: /usr/bin/ld: libcrypto_kem_r5nd5kem0d.a(r5_cpa_pke.o):.../supercop-data/rome0/amd64/try/c/gcc_-march=native_-mtune=native_-Os_-fwrapv_-fPIC_-fPIE_-gdwarf-4_-Wall/timingleaks/crypto_kem/r5nd5kem0d/ref/work/r5_parameter_sets.h:66: multiple definition of `r5_parameter_set_names'; libcrypto_kem_r5nd5kem0d.a(cpa_kem.o):.../supercop-data/rome0/amd64/try/c/gcc_-march=native_-mtune=native_-Os_-fwrapv_-fPIC_-fPIE_-gdwarf-4_-Wall/timingleaks/crypto_kem/r5nd5kem0d/ref/work/r5_parameter_sets.h:66: first defined here
try.c: /usr/bin/ld: libcrypto_kem_r5nd5kem0d.a(r5_cpa_pke.o):.../supercop-data/rome0/amd64/try/c/gcc_-march=native_-mtune=native_-Os_-fwrapv_-fPIC_-fPIE_-gdwarf-4_-Wall/timingleaks/crypto_kem/r5nd5kem0d/ref/work/r5_parameter_sets.h:63: multiple definition of `r5_parameter_sets'; libcrypto_kem_r5nd5kem0d.a(cpa_kem.o):.../supercop-data/rome0/amd64/try/c/gcc_-march=native_-mtune=native_-Os_-fwrapv_-fPIC_-fPIE_-gdwarf-4_-Wall/timingleaks/crypto_kem/r5nd5kem0d/ref/work/r5_parameter_sets.h:63: first defined here
try.c: /usr/bin/ld: libcrypto_kem_r5nd5kem0d.a(r5_core.o):.../supercop-data/rome0/amd64/try/c/gcc_-march=native_-mtune=native_-Os_-fwrapv_-fPIC_-fPIE_-gdwarf-4_-Wall/timingleaks/crypto_kem/r5nd5kem0d/ref/work/r5_parameter_sets.h:66: multiple definition of `r5_parameter_set_names'; libcrypto_kem_r5nd5kem0d.a(cpa_kem.o):.../supercop-data/rome0/amd64/try/c/gcc_-march=native_-mtune=native_-Os_-fwrapv_-fPIC_-fPIE_-gdwarf-4_-Wall/timingleaks/crypto_kem/r5nd5kem0d/ref/work/r5_parameter_sets.h:66: first defined here
try.c: /usr/bin/ld: libcrypto_kem_r5nd5kem0d.a(r5_core.o):.../supercop-data/rome0/amd64/try/c/gcc_-march=native_-mtune=native_-Os_-fwrapv_-fPIC_-fPIE_-gdwarf-4_-Wall/timingleaks/crypto_kem/r5nd5kem0d/ref/work/r5_parameter_sets.h:63: multiple definition of `r5_parameter_sets'; libcrypto_kem_r5nd5kem0d.a(cpa_kem.o):.../supercop-data/rome0/amd64/try/c/gcc_-march=native_-mtune=native_-Os_-fwrapv_-fPIC_-fPIE_-gdwarf-4_-Wall/timingleaks/crypto_kem/r5nd5kem0d/ref/work/r5_parameter_sets.h:63: first defined here
try.c: /usr/bin/ld: libcrypto_kem_r5nd5kem0d.a(a_fixed.o):.../supercop-data/rome0/amd64/try/c/gcc_-march=native_-mtune=native_-Os_-fwrapv_-fPIC_-fPIE_-gdwarf-4_-Wall/timingleaks/crypto_kem/r5nd5kem0d/ref/work/r5_parameter_sets.h:66: multiple definition of `r5_parameter_set_names'; libcrypto_kem_r5nd5kem0d.a(cpa_kem.o):.../supercop-data/rome0/amd64/try/c/gcc_-march=native_-mtune=native_-Os_-fwrapv_-fPIC_-fPIE_-gdwarf-4_-Wall/timingleaks/crypto_kem/r5nd5kem0d/ref/work/r5_parameter_sets.h:66: first defined here
try.c: /usr/bin/ld: libcrypto_kem_r5nd5kem0d.a(a_fixed.o):.../supercop-data/rome0/amd64/try/c/gcc_-march=native_-mtune=native_-Os_-fwrapv_-fPIC_-fPIE_-gdwarf-4_-Wall/timingleaks/crypto_kem/r5nd5kem0d/ref/work/r5_parameter_sets.h:63: multiple definition of `r5_parameter_sets'; libcrypto_kem_r5nd5kem0d.a(cpa_kem.o):.../supercop-data/rome0/amd64/try/c/gcc_-march=native_-mtune=native_-Os_-fwrapv_-fPIC_-fPIE_-gdwarf-4_-Wall/timingleaks/crypto_kem/r5nd5kem0d/ref/work/r5_parameter_sets.h:63: first defined here
try.c: /usr/bin/ld: libcrypto_kem_r5nd5kem0d.a(a_random.o):.../supercop-data/rome0/amd64/try/c/gcc_-march=native_-mtune=native_-Os_-fwrapv_-fPIC_-fPIE_-gdwarf-4_-Wall/timingleaks/crypto_kem/r5nd5kem0d/ref/work/r5_parameter_sets.h:66: multiple definition of `r5_parameter_set_names'; libcrypto_kem_r5nd5kem0d.a(cpa_kem.o):.../supercop-data/rome0/amd64/try/c/gcc_-march=native_-mtune=native_-Os_-fwrapv_-fPIC_-fPIE_-gdwarf-4_-Wall/timingleaks/crypto_kem/r5nd5kem0d/ref/work/r5_parameter_sets.h:66: first defined here
try.c: /usr/bin/ld: libcrypto_kem_r5nd5kem0d.a(a_random.o):.../supercop-data/rome0/amd64/try/c/gcc_-march=native_-mtune=native_-Os_-fwrapv_-fPIC_-fPIE_-gdwarf-4_-Wall/timingleaks/crypto_kem/r5nd5kem0d/ref/work/r5_parameter_sets.h:63: multiple definition of `r5_parameter_sets'; libcrypto_kem_r5nd5kem0d.a(cpa_kem.o):.../supercop-data/rome0/amd64/try/c/gcc_-march=native_-mtune=native_-Os_-fwrapv_-fPIC_-fPIE_-gdwarf-4_-Wall/timingleaks/crypto_kem/r5nd5kem0d/ref/work/r5_parameter_sets.h:63: first defined here
try.c: collect2: error: ld returned 1 exit status

Number of similar (implementation,compiler) pairs: 1, namely:
ImplementationCompiler
T:refgcc -march=native -mtune=native -Os -fwrapv -fPIC -fPIE -gdwarf-4 -Wall (10.2.1_20210110)