Implementation notes: amd64, rome0, crypto_kem/r5nd1kem0d

Computer: rome0
Microarchitecture: amd64; Zen 2 (830f10)
Architecture: amd64
CPU ID: AuthenticAMD-00830f10-178bfbff
SUPERCOP version: 20240625
Operation: crypto_kem
Primitive: r5nd1kem0d
TimeObject sizeTest sizeImplementationCompilerBenchmark dateSUPERCOP version
10069633418 0 0173458 868 1752T:optgcc_-march=native_-mtune=native_-O3_-fwrapv_-fPIC_-fPIE_-gdwarf-4_-Wall2024062520240625
10081733418 0 0173458 868 1752T:avx2gcc_-march=native_-mtune=native_-O3_-fwrapv_-fPIC_-fPIE_-gdwarf-4_-Wall2024062520240625
13102131647 0 0170369 884 1720T:optclang_-mcpu=native_-O3_-fwrapv_-Qunused-arguments_-fPIC_-fPIE_-gdwarf-4_-Wall2024062520240625
13126231647 0 0170369 884 1720T:avx2clang_-mcpu=native_-O3_-fwrapv_-Qunused-arguments_-fPIC_-fPIE_-gdwarf-4_-Wall2024062520240625
13499631539 0 0171273 884 1720T:avx2clang_-march=native_-O3_-fwrapv_-Qunused-arguments_-fPIC_-fPIE_-gdwarf-4_-Wall2024062520240625
13531731539 0 0171273 884 1720T:optclang_-march=native_-O3_-fwrapv_-Qunused-arguments_-fPIC_-fPIE_-gdwarf-4_-Wall2024062520240625
13813127006 0 0170121 884 1720T:optclang_-march=native_-O2_-fwrapv_-Qunused-arguments_-fPIC_-fPIE_-gdwarf-4_-Wall2024062520240625
13881027006 0 0170121 884 1720T:avx2clang_-march=native_-O2_-fwrapv_-Qunused-arguments_-fPIC_-fPIE_-gdwarf-4_-Wall2024062520240625
39002620116 0 0164711 876 1720T:avx2clang_-march=native_-O_-fwrapv_-Qunused-arguments_-fPIC_-fPIE_-gdwarf-4_-Wall2024062520240625
39029020116 0 0164711 876 1720T:optclang_-march=native_-O_-fwrapv_-Qunused-arguments_-fPIC_-fPIE_-gdwarf-4_-Wall2024062520240625
39342623678 0 0166706 868 1752T:optgcc_-march=native_-mtune=native_-O2_-fwrapv_-fPIC_-fPIE_-gdwarf-4_-Wall2024062520240625
39377923678 0 0166706 868 1752T:avx2gcc_-march=native_-mtune=native_-O2_-fwrapv_-fPIC_-fPIE_-gdwarf-4_-Wall2024062520240625
39608221559 0 0165498 868 1752T:avx2gcc_-march=native_-mtune=native_-O_-fwrapv_-fPIC_-fPIE_-gdwarf-4_-Wall2024062520240625
39642221559 0 0165498 868 1752T:optgcc_-march=native_-mtune=native_-O_-fwrapv_-fPIC_-fPIE_-gdwarf-4_-Wall2024062520240625
40295320365 0 0163991 876 1720T:optclang_-march=native_-Os_-fwrapv_-Qunused-arguments_-fPIC_-fPIE_-gdwarf-4_-Wall2024062520240625
40390820365 0 0163991 876 1720T:avx2clang_-march=native_-Os_-fwrapv_-Qunused-arguments_-fPIC_-fPIE_-gdwarf-4_-Wall2024062520240625
44770520000 0 0163514 860 1720T:avx2gcc_-march=native_-mtune=native_-Os_-fwrapv_-fPIC_-fPIE_-gdwarf-4_-Wall2024062520240625
44899020000 0 0163514 860 1720T:optgcc_-march=native_-mtune=native_-Os_-fwrapv_-fPIC_-fPIE_-gdwarf-4_-Wall2024062520240625

Compiler output

Implementation: T:avx2
Security model: timingleaks
Compiler: clang -mcpu=native -O3 -fwrapv -Qunused-arguments -fPIC -fPIE -gdwarf-4 -Wall
a_fixed.c: In file included from a_fixed.c:10:
a_fixed.c: In file included from ./a_fixed.h:13:
a_fixed.c: ./r5_parameter_sets.h:139:2: warning: AVX2 not supported by platform [-W#warnings]
a_fixed.c: #warning AVX2 not supported by platform
a_fixed.c: ^
a_fixed.c: 1 warning generated.
a_random.c: In file included from a_random.c:10:
a_random.c: In file included from ./a_random.h:13:
a_random.c: ./r5_parameter_sets.h:139:2: warning: AVX2 not supported by platform [-W#warnings]
a_random.c: #warning AVX2 not supported by platform
a_random.c: ^
a_random.c: 1 warning generated.
cca_encrypt.c: In file included from cca_encrypt.c:11:
cca_encrypt.c: In file included from ./cca_encrypt.h:14:
cca_encrypt.c: ./r5_parameter_sets.h:139:2: warning: AVX2 not supported by platform [-W#warnings]
cca_encrypt.c: #warning AVX2 not supported by platform
cca_encrypt.c: ^
cca_encrypt.c: 1 warning generated.
cpa_kem.c: In file included from cpa_kem.c:12:
cpa_kem.c: In file included from ./cpa_kem.h:13:
cpa_kem.c: ./r5_parameter_sets.h:139:2: warning: AVX2 not supported by platform [-W#warnings]
cpa_kem.c: #warning AVX2 not supported by platform
cpa_kem.c: ^
cpa_kem.c: 1 warning generated.
drbg.c: In file included from drbg.c:18:
drbg.c: In file included from ./drbg.h:13:
drbg.c: ./r5_parameter_sets.h:139:2: warning: AVX2 not supported by platform [-W#warnings]
drbg.c: #warning AVX2 not supported by platform
drbg.c: ^
drbg.c: 1 warning generated.
matmul.c: In file included from matmul.c:8:
matmul.c: In file included from ./matmul.h:8:
matmul.c: ./r5_parameter_sets.h:139:2: warning: AVX2 not supported by platform [-W#warnings]
matmul.c: #warning AVX2 not supported by platform
matmul.c: ^
matmul.c: 1 warning generated.
matmul_avx2.c: In file included from matmul_avx2.c:8:
matmul_avx2.c: In file included from ./matmul.h:8:
matmul_avx2.c: ./r5_parameter_sets.h:139:2: warning: AVX2 not supported by platform [-W#warnings]
matmul_avx2.c: #warning AVX2 not supported by platform
matmul_avx2.c: ^
matmul_avx2.c: 1 warning generated.
matmul_cm.c: In file included from matmul_cm.c:7:
matmul_cm.c: In file included from ./matmul.h:8:
matmul_cm.c: ./r5_parameter_sets.h:139:2: warning: AVX2 not supported by platform [-W#warnings]
matmul_cm.c: #warning AVX2 not supported by platform
matmul_cm.c: ^
matmul_cm.c: 1 warning generated.
probe_cm.c: In file included from probe_cm.c:6:
probe_cm.c: ./r5_parameter_sets.h:139:2: warning: AVX2 not supported by platform [-W#warnings]
probe_cm.c: #warning AVX2 not supported by platform
probe_cm.c: ^
probe_cm.c: 1 warning generated.
r5_cca_kem.c: In file included from r5_cca_kem.c:7:
r5_cca_kem.c: ./r5_parameter_sets.h:139:2: warning: AVX2 not supported by platform [-W#warnings]
r5_cca_kem.c: #warning AVX2 not supported by platform
r5_cca_kem.c: ^
r5_cca_kem.c: 1 warning generated.
r5_cca_pke.c: In file included from r5_cca_pke.c:12:
r5_cca_pke.c: ./r5_parameter_sets.h:139:2: warning: AVX2 not supported by platform [-W#warnings]
r5_cca_pke.c: #warning AVX2 not supported by platform
r5_cca_pke.c: ^
r5_cca_pke.c: 1 warning generated.
r5_cpa_kem.c: In file included from r5_cpa_kem.c:9:
r5_cpa_kem.c: ./r5_parameter_sets.h:139:2: warning: AVX2 not supported by platform [-W#warnings]
r5_cpa_kem.c: #warning AVX2 not supported by platform
r5_cpa_kem.c: ^
r5_cpa_kem.c: 1 warning generated.
r5_cpa_pke_n1.c: In file included from r5_cpa_pke_n1.c:6:
r5_cpa_pke_n1.c: ./r5_parameter_sets.h:139:2: warning: AVX2 not supported by platform [-W#warnings]
r5_cpa_pke_n1.c: #warning AVX2 not supported by platform
r5_cpa_pke_n1.c: ^
r5_cpa_pke_n1.c: 1 warning generated.
r5_cpa_pke_nd.c: In file included from r5_cpa_pke_nd.c:7:
r5_cpa_pke_nd.c: ./r5_parameter_sets.h:139:2: warning: AVX2 not supported by platform [-W#warnings]
r5_cpa_pke_nd.c: #warning AVX2 not supported by platform
r5_cpa_pke_nd.c: ^
r5_cpa_pke_nd.c: 1 warning generated.
r5_dem.c: In file included from r5_dem.c:11:
r5_dem.c: ./r5_parameter_sets.h:139:2: warning: AVX2 not supported by platform [-W#warnings]
r5_dem.c: #warning AVX2 not supported by platform
r5_dem.c: ^
r5_dem.c: 1 warning generated.
ringmul.c: In file included from ringmul.c:8:
ringmul.c: In file included from ./ringmul.h:9:
ringmul.c: ./r5_parameter_sets.h:139:2: warning: AVX2 not supported by platform [-W#warnings]
ringmul.c: #warning AVX2 not supported by platform
ringmul.c: ^
ringmul.c: 1 warning generated.
ringmul_cm.c: In file included from ringmul_cm.c:8:
ringmul_cm.c: In file included from ./ringmul.h:9:
ringmul_cm.c: ./r5_parameter_sets.h:139:2: warning: AVX2 not supported by platform [-W#warnings]
ringmul_cm.c: #warning AVX2 not supported by platform
ringmul_cm.c: ^
ringmul_cm.c: 1 warning generated.

Number of similar (compiler,implementation) pairs: 1, namely:
CompilerImplementations
clang -mcpu=native -O3 -fwrapv -Qunused-arguments -fPIC -fPIE -gdwarf-4 -Wall T:avx2

Compiler output

Implementation: T:ref
Security model: timingleaks
Compiler: clang -march=native -O2 -fwrapv -Qunused-arguments -fPIC -fPIE -gdwarf-4 -Wall
try.c: /usr/bin/ld: libcrypto_kem_r5nd1kem0d.a(parameters.o):/home/supercop/supercop-20240625/supercop-data/rome0/amd64/try/c/clang_-march=native_-O2_-fwrapv_-Qunused-arguments_-fPIC_-fPIE_-gdwarf-4_-Wall/timingleaks/crypto_kem/r5nd1kem0d/ref/work/./r5_parameter_sets.h:66: multiple definition of `r5_parameter_set_names'; libcrypto_kem_r5nd1kem0d.a(cpa_kem.o):/home/supercop/supercop-20240625/supercop-data/rome0/amd64/try/c/clang_-march=native_-O2_-fwrapv_-Qunused-arguments_-fPIC_-fPIE_-gdwarf-4_-Wall/timingleaks/crypto_kem/r5nd1kem0d/ref/work/./r5_parameter_sets.h:66: first defined here
try.c: /usr/bin/ld: libcrypto_kem_r5nd1kem0d.a(parameters.o):/home/supercop/supercop-20240625/supercop-data/rome0/amd64/try/c/clang_-march=native_-O2_-fwrapv_-Qunused-arguments_-fPIC_-fPIE_-gdwarf-4_-Wall/timingleaks/crypto_kem/r5nd1kem0d/ref/work/./r5_parameter_sets.h:63: multiple definition of `r5_parameter_sets'; libcrypto_kem_r5nd1kem0d.a(cpa_kem.o):/home/supercop/supercop-20240625/supercop-data/rome0/amd64/try/c/clang_-march=native_-O2_-fwrapv_-Qunused-arguments_-fPIC_-fPIE_-gdwarf-4_-Wall/timingleaks/crypto_kem/r5nd1kem0d/ref/work/./r5_parameter_sets.h:63: first defined here
try.c: /usr/bin/ld: libcrypto_kem_r5nd1kem0d.a(r5_cpa_kem.o):/home/supercop/supercop-20240625/supercop-data/rome0/amd64/try/c/clang_-march=native_-O2_-fwrapv_-Qunused-arguments_-fPIC_-fPIE_-gdwarf-4_-Wall/timingleaks/crypto_kem/r5nd1kem0d/ref/work/./r5_parameter_sets.h:66: multiple definition of `r5_parameter_set_names'; libcrypto_kem_r5nd1kem0d.a(cpa_kem.o):/home/supercop/supercop-20240625/supercop-data/rome0/amd64/try/c/clang_-march=native_-O2_-fwrapv_-Qunused-arguments_-fPIC_-fPIE_-gdwarf-4_-Wall/timingleaks/crypto_kem/r5nd1kem0d/ref/work/./r5_parameter_sets.h:66: first defined here
try.c: /usr/bin/ld: libcrypto_kem_r5nd1kem0d.a(r5_cpa_kem.o):/home/supercop/supercop-20240625/supercop-data/rome0/amd64/try/c/clang_-march=native_-O2_-fwrapv_-Qunused-arguments_-fPIC_-fPIE_-gdwarf-4_-Wall/timingleaks/crypto_kem/r5nd1kem0d/ref/work/./r5_parameter_sets.h:63: multiple definition of `r5_parameter_sets'; libcrypto_kem_r5nd1kem0d.a(cpa_kem.o):/home/supercop/supercop-20240625/supercop-data/rome0/amd64/try/c/clang_-march=native_-O2_-fwrapv_-Qunused-arguments_-fPIC_-fPIE_-gdwarf-4_-Wall/timingleaks/crypto_kem/r5nd1kem0d/ref/work/./r5_parameter_sets.h:63: first defined here
try.c: /usr/bin/ld: libcrypto_kem_r5nd1kem0d.a(r5_cpa_pke.o):/home/supercop/supercop-20240625/supercop-data/rome0/amd64/try/c/clang_-march=native_-O2_-fwrapv_-Qunused-arguments_-fPIC_-fPIE_-gdwarf-4_-Wall/timingleaks/crypto_kem/r5nd1kem0d/ref/work/./r5_parameter_sets.h:66: multiple definition of `r5_parameter_set_names'; libcrypto_kem_r5nd1kem0d.a(cpa_kem.o):/home/supercop/supercop-20240625/supercop-data/rome0/amd64/try/c/clang_-march=native_-O2_-fwrapv_-Qunused-arguments_-fPIC_-fPIE_-gdwarf-4_-Wall/timingleaks/crypto_kem/r5nd1kem0d/ref/work/./r5_parameter_sets.h:66: first defined here
try.c: /usr/bin/ld: libcrypto_kem_r5nd1kem0d.a(r5_cpa_pke.o):/home/supercop/supercop-20240625/supercop-data/rome0/amd64/try/c/clang_-march=native_-O2_-fwrapv_-Qunused-arguments_-fPIC_-fPIE_-gdwarf-4_-Wall/timingleaks/crypto_kem/r5nd1kem0d/ref/work/./r5_parameter_sets.h:63: multiple definition of `r5_parameter_sets'; libcrypto_kem_r5nd1kem0d.a(cpa_kem.o):/home/supercop/supercop-20240625/supercop-data/rome0/amd64/try/c/clang_-march=native_-O2_-fwrapv_-Qunused-arguments_-fPIC_-fPIE_-gdwarf-4_-Wall/timingleaks/crypto_kem/r5nd1kem0d/ref/work/./r5_parameter_sets.h:63: first defined here
try.c: /usr/bin/ld: libcrypto_kem_r5nd1kem0d.a(r5_core.o):/home/supercop/supercop-20240625/supercop-data/rome0/amd64/try/c/clang_-march=native_-O2_-fwrapv_-Qunused-arguments_-fPIC_-fPIE_-gdwarf-4_-Wall/timingleaks/crypto_kem/r5nd1kem0d/ref/work/./r5_parameter_sets.h:66: multiple definition of `r5_parameter_set_names'; libcrypto_kem_r5nd1kem0d.a(cpa_kem.o):/home/supercop/supercop-20240625/supercop-data/rome0/amd64/try/c/clang_-march=native_-O2_-fwrapv_-Qunused-arguments_-fPIC_-fPIE_-gdwarf-4_-Wall/timingleaks/crypto_kem/r5nd1kem0d/ref/work/./r5_parameter_sets.h:66: first defined here
try.c: /usr/bin/ld: libcrypto_kem_r5nd1kem0d.a(r5_core.o):/home/supercop/supercop-20240625/supercop-data/rome0/amd64/try/c/clang_-march=native_-O2_-fwrapv_-Qunused-arguments_-fPIC_-fPIE_-gdwarf-4_-Wall/timingleaks/crypto_kem/r5nd1kem0d/ref/work/./r5_parameter_sets.h:63: multiple definition of `r5_parameter_sets'; libcrypto_kem_r5nd1kem0d.a(cpa_kem.o):/home/supercop/supercop-20240625/supercop-data/rome0/amd64/try/c/clang_-march=native_-O2_-fwrapv_-Qunused-arguments_-fPIC_-fPIE_-gdwarf-4_-Wall/timingleaks/crypto_kem/r5nd1kem0d/ref/work/./r5_parameter_sets.h:63: first defined here
try.c: /usr/bin/ld: libcrypto_kem_r5nd1kem0d.a(a_fixed.o):/home/supercop/supercop-20240625/supercop-data/rome0/amd64/try/c/clang_-march=native_-O2_-fwrapv_-Qunused-arguments_-fPIC_-fPIE_-gdwarf-4_-Wall/timingleaks/crypto_kem/r5nd1kem0d/ref/work/./r5_parameter_sets.h:66: multiple definition of `r5_parameter_set_names'; libcrypto_kem_r5nd1kem0d.a(cpa_kem.o):/home/supercop/supercop-20240625/supercop-data/rome0/amd64/try/c/clang_-march=native_-O2_-fwrapv_-Qunused-arguments_-fPIC_-fPIE_-gdwarf-4_-Wall/timingleaks/crypto_kem/r5nd1kem0d/ref/work/./r5_parameter_sets.h:66: first defined here
try.c: /usr/bin/ld: libcrypto_kem_r5nd1kem0d.a(a_fixed.o):/home/supercop/supercop-20240625/supercop-data/rome0/amd64/try/c/clang_-march=native_-O2_-fwrapv_-Qunused-arguments_-fPIC_-fPIE_-gdwarf-4_-Wall/timingleaks/crypto_kem/r5nd1kem0d/ref/work/./r5_parameter_sets.h:63: multiple definition of `r5_parameter_sets'; libcrypto_kem_r5nd1kem0d.a(cpa_kem.o):/home/supercop/supercop-20240625/supercop-data/rome0/amd64/try/c/clang_-march=native_-O2_-fwrapv_-Qunused-arguments_-fPIC_-fPIE_-gdwarf-4_-Wall/timingleaks/crypto_kem/r5nd1kem0d/ref/work/./r5_parameter_sets.h:63: first defined here
try.c: /usr/bin/ld: libcrypto_kem_r5nd1kem0d.a(a_random.o):/home/supercop/supercop-20240625/supercop-data/rome0/amd64/try/c/clang_-march=native_-O2_-fwrapv_-Qunused-arguments_-fPIC_-fPIE_-gdwarf-4_-Wall/timingleaks/crypto_kem/r5nd1kem0d/ref/work/./r5_parameter_sets.h:66: multiple definition of `r5_parameter_set_names'; libcrypto_kem_r5nd1kem0d.a(cpa_kem.o):/home/supercop/supercop-20240625/supercop-data/rome0/amd64/try/c/clang_-march=native_-O2_-fwrapv_-Qunused-arguments_-fPIC_-fPIE_-gdwarf-4_-Wall/timingleaks/crypto_kem/r5nd1kem0d/ref/work/./r5_parameter_sets.h:66: first defined here
try.c: /usr/bin/ld: libcrypto_kem_r5nd1kem0d.a(a_random.o):/home/supercop/supercop-20240625/supercop-data/rome0/amd64/try/c/clang_-march=native_-O2_-fwrapv_-Qunused-arguments_-fPIC_-fPIE_-gdwarf-4_-Wall/timingleaks/crypto_kem/r5nd1kem0d/ref/work/./r5_parameter_sets.h:63: multiple definition of `r5_parameter_sets'; libcrypto_kem_r5nd1kem0d.a(cpa_kem.o):/home/supercop/supercop-20240625/supercop-data/rome0/amd64/try/c/clang_-march=native_-O2_-fwrapv_-Qunused-arguments_-fPIC_-fPIE_-gdwarf-4_-Wall/timingleaks/crypto_kem/r5nd1kem0d/ref/work/./r5_parameter_sets.h:63: first defined here
try.c: clang: error: linker command failed with exit code 1 (use -v to see invocation)

Number of similar (compiler,implementation) pairs: 1, namely:
CompilerImplementations
clang -march=native -O2 -fwrapv -Qunused-arguments -fPIC -fPIE -gdwarf-4 -Wall T:ref

Compiler output

Implementation: T:ref
Security model: timingleaks
Compiler: clang -march=native -O3 -fwrapv -Qunused-arguments -fPIC -fPIE -gdwarf-4 -Wall
try.c: /usr/bin/ld: libcrypto_kem_r5nd1kem0d.a(parameters.o):/home/supercop/supercop-20240625/supercop-data/rome0/amd64/try/c/clang_-march=native_-O3_-fwrapv_-Qunused-arguments_-fPIC_-fPIE_-gdwarf-4_-Wall/timingleaks/crypto_kem/r5nd1kem0d/ref/work/./r5_parameter_sets.h:66: multiple definition of `r5_parameter_set_names'; libcrypto_kem_r5nd1kem0d.a(cpa_kem.o):/home/supercop/supercop-20240625/supercop-data/rome0/amd64/try/c/clang_-march=native_-O3_-fwrapv_-Qunused-arguments_-fPIC_-fPIE_-gdwarf-4_-Wall/timingleaks/crypto_kem/r5nd1kem0d/ref/work/./r5_parameter_sets.h:66: first defined here
try.c: /usr/bin/ld: libcrypto_kem_r5nd1kem0d.a(parameters.o):/home/supercop/supercop-20240625/supercop-data/rome0/amd64/try/c/clang_-march=native_-O3_-fwrapv_-Qunused-arguments_-fPIC_-fPIE_-gdwarf-4_-Wall/timingleaks/crypto_kem/r5nd1kem0d/ref/work/./r5_parameter_sets.h:63: multiple definition of `r5_parameter_sets'; libcrypto_kem_r5nd1kem0d.a(cpa_kem.o):/home/supercop/supercop-20240625/supercop-data/rome0/amd64/try/c/clang_-march=native_-O3_-fwrapv_-Qunused-arguments_-fPIC_-fPIE_-gdwarf-4_-Wall/timingleaks/crypto_kem/r5nd1kem0d/ref/work/./r5_parameter_sets.h:63: first defined here
try.c: /usr/bin/ld: libcrypto_kem_r5nd1kem0d.a(r5_cpa_kem.o):/home/supercop/supercop-20240625/supercop-data/rome0/amd64/try/c/clang_-march=native_-O3_-fwrapv_-Qunused-arguments_-fPIC_-fPIE_-gdwarf-4_-Wall/timingleaks/crypto_kem/r5nd1kem0d/ref/work/./r5_parameter_sets.h:66: multiple definition of `r5_parameter_set_names'; libcrypto_kem_r5nd1kem0d.a(cpa_kem.o):/home/supercop/supercop-20240625/supercop-data/rome0/amd64/try/c/clang_-march=native_-O3_-fwrapv_-Qunused-arguments_-fPIC_-fPIE_-gdwarf-4_-Wall/timingleaks/crypto_kem/r5nd1kem0d/ref/work/./r5_parameter_sets.h:66: first defined here
try.c: /usr/bin/ld: libcrypto_kem_r5nd1kem0d.a(r5_cpa_kem.o):/home/supercop/supercop-20240625/supercop-data/rome0/amd64/try/c/clang_-march=native_-O3_-fwrapv_-Qunused-arguments_-fPIC_-fPIE_-gdwarf-4_-Wall/timingleaks/crypto_kem/r5nd1kem0d/ref/work/./r5_parameter_sets.h:63: multiple definition of `r5_parameter_sets'; libcrypto_kem_r5nd1kem0d.a(cpa_kem.o):/home/supercop/supercop-20240625/supercop-data/rome0/amd64/try/c/clang_-march=native_-O3_-fwrapv_-Qunused-arguments_-fPIC_-fPIE_-gdwarf-4_-Wall/timingleaks/crypto_kem/r5nd1kem0d/ref/work/./r5_parameter_sets.h:63: first defined here
try.c: /usr/bin/ld: libcrypto_kem_r5nd1kem0d.a(r5_cpa_pke.o):/home/supercop/supercop-20240625/supercop-data/rome0/amd64/try/c/clang_-march=native_-O3_-fwrapv_-Qunused-arguments_-fPIC_-fPIE_-gdwarf-4_-Wall/timingleaks/crypto_kem/r5nd1kem0d/ref/work/./r5_parameter_sets.h:66: multiple definition of `r5_parameter_set_names'; libcrypto_kem_r5nd1kem0d.a(cpa_kem.o):/home/supercop/supercop-20240625/supercop-data/rome0/amd64/try/c/clang_-march=native_-O3_-fwrapv_-Qunused-arguments_-fPIC_-fPIE_-gdwarf-4_-Wall/timingleaks/crypto_kem/r5nd1kem0d/ref/work/./r5_parameter_sets.h:66: first defined here
try.c: /usr/bin/ld: libcrypto_kem_r5nd1kem0d.a(r5_cpa_pke.o):/home/supercop/supercop-20240625/supercop-data/rome0/amd64/try/c/clang_-march=native_-O3_-fwrapv_-Qunused-arguments_-fPIC_-fPIE_-gdwarf-4_-Wall/timingleaks/crypto_kem/r5nd1kem0d/ref/work/./r5_parameter_sets.h:63: multiple definition of `r5_parameter_sets'; libcrypto_kem_r5nd1kem0d.a(cpa_kem.o):/home/supercop/supercop-20240625/supercop-data/rome0/amd64/try/c/clang_-march=native_-O3_-fwrapv_-Qunused-arguments_-fPIC_-fPIE_-gdwarf-4_-Wall/timingleaks/crypto_kem/r5nd1kem0d/ref/work/./r5_parameter_sets.h:63: first defined here
try.c: /usr/bin/ld: libcrypto_kem_r5nd1kem0d.a(r5_core.o):/home/supercop/supercop-20240625/supercop-data/rome0/amd64/try/c/clang_-march=native_-O3_-fwrapv_-Qunused-arguments_-fPIC_-fPIE_-gdwarf-4_-Wall/timingleaks/crypto_kem/r5nd1kem0d/ref/work/./r5_parameter_sets.h:66: multiple definition of `r5_parameter_set_names'; libcrypto_kem_r5nd1kem0d.a(cpa_kem.o):/home/supercop/supercop-20240625/supercop-data/rome0/amd64/try/c/clang_-march=native_-O3_-fwrapv_-Qunused-arguments_-fPIC_-fPIE_-gdwarf-4_-Wall/timingleaks/crypto_kem/r5nd1kem0d/ref/work/./r5_parameter_sets.h:66: first defined here
try.c: /usr/bin/ld: libcrypto_kem_r5nd1kem0d.a(r5_core.o):/home/supercop/supercop-20240625/supercop-data/rome0/amd64/try/c/clang_-march=native_-O3_-fwrapv_-Qunused-arguments_-fPIC_-fPIE_-gdwarf-4_-Wall/timingleaks/crypto_kem/r5nd1kem0d/ref/work/./r5_parameter_sets.h:63: multiple definition of `r5_parameter_sets'; libcrypto_kem_r5nd1kem0d.a(cpa_kem.o):/home/supercop/supercop-20240625/supercop-data/rome0/amd64/try/c/clang_-march=native_-O3_-fwrapv_-Qunused-arguments_-fPIC_-fPIE_-gdwarf-4_-Wall/timingleaks/crypto_kem/r5nd1kem0d/ref/work/./r5_parameter_sets.h:63: first defined here
try.c: /usr/bin/ld: libcrypto_kem_r5nd1kem0d.a(a_fixed.o):/home/supercop/supercop-20240625/supercop-data/rome0/amd64/try/c/clang_-march=native_-O3_-fwrapv_-Qunused-arguments_-fPIC_-fPIE_-gdwarf-4_-Wall/timingleaks/crypto_kem/r5nd1kem0d/ref/work/./r5_parameter_sets.h:66: multiple definition of `r5_parameter_set_names'; libcrypto_kem_r5nd1kem0d.a(cpa_kem.o):/home/supercop/supercop-20240625/supercop-data/rome0/amd64/try/c/clang_-march=native_-O3_-fwrapv_-Qunused-arguments_-fPIC_-fPIE_-gdwarf-4_-Wall/timingleaks/crypto_kem/r5nd1kem0d/ref/work/./r5_parameter_sets.h:66: first defined here
try.c: /usr/bin/ld: libcrypto_kem_r5nd1kem0d.a(a_fixed.o):/home/supercop/supercop-20240625/supercop-data/rome0/amd64/try/c/clang_-march=native_-O3_-fwrapv_-Qunused-arguments_-fPIC_-fPIE_-gdwarf-4_-Wall/timingleaks/crypto_kem/r5nd1kem0d/ref/work/./r5_parameter_sets.h:63: multiple definition of `r5_parameter_sets'; libcrypto_kem_r5nd1kem0d.a(cpa_kem.o):/home/supercop/supercop-20240625/supercop-data/rome0/amd64/try/c/clang_-march=native_-O3_-fwrapv_-Qunused-arguments_-fPIC_-fPIE_-gdwarf-4_-Wall/timingleaks/crypto_kem/r5nd1kem0d/ref/work/./r5_parameter_sets.h:63: first defined here
try.c: /usr/bin/ld: libcrypto_kem_r5nd1kem0d.a(a_random.o):/home/supercop/supercop-20240625/supercop-data/rome0/amd64/try/c/clang_-march=native_-O3_-fwrapv_-Qunused-arguments_-fPIC_-fPIE_-gdwarf-4_-Wall/timingleaks/crypto_kem/r5nd1kem0d/ref/work/./r5_parameter_sets.h:66: multiple definition of `r5_parameter_set_names'; libcrypto_kem_r5nd1kem0d.a(cpa_kem.o):/home/supercop/supercop-20240625/supercop-data/rome0/amd64/try/c/clang_-march=native_-O3_-fwrapv_-Qunused-arguments_-fPIC_-fPIE_-gdwarf-4_-Wall/timingleaks/crypto_kem/r5nd1kem0d/ref/work/./r5_parameter_sets.h:66: first defined here
try.c: /usr/bin/ld: libcrypto_kem_r5nd1kem0d.a(a_random.o):/home/supercop/supercop-20240625/supercop-data/rome0/amd64/try/c/clang_-march=native_-O3_-fwrapv_-Qunused-arguments_-fPIC_-fPIE_-gdwarf-4_-Wall/timingleaks/crypto_kem/r5nd1kem0d/ref/work/./r5_parameter_sets.h:63: multiple definition of `r5_parameter_sets'; libcrypto_kem_r5nd1kem0d.a(cpa_kem.o):/home/supercop/supercop-20240625/supercop-data/rome0/amd64/try/c/clang_-march=native_-O3_-fwrapv_-Qunused-arguments_-fPIC_-fPIE_-gdwarf-4_-Wall/timingleaks/crypto_kem/r5nd1kem0d/ref/work/./r5_parameter_sets.h:63: first defined here
try.c: clang: error: linker command failed with exit code 1 (use -v to see invocation)

Number of similar (compiler,implementation) pairs: 1, namely:
CompilerImplementations
clang -march=native -O3 -fwrapv -Qunused-arguments -fPIC -fPIE -gdwarf-4 -Wall T:ref

Compiler output

Implementation: T:ref
Security model: timingleaks
Compiler: clang -march=native -O -fwrapv -Qunused-arguments -fPIC -fPIE -gdwarf-4 -Wall
try.c: /usr/bin/ld: libcrypto_kem_r5nd1kem0d.a(parameters.o):/home/supercop/supercop-20240625/supercop-data/rome0/amd64/try/c/clang_-march=native_-O_-fwrapv_-Qunused-arguments_-fPIC_-fPIE_-gdwarf-4_-Wall/timingleaks/crypto_kem/r5nd1kem0d/ref/work/./r5_parameter_sets.h:66: multiple definition of `r5_parameter_set_names'; libcrypto_kem_r5nd1kem0d.a(cpa_kem.o):/home/supercop/supercop-20240625/supercop-data/rome0/amd64/try/c/clang_-march=native_-O_-fwrapv_-Qunused-arguments_-fPIC_-fPIE_-gdwarf-4_-Wall/timingleaks/crypto_kem/r5nd1kem0d/ref/work/./r5_parameter_sets.h:66: first defined here
try.c: /usr/bin/ld: libcrypto_kem_r5nd1kem0d.a(parameters.o):/home/supercop/supercop-20240625/supercop-data/rome0/amd64/try/c/clang_-march=native_-O_-fwrapv_-Qunused-arguments_-fPIC_-fPIE_-gdwarf-4_-Wall/timingleaks/crypto_kem/r5nd1kem0d/ref/work/./r5_parameter_sets.h:63: multiple definition of `r5_parameter_sets'; libcrypto_kem_r5nd1kem0d.a(cpa_kem.o):/home/supercop/supercop-20240625/supercop-data/rome0/amd64/try/c/clang_-march=native_-O_-fwrapv_-Qunused-arguments_-fPIC_-fPIE_-gdwarf-4_-Wall/timingleaks/crypto_kem/r5nd1kem0d/ref/work/./r5_parameter_sets.h:63: first defined here
try.c: /usr/bin/ld: libcrypto_kem_r5nd1kem0d.a(r5_cpa_kem.o):/home/supercop/supercop-20240625/supercop-data/rome0/amd64/try/c/clang_-march=native_-O_-fwrapv_-Qunused-arguments_-fPIC_-fPIE_-gdwarf-4_-Wall/timingleaks/crypto_kem/r5nd1kem0d/ref/work/./r5_parameter_sets.h:66: multiple definition of `r5_parameter_set_names'; libcrypto_kem_r5nd1kem0d.a(cpa_kem.o):/home/supercop/supercop-20240625/supercop-data/rome0/amd64/try/c/clang_-march=native_-O_-fwrapv_-Qunused-arguments_-fPIC_-fPIE_-gdwarf-4_-Wall/timingleaks/crypto_kem/r5nd1kem0d/ref/work/./r5_parameter_sets.h:66: first defined here
try.c: /usr/bin/ld: libcrypto_kem_r5nd1kem0d.a(r5_cpa_kem.o):/home/supercop/supercop-20240625/supercop-data/rome0/amd64/try/c/clang_-march=native_-O_-fwrapv_-Qunused-arguments_-fPIC_-fPIE_-gdwarf-4_-Wall/timingleaks/crypto_kem/r5nd1kem0d/ref/work/./r5_parameter_sets.h:63: multiple definition of `r5_parameter_sets'; libcrypto_kem_r5nd1kem0d.a(cpa_kem.o):/home/supercop/supercop-20240625/supercop-data/rome0/amd64/try/c/clang_-march=native_-O_-fwrapv_-Qunused-arguments_-fPIC_-fPIE_-gdwarf-4_-Wall/timingleaks/crypto_kem/r5nd1kem0d/ref/work/./r5_parameter_sets.h:63: first defined here
try.c: /usr/bin/ld: libcrypto_kem_r5nd1kem0d.a(r5_cpa_pke.o):/home/supercop/supercop-20240625/supercop-data/rome0/amd64/try/c/clang_-march=native_-O_-fwrapv_-Qunused-arguments_-fPIC_-fPIE_-gdwarf-4_-Wall/timingleaks/crypto_kem/r5nd1kem0d/ref/work/./r5_parameter_sets.h:66: multiple definition of `r5_parameter_set_names'; libcrypto_kem_r5nd1kem0d.a(cpa_kem.o):/home/supercop/supercop-20240625/supercop-data/rome0/amd64/try/c/clang_-march=native_-O_-fwrapv_-Qunused-arguments_-fPIC_-fPIE_-gdwarf-4_-Wall/timingleaks/crypto_kem/r5nd1kem0d/ref/work/./r5_parameter_sets.h:66: first defined here
try.c: /usr/bin/ld: libcrypto_kem_r5nd1kem0d.a(r5_cpa_pke.o):/home/supercop/supercop-20240625/supercop-data/rome0/amd64/try/c/clang_-march=native_-O_-fwrapv_-Qunused-arguments_-fPIC_-fPIE_-gdwarf-4_-Wall/timingleaks/crypto_kem/r5nd1kem0d/ref/work/./r5_parameter_sets.h:63: multiple definition of `r5_parameter_sets'; libcrypto_kem_r5nd1kem0d.a(cpa_kem.o):/home/supercop/supercop-20240625/supercop-data/rome0/amd64/try/c/clang_-march=native_-O_-fwrapv_-Qunused-arguments_-fPIC_-fPIE_-gdwarf-4_-Wall/timingleaks/crypto_kem/r5nd1kem0d/ref/work/./r5_parameter_sets.h:63: first defined here
try.c: /usr/bin/ld: libcrypto_kem_r5nd1kem0d.a(r5_core.o):/home/supercop/supercop-20240625/supercop-data/rome0/amd64/try/c/clang_-march=native_-O_-fwrapv_-Qunused-arguments_-fPIC_-fPIE_-gdwarf-4_-Wall/timingleaks/crypto_kem/r5nd1kem0d/ref/work/./r5_parameter_sets.h:66: multiple definition of `r5_parameter_set_names'; libcrypto_kem_r5nd1kem0d.a(cpa_kem.o):/home/supercop/supercop-20240625/supercop-data/rome0/amd64/try/c/clang_-march=native_-O_-fwrapv_-Qunused-arguments_-fPIC_-fPIE_-gdwarf-4_-Wall/timingleaks/crypto_kem/r5nd1kem0d/ref/work/./r5_parameter_sets.h:66: first defined here
try.c: /usr/bin/ld: libcrypto_kem_r5nd1kem0d.a(r5_core.o):/home/supercop/supercop-20240625/supercop-data/rome0/amd64/try/c/clang_-march=native_-O_-fwrapv_-Qunused-arguments_-fPIC_-fPIE_-gdwarf-4_-Wall/timingleaks/crypto_kem/r5nd1kem0d/ref/work/./r5_parameter_sets.h:63: multiple definition of `r5_parameter_sets'; libcrypto_kem_r5nd1kem0d.a(cpa_kem.o):/home/supercop/supercop-20240625/supercop-data/rome0/amd64/try/c/clang_-march=native_-O_-fwrapv_-Qunused-arguments_-fPIC_-fPIE_-gdwarf-4_-Wall/timingleaks/crypto_kem/r5nd1kem0d/ref/work/./r5_parameter_sets.h:63: first defined here
try.c: /usr/bin/ld: libcrypto_kem_r5nd1kem0d.a(a_fixed.o):/home/supercop/supercop-20240625/supercop-data/rome0/amd64/try/c/clang_-march=native_-O_-fwrapv_-Qunused-arguments_-fPIC_-fPIE_-gdwarf-4_-Wall/timingleaks/crypto_kem/r5nd1kem0d/ref/work/./r5_parameter_sets.h:66: multiple definition of `r5_parameter_set_names'; libcrypto_kem_r5nd1kem0d.a(cpa_kem.o):/home/supercop/supercop-20240625/supercop-data/rome0/amd64/try/c/clang_-march=native_-O_-fwrapv_-Qunused-arguments_-fPIC_-fPIE_-gdwarf-4_-Wall/timingleaks/crypto_kem/r5nd1kem0d/ref/work/./r5_parameter_sets.h:66: first defined here
try.c: /usr/bin/ld: libcrypto_kem_r5nd1kem0d.a(a_fixed.o):/home/supercop/supercop-20240625/supercop-data/rome0/amd64/try/c/clang_-march=native_-O_-fwrapv_-Qunused-arguments_-fPIC_-fPIE_-gdwarf-4_-Wall/timingleaks/crypto_kem/r5nd1kem0d/ref/work/./r5_parameter_sets.h:63: multiple definition of `r5_parameter_sets'; libcrypto_kem_r5nd1kem0d.a(cpa_kem.o):/home/supercop/supercop-20240625/supercop-data/rome0/amd64/try/c/clang_-march=native_-O_-fwrapv_-Qunused-arguments_-fPIC_-fPIE_-gdwarf-4_-Wall/timingleaks/crypto_kem/r5nd1kem0d/ref/work/./r5_parameter_sets.h:63: first defined here
try.c: /usr/bin/ld: libcrypto_kem_r5nd1kem0d.a(a_random.o):/home/supercop/supercop-20240625/supercop-data/rome0/amd64/try/c/clang_-march=native_-O_-fwrapv_-Qunused-arguments_-fPIC_-fPIE_-gdwarf-4_-Wall/timingleaks/crypto_kem/r5nd1kem0d/ref/work/./r5_parameter_sets.h:66: multiple definition of `r5_parameter_set_names'; libcrypto_kem_r5nd1kem0d.a(cpa_kem.o):/home/supercop/supercop-20240625/supercop-data/rome0/amd64/try/c/clang_-march=native_-O_-fwrapv_-Qunused-arguments_-fPIC_-fPIE_-gdwarf-4_-Wall/timingleaks/crypto_kem/r5nd1kem0d/ref/work/./r5_parameter_sets.h:66: first defined here
try.c: /usr/bin/ld: libcrypto_kem_r5nd1kem0d.a(a_random.o):/home/supercop/supercop-20240625/supercop-data/rome0/amd64/try/c/clang_-march=native_-O_-fwrapv_-Qunused-arguments_-fPIC_-fPIE_-gdwarf-4_-Wall/timingleaks/crypto_kem/r5nd1kem0d/ref/work/./r5_parameter_sets.h:63: multiple definition of `r5_parameter_sets'; libcrypto_kem_r5nd1kem0d.a(cpa_kem.o):/home/supercop/supercop-20240625/supercop-data/rome0/amd64/try/c/clang_-march=native_-O_-fwrapv_-Qunused-arguments_-fPIC_-fPIE_-gdwarf-4_-Wall/timingleaks/crypto_kem/r5nd1kem0d/ref/work/./r5_parameter_sets.h:63: first defined here
try.c: clang: error: linker command failed with exit code 1 (use -v to see invocation)

Number of similar (compiler,implementation) pairs: 1, namely:
CompilerImplementations
clang -march=native -O -fwrapv -Qunused-arguments -fPIC -fPIE -gdwarf-4 -Wall T:ref

Compiler output

Implementation: T:ref
Security model: timingleaks
Compiler: clang -march=native -Os -fwrapv -Qunused-arguments -fPIC -fPIE -gdwarf-4 -Wall
try.c: /usr/bin/ld: libcrypto_kem_r5nd1kem0d.a(parameters.o):/home/supercop/supercop-20240625/supercop-data/rome0/amd64/try/c/clang_-march=native_-Os_-fwrapv_-Qunused-arguments_-fPIC_-fPIE_-gdwarf-4_-Wall/timingleaks/crypto_kem/r5nd1kem0d/ref/work/./r5_parameter_sets.h:66: multiple definition of `r5_parameter_set_names'; libcrypto_kem_r5nd1kem0d.a(cpa_kem.o):/home/supercop/supercop-20240625/supercop-data/rome0/amd64/try/c/clang_-march=native_-Os_-fwrapv_-Qunused-arguments_-fPIC_-fPIE_-gdwarf-4_-Wall/timingleaks/crypto_kem/r5nd1kem0d/ref/work/./r5_parameter_sets.h:66: first defined here
try.c: /usr/bin/ld: libcrypto_kem_r5nd1kem0d.a(parameters.o):/home/supercop/supercop-20240625/supercop-data/rome0/amd64/try/c/clang_-march=native_-Os_-fwrapv_-Qunused-arguments_-fPIC_-fPIE_-gdwarf-4_-Wall/timingleaks/crypto_kem/r5nd1kem0d/ref/work/./r5_parameter_sets.h:63: multiple definition of `r5_parameter_sets'; libcrypto_kem_r5nd1kem0d.a(cpa_kem.o):/home/supercop/supercop-20240625/supercop-data/rome0/amd64/try/c/clang_-march=native_-Os_-fwrapv_-Qunused-arguments_-fPIC_-fPIE_-gdwarf-4_-Wall/timingleaks/crypto_kem/r5nd1kem0d/ref/work/./r5_parameter_sets.h:63: first defined here
try.c: /usr/bin/ld: libcrypto_kem_r5nd1kem0d.a(r5_cpa_kem.o):/home/supercop/supercop-20240625/supercop-data/rome0/amd64/try/c/clang_-march=native_-Os_-fwrapv_-Qunused-arguments_-fPIC_-fPIE_-gdwarf-4_-Wall/timingleaks/crypto_kem/r5nd1kem0d/ref/work/./r5_parameter_sets.h:66: multiple definition of `r5_parameter_set_names'; libcrypto_kem_r5nd1kem0d.a(cpa_kem.o):/home/supercop/supercop-20240625/supercop-data/rome0/amd64/try/c/clang_-march=native_-Os_-fwrapv_-Qunused-arguments_-fPIC_-fPIE_-gdwarf-4_-Wall/timingleaks/crypto_kem/r5nd1kem0d/ref/work/./r5_parameter_sets.h:66: first defined here
try.c: /usr/bin/ld: libcrypto_kem_r5nd1kem0d.a(r5_cpa_kem.o):/home/supercop/supercop-20240625/supercop-data/rome0/amd64/try/c/clang_-march=native_-Os_-fwrapv_-Qunused-arguments_-fPIC_-fPIE_-gdwarf-4_-Wall/timingleaks/crypto_kem/r5nd1kem0d/ref/work/./r5_parameter_sets.h:63: multiple definition of `r5_parameter_sets'; libcrypto_kem_r5nd1kem0d.a(cpa_kem.o):/home/supercop/supercop-20240625/supercop-data/rome0/amd64/try/c/clang_-march=native_-Os_-fwrapv_-Qunused-arguments_-fPIC_-fPIE_-gdwarf-4_-Wall/timingleaks/crypto_kem/r5nd1kem0d/ref/work/./r5_parameter_sets.h:63: first defined here
try.c: /usr/bin/ld: libcrypto_kem_r5nd1kem0d.a(r5_cpa_pke.o):/home/supercop/supercop-20240625/supercop-data/rome0/amd64/try/c/clang_-march=native_-Os_-fwrapv_-Qunused-arguments_-fPIC_-fPIE_-gdwarf-4_-Wall/timingleaks/crypto_kem/r5nd1kem0d/ref/work/./r5_parameter_sets.h:66: multiple definition of `r5_parameter_set_names'; libcrypto_kem_r5nd1kem0d.a(cpa_kem.o):/home/supercop/supercop-20240625/supercop-data/rome0/amd64/try/c/clang_-march=native_-Os_-fwrapv_-Qunused-arguments_-fPIC_-fPIE_-gdwarf-4_-Wall/timingleaks/crypto_kem/r5nd1kem0d/ref/work/./r5_parameter_sets.h:66: first defined here
try.c: /usr/bin/ld: libcrypto_kem_r5nd1kem0d.a(r5_cpa_pke.o):/home/supercop/supercop-20240625/supercop-data/rome0/amd64/try/c/clang_-march=native_-Os_-fwrapv_-Qunused-arguments_-fPIC_-fPIE_-gdwarf-4_-Wall/timingleaks/crypto_kem/r5nd1kem0d/ref/work/./r5_parameter_sets.h:63: multiple definition of `r5_parameter_sets'; libcrypto_kem_r5nd1kem0d.a(cpa_kem.o):/home/supercop/supercop-20240625/supercop-data/rome0/amd64/try/c/clang_-march=native_-Os_-fwrapv_-Qunused-arguments_-fPIC_-fPIE_-gdwarf-4_-Wall/timingleaks/crypto_kem/r5nd1kem0d/ref/work/./r5_parameter_sets.h:63: first defined here
try.c: /usr/bin/ld: libcrypto_kem_r5nd1kem0d.a(r5_core.o):/home/supercop/supercop-20240625/supercop-data/rome0/amd64/try/c/clang_-march=native_-Os_-fwrapv_-Qunused-arguments_-fPIC_-fPIE_-gdwarf-4_-Wall/timingleaks/crypto_kem/r5nd1kem0d/ref/work/./r5_parameter_sets.h:66: multiple definition of `r5_parameter_set_names'; libcrypto_kem_r5nd1kem0d.a(cpa_kem.o):/home/supercop/supercop-20240625/supercop-data/rome0/amd64/try/c/clang_-march=native_-Os_-fwrapv_-Qunused-arguments_-fPIC_-fPIE_-gdwarf-4_-Wall/timingleaks/crypto_kem/r5nd1kem0d/ref/work/./r5_parameter_sets.h:66: first defined here
try.c: /usr/bin/ld: libcrypto_kem_r5nd1kem0d.a(r5_core.o):/home/supercop/supercop-20240625/supercop-data/rome0/amd64/try/c/clang_-march=native_-Os_-fwrapv_-Qunused-arguments_-fPIC_-fPIE_-gdwarf-4_-Wall/timingleaks/crypto_kem/r5nd1kem0d/ref/work/./r5_parameter_sets.h:63: multiple definition of `r5_parameter_sets'; libcrypto_kem_r5nd1kem0d.a(cpa_kem.o):/home/supercop/supercop-20240625/supercop-data/rome0/amd64/try/c/clang_-march=native_-Os_-fwrapv_-Qunused-arguments_-fPIC_-fPIE_-gdwarf-4_-Wall/timingleaks/crypto_kem/r5nd1kem0d/ref/work/./r5_parameter_sets.h:63: first defined here
try.c: /usr/bin/ld: libcrypto_kem_r5nd1kem0d.a(a_fixed.o):/home/supercop/supercop-20240625/supercop-data/rome0/amd64/try/c/clang_-march=native_-Os_-fwrapv_-Qunused-arguments_-fPIC_-fPIE_-gdwarf-4_-Wall/timingleaks/crypto_kem/r5nd1kem0d/ref/work/./r5_parameter_sets.h:66: multiple definition of `r5_parameter_set_names'; libcrypto_kem_r5nd1kem0d.a(cpa_kem.o):/home/supercop/supercop-20240625/supercop-data/rome0/amd64/try/c/clang_-march=native_-Os_-fwrapv_-Qunused-arguments_-fPIC_-fPIE_-gdwarf-4_-Wall/timingleaks/crypto_kem/r5nd1kem0d/ref/work/./r5_parameter_sets.h:66: first defined here
try.c: /usr/bin/ld: libcrypto_kem_r5nd1kem0d.a(a_fixed.o):/home/supercop/supercop-20240625/supercop-data/rome0/amd64/try/c/clang_-march=native_-Os_-fwrapv_-Qunused-arguments_-fPIC_-fPIE_-gdwarf-4_-Wall/timingleaks/crypto_kem/r5nd1kem0d/ref/work/./r5_parameter_sets.h:63: multiple definition of `r5_parameter_sets'; libcrypto_kem_r5nd1kem0d.a(cpa_kem.o):/home/supercop/supercop-20240625/supercop-data/rome0/amd64/try/c/clang_-march=native_-Os_-fwrapv_-Qunused-arguments_-fPIC_-fPIE_-gdwarf-4_-Wall/timingleaks/crypto_kem/r5nd1kem0d/ref/work/./r5_parameter_sets.h:63: first defined here
try.c: /usr/bin/ld: libcrypto_kem_r5nd1kem0d.a(a_random.o):/home/supercop/supercop-20240625/supercop-data/rome0/amd64/try/c/clang_-march=native_-Os_-fwrapv_-Qunused-arguments_-fPIC_-fPIE_-gdwarf-4_-Wall/timingleaks/crypto_kem/r5nd1kem0d/ref/work/./r5_parameter_sets.h:66: multiple definition of `r5_parameter_set_names'; libcrypto_kem_r5nd1kem0d.a(cpa_kem.o):/home/supercop/supercop-20240625/supercop-data/rome0/amd64/try/c/clang_-march=native_-Os_-fwrapv_-Qunused-arguments_-fPIC_-fPIE_-gdwarf-4_-Wall/timingleaks/crypto_kem/r5nd1kem0d/ref/work/./r5_parameter_sets.h:66: first defined here
try.c: /usr/bin/ld: libcrypto_kem_r5nd1kem0d.a(a_random.o):/home/supercop/supercop-20240625/supercop-data/rome0/amd64/try/c/clang_-march=native_-Os_-fwrapv_-Qunused-arguments_-fPIC_-fPIE_-gdwarf-4_-Wall/timingleaks/crypto_kem/r5nd1kem0d/ref/work/./r5_parameter_sets.h:63: multiple definition of `r5_parameter_sets'; libcrypto_kem_r5nd1kem0d.a(cpa_kem.o):/home/supercop/supercop-20240625/supercop-data/rome0/amd64/try/c/clang_-march=native_-Os_-fwrapv_-Qunused-arguments_-fPIC_-fPIE_-gdwarf-4_-Wall/timingleaks/crypto_kem/r5nd1kem0d/ref/work/./r5_parameter_sets.h:63: first defined here
try.c: clang: error: linker command failed with exit code 1 (use -v to see invocation)

Number of similar (compiler,implementation) pairs: 1, namely:
CompilerImplementations
clang -march=native -Os -fwrapv -Qunused-arguments -fPIC -fPIE -gdwarf-4 -Wall T:ref

Compiler output

Implementation: T:ref
Security model: timingleaks
Compiler: clang -mcpu=native -O3 -fwrapv -Qunused-arguments -fPIC -fPIE -gdwarf-4 -Wall
try.c: /usr/bin/ld: libcrypto_kem_r5nd1kem0d.a(parameters.o):/home/supercop/supercop-20240625/supercop-data/rome0/amd64/try/c/clang_-mcpu=native_-O3_-fwrapv_-Qunused-arguments_-fPIC_-fPIE_-gdwarf-4_-Wall/timingleaks/crypto_kem/r5nd1kem0d/ref/work/./r5_parameter_sets.h:66: multiple definition of `r5_parameter_set_names'; libcrypto_kem_r5nd1kem0d.a(cpa_kem.o):/home/supercop/supercop-20240625/supercop-data/rome0/amd64/try/c/clang_-mcpu=native_-O3_-fwrapv_-Qunused-arguments_-fPIC_-fPIE_-gdwarf-4_-Wall/timingleaks/crypto_kem/r5nd1kem0d/ref/work/./r5_parameter_sets.h:66: first defined here
try.c: /usr/bin/ld: libcrypto_kem_r5nd1kem0d.a(parameters.o):/home/supercop/supercop-20240625/supercop-data/rome0/amd64/try/c/clang_-mcpu=native_-O3_-fwrapv_-Qunused-arguments_-fPIC_-fPIE_-gdwarf-4_-Wall/timingleaks/crypto_kem/r5nd1kem0d/ref/work/./r5_parameter_sets.h:63: multiple definition of `r5_parameter_sets'; libcrypto_kem_r5nd1kem0d.a(cpa_kem.o):/home/supercop/supercop-20240625/supercop-data/rome0/amd64/try/c/clang_-mcpu=native_-O3_-fwrapv_-Qunused-arguments_-fPIC_-fPIE_-gdwarf-4_-Wall/timingleaks/crypto_kem/r5nd1kem0d/ref/work/./r5_parameter_sets.h:63: first defined here
try.c: /usr/bin/ld: libcrypto_kem_r5nd1kem0d.a(r5_cpa_kem.o):/home/supercop/supercop-20240625/supercop-data/rome0/amd64/try/c/clang_-mcpu=native_-O3_-fwrapv_-Qunused-arguments_-fPIC_-fPIE_-gdwarf-4_-Wall/timingleaks/crypto_kem/r5nd1kem0d/ref/work/./r5_parameter_sets.h:66: multiple definition of `r5_parameter_set_names'; libcrypto_kem_r5nd1kem0d.a(cpa_kem.o):/home/supercop/supercop-20240625/supercop-data/rome0/amd64/try/c/clang_-mcpu=native_-O3_-fwrapv_-Qunused-arguments_-fPIC_-fPIE_-gdwarf-4_-Wall/timingleaks/crypto_kem/r5nd1kem0d/ref/work/./r5_parameter_sets.h:66: first defined here
try.c: /usr/bin/ld: libcrypto_kem_r5nd1kem0d.a(r5_cpa_kem.o):/home/supercop/supercop-20240625/supercop-data/rome0/amd64/try/c/clang_-mcpu=native_-O3_-fwrapv_-Qunused-arguments_-fPIC_-fPIE_-gdwarf-4_-Wall/timingleaks/crypto_kem/r5nd1kem0d/ref/work/./r5_parameter_sets.h:63: multiple definition of `r5_parameter_sets'; libcrypto_kem_r5nd1kem0d.a(cpa_kem.o):/home/supercop/supercop-20240625/supercop-data/rome0/amd64/try/c/clang_-mcpu=native_-O3_-fwrapv_-Qunused-arguments_-fPIC_-fPIE_-gdwarf-4_-Wall/timingleaks/crypto_kem/r5nd1kem0d/ref/work/./r5_parameter_sets.h:63: first defined here
try.c: /usr/bin/ld: libcrypto_kem_r5nd1kem0d.a(r5_cpa_pke.o):/home/supercop/supercop-20240625/supercop-data/rome0/amd64/try/c/clang_-mcpu=native_-O3_-fwrapv_-Qunused-arguments_-fPIC_-fPIE_-gdwarf-4_-Wall/timingleaks/crypto_kem/r5nd1kem0d/ref/work/./r5_parameter_sets.h:66: multiple definition of `r5_parameter_set_names'; libcrypto_kem_r5nd1kem0d.a(cpa_kem.o):/home/supercop/supercop-20240625/supercop-data/rome0/amd64/try/c/clang_-mcpu=native_-O3_-fwrapv_-Qunused-arguments_-fPIC_-fPIE_-gdwarf-4_-Wall/timingleaks/crypto_kem/r5nd1kem0d/ref/work/./r5_parameter_sets.h:66: first defined here
try.c: /usr/bin/ld: libcrypto_kem_r5nd1kem0d.a(r5_cpa_pke.o):/home/supercop/supercop-20240625/supercop-data/rome0/amd64/try/c/clang_-mcpu=native_-O3_-fwrapv_-Qunused-arguments_-fPIC_-fPIE_-gdwarf-4_-Wall/timingleaks/crypto_kem/r5nd1kem0d/ref/work/./r5_parameter_sets.h:63: multiple definition of `r5_parameter_sets'; libcrypto_kem_r5nd1kem0d.a(cpa_kem.o):/home/supercop/supercop-20240625/supercop-data/rome0/amd64/try/c/clang_-mcpu=native_-O3_-fwrapv_-Qunused-arguments_-fPIC_-fPIE_-gdwarf-4_-Wall/timingleaks/crypto_kem/r5nd1kem0d/ref/work/./r5_parameter_sets.h:63: first defined here
try.c: /usr/bin/ld: libcrypto_kem_r5nd1kem0d.a(r5_core.o):/home/supercop/supercop-20240625/supercop-data/rome0/amd64/try/c/clang_-mcpu=native_-O3_-fwrapv_-Qunused-arguments_-fPIC_-fPIE_-gdwarf-4_-Wall/timingleaks/crypto_kem/r5nd1kem0d/ref/work/./r5_parameter_sets.h:66: multiple definition of `r5_parameter_set_names'; libcrypto_kem_r5nd1kem0d.a(cpa_kem.o):/home/supercop/supercop-20240625/supercop-data/rome0/amd64/try/c/clang_-mcpu=native_-O3_-fwrapv_-Qunused-arguments_-fPIC_-fPIE_-gdwarf-4_-Wall/timingleaks/crypto_kem/r5nd1kem0d/ref/work/./r5_parameter_sets.h:66: first defined here
try.c: /usr/bin/ld: libcrypto_kem_r5nd1kem0d.a(r5_core.o):/home/supercop/supercop-20240625/supercop-data/rome0/amd64/try/c/clang_-mcpu=native_-O3_-fwrapv_-Qunused-arguments_-fPIC_-fPIE_-gdwarf-4_-Wall/timingleaks/crypto_kem/r5nd1kem0d/ref/work/./r5_parameter_sets.h:63: multiple definition of `r5_parameter_sets'; libcrypto_kem_r5nd1kem0d.a(cpa_kem.o):/home/supercop/supercop-20240625/supercop-data/rome0/amd64/try/c/clang_-mcpu=native_-O3_-fwrapv_-Qunused-arguments_-fPIC_-fPIE_-gdwarf-4_-Wall/timingleaks/crypto_kem/r5nd1kem0d/ref/work/./r5_parameter_sets.h:63: first defined here
try.c: /usr/bin/ld: libcrypto_kem_r5nd1kem0d.a(a_fixed.o):/home/supercop/supercop-20240625/supercop-data/rome0/amd64/try/c/clang_-mcpu=native_-O3_-fwrapv_-Qunused-arguments_-fPIC_-fPIE_-gdwarf-4_-Wall/timingleaks/crypto_kem/r5nd1kem0d/ref/work/./r5_parameter_sets.h:66: multiple definition of `r5_parameter_set_names'; libcrypto_kem_r5nd1kem0d.a(cpa_kem.o):/home/supercop/supercop-20240625/supercop-data/rome0/amd64/try/c/clang_-mcpu=native_-O3_-fwrapv_-Qunused-arguments_-fPIC_-fPIE_-gdwarf-4_-Wall/timingleaks/crypto_kem/r5nd1kem0d/ref/work/./r5_parameter_sets.h:66: first defined here
try.c: /usr/bin/ld: libcrypto_kem_r5nd1kem0d.a(a_fixed.o):/home/supercop/supercop-20240625/supercop-data/rome0/amd64/try/c/clang_-mcpu=native_-O3_-fwrapv_-Qunused-arguments_-fPIC_-fPIE_-gdwarf-4_-Wall/timingleaks/crypto_kem/r5nd1kem0d/ref/work/./r5_parameter_sets.h:63: multiple definition of `r5_parameter_sets'; libcrypto_kem_r5nd1kem0d.a(cpa_kem.o):/home/supercop/supercop-20240625/supercop-data/rome0/amd64/try/c/clang_-mcpu=native_-O3_-fwrapv_-Qunused-arguments_-fPIC_-fPIE_-gdwarf-4_-Wall/timingleaks/crypto_kem/r5nd1kem0d/ref/work/./r5_parameter_sets.h:63: first defined here
try.c: /usr/bin/ld: libcrypto_kem_r5nd1kem0d.a(a_random.o):/home/supercop/supercop-20240625/supercop-data/rome0/amd64/try/c/clang_-mcpu=native_-O3_-fwrapv_-Qunused-arguments_-fPIC_-fPIE_-gdwarf-4_-Wall/timingleaks/crypto_kem/r5nd1kem0d/ref/work/./r5_parameter_sets.h:66: multiple definition of `r5_parameter_set_names'; libcrypto_kem_r5nd1kem0d.a(cpa_kem.o):/home/supercop/supercop-20240625/supercop-data/rome0/amd64/try/c/clang_-mcpu=native_-O3_-fwrapv_-Qunused-arguments_-fPIC_-fPIE_-gdwarf-4_-Wall/timingleaks/crypto_kem/r5nd1kem0d/ref/work/./r5_parameter_sets.h:66: first defined here
try.c: /usr/bin/ld: libcrypto_kem_r5nd1kem0d.a(a_random.o):/home/supercop/supercop-20240625/supercop-data/rome0/amd64/try/c/clang_-mcpu=native_-O3_-fwrapv_-Qunused-arguments_-fPIC_-fPIE_-gdwarf-4_-Wall/timingleaks/crypto_kem/r5nd1kem0d/ref/work/./r5_parameter_sets.h:63: multiple definition of `r5_parameter_sets'; libcrypto_kem_r5nd1kem0d.a(cpa_kem.o):/home/supercop/supercop-20240625/supercop-data/rome0/amd64/try/c/clang_-mcpu=native_-O3_-fwrapv_-Qunused-arguments_-fPIC_-fPIE_-gdwarf-4_-Wall/timingleaks/crypto_kem/r5nd1kem0d/ref/work/./r5_parameter_sets.h:63: first defined here
try.c: clang: error: linker command failed with exit code 1 (use -v to see invocation)

Number of similar (compiler,implementation) pairs: 1, namely:
CompilerImplementations
clang -mcpu=native -O3 -fwrapv -Qunused-arguments -fPIC -fPIE -gdwarf-4 -Wall T:ref

Compiler output

Implementation: T:ref
Security model: timingleaks
Compiler: gcc -march=native -mtune=native -O2 -fwrapv -fPIC -fPIE -gdwarf-4 -Wall
try.c: /usr/bin/ld: libcrypto_kem_r5nd1kem0d.a(parameters.o):/home/supercop/supercop-20240625/supercop-data/rome0/amd64/try/c/gcc_-march=native_-mtune=native_-O2_-fwrapv_-fPIC_-fPIE_-gdwarf-4_-Wall/timingleaks/crypto_kem/r5nd1kem0d/ref/work/r5_parameter_sets.h:66: multiple definition of `r5_parameter_set_names'; libcrypto_kem_r5nd1kem0d.a(cpa_kem.o):/home/supercop/supercop-20240625/supercop-data/rome0/amd64/try/c/gcc_-march=native_-mtune=native_-O2_-fwrapv_-fPIC_-fPIE_-gdwarf-4_-Wall/timingleaks/crypto_kem/r5nd1kem0d/ref/work/r5_parameter_sets.h:66: first defined here
try.c: /usr/bin/ld: libcrypto_kem_r5nd1kem0d.a(parameters.o):/home/supercop/supercop-20240625/supercop-data/rome0/amd64/try/c/gcc_-march=native_-mtune=native_-O2_-fwrapv_-fPIC_-fPIE_-gdwarf-4_-Wall/timingleaks/crypto_kem/r5nd1kem0d/ref/work/r5_parameter_sets.h:63: multiple definition of `r5_parameter_sets'; libcrypto_kem_r5nd1kem0d.a(cpa_kem.o):/home/supercop/supercop-20240625/supercop-data/rome0/amd64/try/c/gcc_-march=native_-mtune=native_-O2_-fwrapv_-fPIC_-fPIE_-gdwarf-4_-Wall/timingleaks/crypto_kem/r5nd1kem0d/ref/work/r5_parameter_sets.h:63: first defined here
try.c: /usr/bin/ld: libcrypto_kem_r5nd1kem0d.a(r5_cpa_kem.o):/home/supercop/supercop-20240625/supercop-data/rome0/amd64/try/c/gcc_-march=native_-mtune=native_-O2_-fwrapv_-fPIC_-fPIE_-gdwarf-4_-Wall/timingleaks/crypto_kem/r5nd1kem0d/ref/work/r5_parameter_sets.h:66: multiple definition of `r5_parameter_set_names'; libcrypto_kem_r5nd1kem0d.a(cpa_kem.o):/home/supercop/supercop-20240625/supercop-data/rome0/amd64/try/c/gcc_-march=native_-mtune=native_-O2_-fwrapv_-fPIC_-fPIE_-gdwarf-4_-Wall/timingleaks/crypto_kem/r5nd1kem0d/ref/work/r5_parameter_sets.h:66: first defined here
try.c: /usr/bin/ld: libcrypto_kem_r5nd1kem0d.a(r5_cpa_kem.o):/home/supercop/supercop-20240625/supercop-data/rome0/amd64/try/c/gcc_-march=native_-mtune=native_-O2_-fwrapv_-fPIC_-fPIE_-gdwarf-4_-Wall/timingleaks/crypto_kem/r5nd1kem0d/ref/work/r5_parameter_sets.h:63: multiple definition of `r5_parameter_sets'; libcrypto_kem_r5nd1kem0d.a(cpa_kem.o):/home/supercop/supercop-20240625/supercop-data/rome0/amd64/try/c/gcc_-march=native_-mtune=native_-O2_-fwrapv_-fPIC_-fPIE_-gdwarf-4_-Wall/timingleaks/crypto_kem/r5nd1kem0d/ref/work/r5_parameter_sets.h:63: first defined here
try.c: /usr/bin/ld: libcrypto_kem_r5nd1kem0d.a(r5_cpa_pke.o):/home/supercop/supercop-20240625/supercop-data/rome0/amd64/try/c/gcc_-march=native_-mtune=native_-O2_-fwrapv_-fPIC_-fPIE_-gdwarf-4_-Wall/timingleaks/crypto_kem/r5nd1kem0d/ref/work/r5_parameter_sets.h:66: multiple definition of `r5_parameter_set_names'; libcrypto_kem_r5nd1kem0d.a(cpa_kem.o):/home/supercop/supercop-20240625/supercop-data/rome0/amd64/try/c/gcc_-march=native_-mtune=native_-O2_-fwrapv_-fPIC_-fPIE_-gdwarf-4_-Wall/timingleaks/crypto_kem/r5nd1kem0d/ref/work/r5_parameter_sets.h:66: first defined here
try.c: /usr/bin/ld: libcrypto_kem_r5nd1kem0d.a(r5_cpa_pke.o):/home/supercop/supercop-20240625/supercop-data/rome0/amd64/try/c/gcc_-march=native_-mtune=native_-O2_-fwrapv_-fPIC_-fPIE_-gdwarf-4_-Wall/timingleaks/crypto_kem/r5nd1kem0d/ref/work/r5_parameter_sets.h:63: multiple definition of `r5_parameter_sets'; libcrypto_kem_r5nd1kem0d.a(cpa_kem.o):/home/supercop/supercop-20240625/supercop-data/rome0/amd64/try/c/gcc_-march=native_-mtune=native_-O2_-fwrapv_-fPIC_-fPIE_-gdwarf-4_-Wall/timingleaks/crypto_kem/r5nd1kem0d/ref/work/r5_parameter_sets.h:63: first defined here
try.c: /usr/bin/ld: libcrypto_kem_r5nd1kem0d.a(r5_core.o):/home/supercop/supercop-20240625/supercop-data/rome0/amd64/try/c/gcc_-march=native_-mtune=native_-O2_-fwrapv_-fPIC_-fPIE_-gdwarf-4_-Wall/timingleaks/crypto_kem/r5nd1kem0d/ref/work/r5_parameter_sets.h:66: multiple definition of `r5_parameter_set_names'; libcrypto_kem_r5nd1kem0d.a(cpa_kem.o):/home/supercop/supercop-20240625/supercop-data/rome0/amd64/try/c/gcc_-march=native_-mtune=native_-O2_-fwrapv_-fPIC_-fPIE_-gdwarf-4_-Wall/timingleaks/crypto_kem/r5nd1kem0d/ref/work/r5_parameter_sets.h:66: first defined here
try.c: /usr/bin/ld: libcrypto_kem_r5nd1kem0d.a(r5_core.o):/home/supercop/supercop-20240625/supercop-data/rome0/amd64/try/c/gcc_-march=native_-mtune=native_-O2_-fwrapv_-fPIC_-fPIE_-gdwarf-4_-Wall/timingleaks/crypto_kem/r5nd1kem0d/ref/work/r5_parameter_sets.h:63: multiple definition of `r5_parameter_sets'; libcrypto_kem_r5nd1kem0d.a(cpa_kem.o):/home/supercop/supercop-20240625/supercop-data/rome0/amd64/try/c/gcc_-march=native_-mtune=native_-O2_-fwrapv_-fPIC_-fPIE_-gdwarf-4_-Wall/timingleaks/crypto_kem/r5nd1kem0d/ref/work/r5_parameter_sets.h:63: first defined here
try.c: /usr/bin/ld: libcrypto_kem_r5nd1kem0d.a(a_fixed.o):/home/supercop/supercop-20240625/supercop-data/rome0/amd64/try/c/gcc_-march=native_-mtune=native_-O2_-fwrapv_-fPIC_-fPIE_-gdwarf-4_-Wall/timingleaks/crypto_kem/r5nd1kem0d/ref/work/r5_parameter_sets.h:66: multiple definition of `r5_parameter_set_names'; libcrypto_kem_r5nd1kem0d.a(cpa_kem.o):/home/supercop/supercop-20240625/supercop-data/rome0/amd64/try/c/gcc_-march=native_-mtune=native_-O2_-fwrapv_-fPIC_-fPIE_-gdwarf-4_-Wall/timingleaks/crypto_kem/r5nd1kem0d/ref/work/r5_parameter_sets.h:66: first defined here
try.c: /usr/bin/ld: libcrypto_kem_r5nd1kem0d.a(a_fixed.o):/home/supercop/supercop-20240625/supercop-data/rome0/amd64/try/c/gcc_-march=native_-mtune=native_-O2_-fwrapv_-fPIC_-fPIE_-gdwarf-4_-Wall/timingleaks/crypto_kem/r5nd1kem0d/ref/work/r5_parameter_sets.h:63: multiple definition of `r5_parameter_sets'; libcrypto_kem_r5nd1kem0d.a(cpa_kem.o):/home/supercop/supercop-20240625/supercop-data/rome0/amd64/try/c/gcc_-march=native_-mtune=native_-O2_-fwrapv_-fPIC_-fPIE_-gdwarf-4_-Wall/timingleaks/crypto_kem/r5nd1kem0d/ref/work/r5_parameter_sets.h:63: first defined here
try.c: /usr/bin/ld: libcrypto_kem_r5nd1kem0d.a(a_random.o):/home/supercop/supercop-20240625/supercop-data/rome0/amd64/try/c/gcc_-march=native_-mtune=native_-O2_-fwrapv_-fPIC_-fPIE_-gdwarf-4_-Wall/timingleaks/crypto_kem/r5nd1kem0d/ref/work/r5_parameter_sets.h:66: multiple definition of `r5_parameter_set_names'; libcrypto_kem_r5nd1kem0d.a(cpa_kem.o):/home/supercop/supercop-20240625/supercop-data/rome0/amd64/try/c/gcc_-march=native_-mtune=native_-O2_-fwrapv_-fPIC_-fPIE_-gdwarf-4_-Wall/timingleaks/crypto_kem/r5nd1kem0d/ref/work/r5_parameter_sets.h:66: first defined here
try.c: /usr/bin/ld: libcrypto_kem_r5nd1kem0d.a(a_random.o):/home/supercop/supercop-20240625/supercop-data/rome0/amd64/try/c/gcc_-march=native_-mtune=native_-O2_-fwrapv_-fPIC_-fPIE_-gdwarf-4_-Wall/timingleaks/crypto_kem/r5nd1kem0d/ref/work/r5_parameter_sets.h:63: multiple definition of `r5_parameter_sets'; libcrypto_kem_r5nd1kem0d.a(cpa_kem.o):/home/supercop/supercop-20240625/supercop-data/rome0/amd64/try/c/gcc_-march=native_-mtune=native_-O2_-fwrapv_-fPIC_-fPIE_-gdwarf-4_-Wall/timingleaks/crypto_kem/r5nd1kem0d/ref/work/r5_parameter_sets.h:63: first defined here
try.c: collect2: error: ld returned 1 exit status

Number of similar (compiler,implementation) pairs: 1, namely:
CompilerImplementations
gcc -march=native -mtune=native -O2 -fwrapv -fPIC -fPIE -gdwarf-4 -Wall T:ref

Compiler output

Implementation: T:ref
Security model: timingleaks
Compiler: gcc -march=native -mtune=native -O3 -fwrapv -fPIC -fPIE -gdwarf-4 -Wall
try.c: /usr/bin/ld: libcrypto_kem_r5nd1kem0d.a(parameters.o):/home/supercop/supercop-20240625/supercop-data/rome0/amd64/try/c/gcc_-march=native_-mtune=native_-O3_-fwrapv_-fPIC_-fPIE_-gdwarf-4_-Wall/timingleaks/crypto_kem/r5nd1kem0d/ref/work/r5_parameter_sets.h:66: multiple definition of `r5_parameter_set_names'; libcrypto_kem_r5nd1kem0d.a(cpa_kem.o):/home/supercop/supercop-20240625/supercop-data/rome0/amd64/try/c/gcc_-march=native_-mtune=native_-O3_-fwrapv_-fPIC_-fPIE_-gdwarf-4_-Wall/timingleaks/crypto_kem/r5nd1kem0d/ref/work/r5_parameter_sets.h:66: first defined here
try.c: /usr/bin/ld: libcrypto_kem_r5nd1kem0d.a(parameters.o):/home/supercop/supercop-20240625/supercop-data/rome0/amd64/try/c/gcc_-march=native_-mtune=native_-O3_-fwrapv_-fPIC_-fPIE_-gdwarf-4_-Wall/timingleaks/crypto_kem/r5nd1kem0d/ref/work/r5_parameter_sets.h:63: multiple definition of `r5_parameter_sets'; libcrypto_kem_r5nd1kem0d.a(cpa_kem.o):/home/supercop/supercop-20240625/supercop-data/rome0/amd64/try/c/gcc_-march=native_-mtune=native_-O3_-fwrapv_-fPIC_-fPIE_-gdwarf-4_-Wall/timingleaks/crypto_kem/r5nd1kem0d/ref/work/r5_parameter_sets.h:63: first defined here
try.c: /usr/bin/ld: libcrypto_kem_r5nd1kem0d.a(r5_cpa_kem.o):/home/supercop/supercop-20240625/supercop-data/rome0/amd64/try/c/gcc_-march=native_-mtune=native_-O3_-fwrapv_-fPIC_-fPIE_-gdwarf-4_-Wall/timingleaks/crypto_kem/r5nd1kem0d/ref/work/r5_parameter_sets.h:66: multiple definition of `r5_parameter_set_names'; libcrypto_kem_r5nd1kem0d.a(cpa_kem.o):/home/supercop/supercop-20240625/supercop-data/rome0/amd64/try/c/gcc_-march=native_-mtune=native_-O3_-fwrapv_-fPIC_-fPIE_-gdwarf-4_-Wall/timingleaks/crypto_kem/r5nd1kem0d/ref/work/r5_parameter_sets.h:66: first defined here
try.c: /usr/bin/ld: libcrypto_kem_r5nd1kem0d.a(r5_cpa_kem.o):/home/supercop/supercop-20240625/supercop-data/rome0/amd64/try/c/gcc_-march=native_-mtune=native_-O3_-fwrapv_-fPIC_-fPIE_-gdwarf-4_-Wall/timingleaks/crypto_kem/r5nd1kem0d/ref/work/r5_parameter_sets.h:63: multiple definition of `r5_parameter_sets'; libcrypto_kem_r5nd1kem0d.a(cpa_kem.o):/home/supercop/supercop-20240625/supercop-data/rome0/amd64/try/c/gcc_-march=native_-mtune=native_-O3_-fwrapv_-fPIC_-fPIE_-gdwarf-4_-Wall/timingleaks/crypto_kem/r5nd1kem0d/ref/work/r5_parameter_sets.h:63: first defined here
try.c: /usr/bin/ld: libcrypto_kem_r5nd1kem0d.a(r5_cpa_pke.o):/home/supercop/supercop-20240625/supercop-data/rome0/amd64/try/c/gcc_-march=native_-mtune=native_-O3_-fwrapv_-fPIC_-fPIE_-gdwarf-4_-Wall/timingleaks/crypto_kem/r5nd1kem0d/ref/work/r5_parameter_sets.h:66: multiple definition of `r5_parameter_set_names'; libcrypto_kem_r5nd1kem0d.a(cpa_kem.o):/home/supercop/supercop-20240625/supercop-data/rome0/amd64/try/c/gcc_-march=native_-mtune=native_-O3_-fwrapv_-fPIC_-fPIE_-gdwarf-4_-Wall/timingleaks/crypto_kem/r5nd1kem0d/ref/work/r5_parameter_sets.h:66: first defined here
try.c: /usr/bin/ld: libcrypto_kem_r5nd1kem0d.a(r5_cpa_pke.o):/home/supercop/supercop-20240625/supercop-data/rome0/amd64/try/c/gcc_-march=native_-mtune=native_-O3_-fwrapv_-fPIC_-fPIE_-gdwarf-4_-Wall/timingleaks/crypto_kem/r5nd1kem0d/ref/work/r5_parameter_sets.h:63: multiple definition of `r5_parameter_sets'; libcrypto_kem_r5nd1kem0d.a(cpa_kem.o):/home/supercop/supercop-20240625/supercop-data/rome0/amd64/try/c/gcc_-march=native_-mtune=native_-O3_-fwrapv_-fPIC_-fPIE_-gdwarf-4_-Wall/timingleaks/crypto_kem/r5nd1kem0d/ref/work/r5_parameter_sets.h:63: first defined here
try.c: /usr/bin/ld: libcrypto_kem_r5nd1kem0d.a(r5_core.o):/home/supercop/supercop-20240625/supercop-data/rome0/amd64/try/c/gcc_-march=native_-mtune=native_-O3_-fwrapv_-fPIC_-fPIE_-gdwarf-4_-Wall/timingleaks/crypto_kem/r5nd1kem0d/ref/work/r5_parameter_sets.h:66: multiple definition of `r5_parameter_set_names'; libcrypto_kem_r5nd1kem0d.a(cpa_kem.o):/home/supercop/supercop-20240625/supercop-data/rome0/amd64/try/c/gcc_-march=native_-mtune=native_-O3_-fwrapv_-fPIC_-fPIE_-gdwarf-4_-Wall/timingleaks/crypto_kem/r5nd1kem0d/ref/work/r5_parameter_sets.h:66: first defined here
try.c: /usr/bin/ld: libcrypto_kem_r5nd1kem0d.a(r5_core.o):/home/supercop/supercop-20240625/supercop-data/rome0/amd64/try/c/gcc_-march=native_-mtune=native_-O3_-fwrapv_-fPIC_-fPIE_-gdwarf-4_-Wall/timingleaks/crypto_kem/r5nd1kem0d/ref/work/r5_parameter_sets.h:63: multiple definition of `r5_parameter_sets'; libcrypto_kem_r5nd1kem0d.a(cpa_kem.o):/home/supercop/supercop-20240625/supercop-data/rome0/amd64/try/c/gcc_-march=native_-mtune=native_-O3_-fwrapv_-fPIC_-fPIE_-gdwarf-4_-Wall/timingleaks/crypto_kem/r5nd1kem0d/ref/work/r5_parameter_sets.h:63: first defined here
try.c: /usr/bin/ld: libcrypto_kem_r5nd1kem0d.a(a_fixed.o):/home/supercop/supercop-20240625/supercop-data/rome0/amd64/try/c/gcc_-march=native_-mtune=native_-O3_-fwrapv_-fPIC_-fPIE_-gdwarf-4_-Wall/timingleaks/crypto_kem/r5nd1kem0d/ref/work/r5_parameter_sets.h:66: multiple definition of `r5_parameter_set_names'; libcrypto_kem_r5nd1kem0d.a(cpa_kem.o):/home/supercop/supercop-20240625/supercop-data/rome0/amd64/try/c/gcc_-march=native_-mtune=native_-O3_-fwrapv_-fPIC_-fPIE_-gdwarf-4_-Wall/timingleaks/crypto_kem/r5nd1kem0d/ref/work/r5_parameter_sets.h:66: first defined here
try.c: /usr/bin/ld: libcrypto_kem_r5nd1kem0d.a(a_fixed.o):/home/supercop/supercop-20240625/supercop-data/rome0/amd64/try/c/gcc_-march=native_-mtune=native_-O3_-fwrapv_-fPIC_-fPIE_-gdwarf-4_-Wall/timingleaks/crypto_kem/r5nd1kem0d/ref/work/r5_parameter_sets.h:63: multiple definition of `r5_parameter_sets'; libcrypto_kem_r5nd1kem0d.a(cpa_kem.o):/home/supercop/supercop-20240625/supercop-data/rome0/amd64/try/c/gcc_-march=native_-mtune=native_-O3_-fwrapv_-fPIC_-fPIE_-gdwarf-4_-Wall/timingleaks/crypto_kem/r5nd1kem0d/ref/work/r5_parameter_sets.h:63: first defined here
try.c: /usr/bin/ld: libcrypto_kem_r5nd1kem0d.a(a_random.o):/home/supercop/supercop-20240625/supercop-data/rome0/amd64/try/c/gcc_-march=native_-mtune=native_-O3_-fwrapv_-fPIC_-fPIE_-gdwarf-4_-Wall/timingleaks/crypto_kem/r5nd1kem0d/ref/work/r5_parameter_sets.h:66: multiple definition of `r5_parameter_set_names'; libcrypto_kem_r5nd1kem0d.a(cpa_kem.o):/home/supercop/supercop-20240625/supercop-data/rome0/amd64/try/c/gcc_-march=native_-mtune=native_-O3_-fwrapv_-fPIC_-fPIE_-gdwarf-4_-Wall/timingleaks/crypto_kem/r5nd1kem0d/ref/work/r5_parameter_sets.h:66: first defined here
try.c: /usr/bin/ld: libcrypto_kem_r5nd1kem0d.a(a_random.o):/home/supercop/supercop-20240625/supercop-data/rome0/amd64/try/c/gcc_-march=native_-mtune=native_-O3_-fwrapv_-fPIC_-fPIE_-gdwarf-4_-Wall/timingleaks/crypto_kem/r5nd1kem0d/ref/work/r5_parameter_sets.h:63: multiple definition of `r5_parameter_sets'; libcrypto_kem_r5nd1kem0d.a(cpa_kem.o):/home/supercop/supercop-20240625/supercop-data/rome0/amd64/try/c/gcc_-march=native_-mtune=native_-O3_-fwrapv_-fPIC_-fPIE_-gdwarf-4_-Wall/timingleaks/crypto_kem/r5nd1kem0d/ref/work/r5_parameter_sets.h:63: first defined here
try.c: collect2: error: ld returned 1 exit status

Number of similar (compiler,implementation) pairs: 1, namely:
CompilerImplementations
gcc -march=native -mtune=native -O3 -fwrapv -fPIC -fPIE -gdwarf-4 -Wall T:ref

Compiler output

Implementation: T:ref
Security model: timingleaks
Compiler: gcc -march=native -mtune=native -O -fwrapv -fPIC -fPIE -gdwarf-4 -Wall
try.c: /usr/bin/ld: libcrypto_kem_r5nd1kem0d.a(parameters.o):/home/supercop/supercop-20240625/supercop-data/rome0/amd64/try/c/gcc_-march=native_-mtune=native_-O_-fwrapv_-fPIC_-fPIE_-gdwarf-4_-Wall/timingleaks/crypto_kem/r5nd1kem0d/ref/work/r5_parameter_sets.h:66: multiple definition of `r5_parameter_set_names'; libcrypto_kem_r5nd1kem0d.a(cpa_kem.o):/home/supercop/supercop-20240625/supercop-data/rome0/amd64/try/c/gcc_-march=native_-mtune=native_-O_-fwrapv_-fPIC_-fPIE_-gdwarf-4_-Wall/timingleaks/crypto_kem/r5nd1kem0d/ref/work/r5_parameter_sets.h:66: first defined here
try.c: /usr/bin/ld: libcrypto_kem_r5nd1kem0d.a(parameters.o):/home/supercop/supercop-20240625/supercop-data/rome0/amd64/try/c/gcc_-march=native_-mtune=native_-O_-fwrapv_-fPIC_-fPIE_-gdwarf-4_-Wall/timingleaks/crypto_kem/r5nd1kem0d/ref/work/r5_parameter_sets.h:63: multiple definition of `r5_parameter_sets'; libcrypto_kem_r5nd1kem0d.a(cpa_kem.o):/home/supercop/supercop-20240625/supercop-data/rome0/amd64/try/c/gcc_-march=native_-mtune=native_-O_-fwrapv_-fPIC_-fPIE_-gdwarf-4_-Wall/timingleaks/crypto_kem/r5nd1kem0d/ref/work/r5_parameter_sets.h:63: first defined here
try.c: /usr/bin/ld: libcrypto_kem_r5nd1kem0d.a(r5_cpa_kem.o):/home/supercop/supercop-20240625/supercop-data/rome0/amd64/try/c/gcc_-march=native_-mtune=native_-O_-fwrapv_-fPIC_-fPIE_-gdwarf-4_-Wall/timingleaks/crypto_kem/r5nd1kem0d/ref/work/r5_parameter_sets.h:66: multiple definition of `r5_parameter_set_names'; libcrypto_kem_r5nd1kem0d.a(cpa_kem.o):/home/supercop/supercop-20240625/supercop-data/rome0/amd64/try/c/gcc_-march=native_-mtune=native_-O_-fwrapv_-fPIC_-fPIE_-gdwarf-4_-Wall/timingleaks/crypto_kem/r5nd1kem0d/ref/work/r5_parameter_sets.h:66: first defined here
try.c: /usr/bin/ld: libcrypto_kem_r5nd1kem0d.a(r5_cpa_kem.o):/home/supercop/supercop-20240625/supercop-data/rome0/amd64/try/c/gcc_-march=native_-mtune=native_-O_-fwrapv_-fPIC_-fPIE_-gdwarf-4_-Wall/timingleaks/crypto_kem/r5nd1kem0d/ref/work/r5_parameter_sets.h:63: multiple definition of `r5_parameter_sets'; libcrypto_kem_r5nd1kem0d.a(cpa_kem.o):/home/supercop/supercop-20240625/supercop-data/rome0/amd64/try/c/gcc_-march=native_-mtune=native_-O_-fwrapv_-fPIC_-fPIE_-gdwarf-4_-Wall/timingleaks/crypto_kem/r5nd1kem0d/ref/work/r5_parameter_sets.h:63: first defined here
try.c: /usr/bin/ld: libcrypto_kem_r5nd1kem0d.a(r5_cpa_pke.o):/home/supercop/supercop-20240625/supercop-data/rome0/amd64/try/c/gcc_-march=native_-mtune=native_-O_-fwrapv_-fPIC_-fPIE_-gdwarf-4_-Wall/timingleaks/crypto_kem/r5nd1kem0d/ref/work/r5_parameter_sets.h:66: multiple definition of `r5_parameter_set_names'; libcrypto_kem_r5nd1kem0d.a(cpa_kem.o):/home/supercop/supercop-20240625/supercop-data/rome0/amd64/try/c/gcc_-march=native_-mtune=native_-O_-fwrapv_-fPIC_-fPIE_-gdwarf-4_-Wall/timingleaks/crypto_kem/r5nd1kem0d/ref/work/r5_parameter_sets.h:66: first defined here
try.c: /usr/bin/ld: libcrypto_kem_r5nd1kem0d.a(r5_cpa_pke.o):/home/supercop/supercop-20240625/supercop-data/rome0/amd64/try/c/gcc_-march=native_-mtune=native_-O_-fwrapv_-fPIC_-fPIE_-gdwarf-4_-Wall/timingleaks/crypto_kem/r5nd1kem0d/ref/work/r5_parameter_sets.h:63: multiple definition of `r5_parameter_sets'; libcrypto_kem_r5nd1kem0d.a(cpa_kem.o):/home/supercop/supercop-20240625/supercop-data/rome0/amd64/try/c/gcc_-march=native_-mtune=native_-O_-fwrapv_-fPIC_-fPIE_-gdwarf-4_-Wall/timingleaks/crypto_kem/r5nd1kem0d/ref/work/r5_parameter_sets.h:63: first defined here
try.c: /usr/bin/ld: libcrypto_kem_r5nd1kem0d.a(r5_core.o):/home/supercop/supercop-20240625/supercop-data/rome0/amd64/try/c/gcc_-march=native_-mtune=native_-O_-fwrapv_-fPIC_-fPIE_-gdwarf-4_-Wall/timingleaks/crypto_kem/r5nd1kem0d/ref/work/r5_parameter_sets.h:66: multiple definition of `r5_parameter_set_names'; libcrypto_kem_r5nd1kem0d.a(cpa_kem.o):/home/supercop/supercop-20240625/supercop-data/rome0/amd64/try/c/gcc_-march=native_-mtune=native_-O_-fwrapv_-fPIC_-fPIE_-gdwarf-4_-Wall/timingleaks/crypto_kem/r5nd1kem0d/ref/work/r5_parameter_sets.h:66: first defined here
try.c: /usr/bin/ld: libcrypto_kem_r5nd1kem0d.a(r5_core.o):/home/supercop/supercop-20240625/supercop-data/rome0/amd64/try/c/gcc_-march=native_-mtune=native_-O_-fwrapv_-fPIC_-fPIE_-gdwarf-4_-Wall/timingleaks/crypto_kem/r5nd1kem0d/ref/work/r5_parameter_sets.h:63: multiple definition of `r5_parameter_sets'; libcrypto_kem_r5nd1kem0d.a(cpa_kem.o):/home/supercop/supercop-20240625/supercop-data/rome0/amd64/try/c/gcc_-march=native_-mtune=native_-O_-fwrapv_-fPIC_-fPIE_-gdwarf-4_-Wall/timingleaks/crypto_kem/r5nd1kem0d/ref/work/r5_parameter_sets.h:63: first defined here
try.c: /usr/bin/ld: libcrypto_kem_r5nd1kem0d.a(a_fixed.o):/home/supercop/supercop-20240625/supercop-data/rome0/amd64/try/c/gcc_-march=native_-mtune=native_-O_-fwrapv_-fPIC_-fPIE_-gdwarf-4_-Wall/timingleaks/crypto_kem/r5nd1kem0d/ref/work/r5_parameter_sets.h:66: multiple definition of `r5_parameter_set_names'; libcrypto_kem_r5nd1kem0d.a(cpa_kem.o):/home/supercop/supercop-20240625/supercop-data/rome0/amd64/try/c/gcc_-march=native_-mtune=native_-O_-fwrapv_-fPIC_-fPIE_-gdwarf-4_-Wall/timingleaks/crypto_kem/r5nd1kem0d/ref/work/r5_parameter_sets.h:66: first defined here
try.c: /usr/bin/ld: libcrypto_kem_r5nd1kem0d.a(a_fixed.o):/home/supercop/supercop-20240625/supercop-data/rome0/amd64/try/c/gcc_-march=native_-mtune=native_-O_-fwrapv_-fPIC_-fPIE_-gdwarf-4_-Wall/timingleaks/crypto_kem/r5nd1kem0d/ref/work/r5_parameter_sets.h:63: multiple definition of `r5_parameter_sets'; libcrypto_kem_r5nd1kem0d.a(cpa_kem.o):/home/supercop/supercop-20240625/supercop-data/rome0/amd64/try/c/gcc_-march=native_-mtune=native_-O_-fwrapv_-fPIC_-fPIE_-gdwarf-4_-Wall/timingleaks/crypto_kem/r5nd1kem0d/ref/work/r5_parameter_sets.h:63: first defined here
try.c: /usr/bin/ld: libcrypto_kem_r5nd1kem0d.a(a_random.o):/home/supercop/supercop-20240625/supercop-data/rome0/amd64/try/c/gcc_-march=native_-mtune=native_-O_-fwrapv_-fPIC_-fPIE_-gdwarf-4_-Wall/timingleaks/crypto_kem/r5nd1kem0d/ref/work/r5_parameter_sets.h:66: multiple definition of `r5_parameter_set_names'; libcrypto_kem_r5nd1kem0d.a(cpa_kem.o):/home/supercop/supercop-20240625/supercop-data/rome0/amd64/try/c/gcc_-march=native_-mtune=native_-O_-fwrapv_-fPIC_-fPIE_-gdwarf-4_-Wall/timingleaks/crypto_kem/r5nd1kem0d/ref/work/r5_parameter_sets.h:66: first defined here
try.c: /usr/bin/ld: libcrypto_kem_r5nd1kem0d.a(a_random.o):/home/supercop/supercop-20240625/supercop-data/rome0/amd64/try/c/gcc_-march=native_-mtune=native_-O_-fwrapv_-fPIC_-fPIE_-gdwarf-4_-Wall/timingleaks/crypto_kem/r5nd1kem0d/ref/work/r5_parameter_sets.h:63: multiple definition of `r5_parameter_sets'; libcrypto_kem_r5nd1kem0d.a(cpa_kem.o):/home/supercop/supercop-20240625/supercop-data/rome0/amd64/try/c/gcc_-march=native_-mtune=native_-O_-fwrapv_-fPIC_-fPIE_-gdwarf-4_-Wall/timingleaks/crypto_kem/r5nd1kem0d/ref/work/r5_parameter_sets.h:63: first defined here
try.c: collect2: error: ld returned 1 exit status

Number of similar (compiler,implementation) pairs: 1, namely:
CompilerImplementations
gcc -march=native -mtune=native -O -fwrapv -fPIC -fPIE -gdwarf-4 -Wall T:ref

Compiler output

Implementation: T:ref
Security model: timingleaks
Compiler: gcc -march=native -mtune=native -Os -fwrapv -fPIC -fPIE -gdwarf-4 -Wall
try.c: /usr/bin/ld: libcrypto_kem_r5nd1kem0d.a(parameters.o):/home/supercop/supercop-20240625/supercop-data/rome0/amd64/try/c/gcc_-march=native_-mtune=native_-Os_-fwrapv_-fPIC_-fPIE_-gdwarf-4_-Wall/timingleaks/crypto_kem/r5nd1kem0d/ref/work/r5_parameter_sets.h:66: multiple definition of `r5_parameter_set_names'; libcrypto_kem_r5nd1kem0d.a(cpa_kem.o):/home/supercop/supercop-20240625/supercop-data/rome0/amd64/try/c/gcc_-march=native_-mtune=native_-Os_-fwrapv_-fPIC_-fPIE_-gdwarf-4_-Wall/timingleaks/crypto_kem/r5nd1kem0d/ref/work/r5_parameter_sets.h:66: first defined here
try.c: /usr/bin/ld: libcrypto_kem_r5nd1kem0d.a(parameters.o):/home/supercop/supercop-20240625/supercop-data/rome0/amd64/try/c/gcc_-march=native_-mtune=native_-Os_-fwrapv_-fPIC_-fPIE_-gdwarf-4_-Wall/timingleaks/crypto_kem/r5nd1kem0d/ref/work/r5_parameter_sets.h:63: multiple definition of `r5_parameter_sets'; libcrypto_kem_r5nd1kem0d.a(cpa_kem.o):/home/supercop/supercop-20240625/supercop-data/rome0/amd64/try/c/gcc_-march=native_-mtune=native_-Os_-fwrapv_-fPIC_-fPIE_-gdwarf-4_-Wall/timingleaks/crypto_kem/r5nd1kem0d/ref/work/r5_parameter_sets.h:63: first defined here
try.c: /usr/bin/ld: libcrypto_kem_r5nd1kem0d.a(r5_cpa_kem.o):/home/supercop/supercop-20240625/supercop-data/rome0/amd64/try/c/gcc_-march=native_-mtune=native_-Os_-fwrapv_-fPIC_-fPIE_-gdwarf-4_-Wall/timingleaks/crypto_kem/r5nd1kem0d/ref/work/r5_parameter_sets.h:66: multiple definition of `r5_parameter_set_names'; libcrypto_kem_r5nd1kem0d.a(cpa_kem.o):/home/supercop/supercop-20240625/supercop-data/rome0/amd64/try/c/gcc_-march=native_-mtune=native_-Os_-fwrapv_-fPIC_-fPIE_-gdwarf-4_-Wall/timingleaks/crypto_kem/r5nd1kem0d/ref/work/r5_parameter_sets.h:66: first defined here
try.c: /usr/bin/ld: libcrypto_kem_r5nd1kem0d.a(r5_cpa_kem.o):/home/supercop/supercop-20240625/supercop-data/rome0/amd64/try/c/gcc_-march=native_-mtune=native_-Os_-fwrapv_-fPIC_-fPIE_-gdwarf-4_-Wall/timingleaks/crypto_kem/r5nd1kem0d/ref/work/r5_parameter_sets.h:63: multiple definition of `r5_parameter_sets'; libcrypto_kem_r5nd1kem0d.a(cpa_kem.o):/home/supercop/supercop-20240625/supercop-data/rome0/amd64/try/c/gcc_-march=native_-mtune=native_-Os_-fwrapv_-fPIC_-fPIE_-gdwarf-4_-Wall/timingleaks/crypto_kem/r5nd1kem0d/ref/work/r5_parameter_sets.h:63: first defined here
try.c: /usr/bin/ld: libcrypto_kem_r5nd1kem0d.a(r5_cpa_pke.o):/home/supercop/supercop-20240625/supercop-data/rome0/amd64/try/c/gcc_-march=native_-mtune=native_-Os_-fwrapv_-fPIC_-fPIE_-gdwarf-4_-Wall/timingleaks/crypto_kem/r5nd1kem0d/ref/work/r5_parameter_sets.h:66: multiple definition of `r5_parameter_set_names'; libcrypto_kem_r5nd1kem0d.a(cpa_kem.o):/home/supercop/supercop-20240625/supercop-data/rome0/amd64/try/c/gcc_-march=native_-mtune=native_-Os_-fwrapv_-fPIC_-fPIE_-gdwarf-4_-Wall/timingleaks/crypto_kem/r5nd1kem0d/ref/work/r5_parameter_sets.h:66: first defined here
try.c: /usr/bin/ld: libcrypto_kem_r5nd1kem0d.a(r5_cpa_pke.o):/home/supercop/supercop-20240625/supercop-data/rome0/amd64/try/c/gcc_-march=native_-mtune=native_-Os_-fwrapv_-fPIC_-fPIE_-gdwarf-4_-Wall/timingleaks/crypto_kem/r5nd1kem0d/ref/work/r5_parameter_sets.h:63: multiple definition of `r5_parameter_sets'; libcrypto_kem_r5nd1kem0d.a(cpa_kem.o):/home/supercop/supercop-20240625/supercop-data/rome0/amd64/try/c/gcc_-march=native_-mtune=native_-Os_-fwrapv_-fPIC_-fPIE_-gdwarf-4_-Wall/timingleaks/crypto_kem/r5nd1kem0d/ref/work/r5_parameter_sets.h:63: first defined here
try.c: /usr/bin/ld: libcrypto_kem_r5nd1kem0d.a(r5_core.o):/home/supercop/supercop-20240625/supercop-data/rome0/amd64/try/c/gcc_-march=native_-mtune=native_-Os_-fwrapv_-fPIC_-fPIE_-gdwarf-4_-Wall/timingleaks/crypto_kem/r5nd1kem0d/ref/work/r5_parameter_sets.h:66: multiple definition of `r5_parameter_set_names'; libcrypto_kem_r5nd1kem0d.a(cpa_kem.o):/home/supercop/supercop-20240625/supercop-data/rome0/amd64/try/c/gcc_-march=native_-mtune=native_-Os_-fwrapv_-fPIC_-fPIE_-gdwarf-4_-Wall/timingleaks/crypto_kem/r5nd1kem0d/ref/work/r5_parameter_sets.h:66: first defined here
try.c: /usr/bin/ld: libcrypto_kem_r5nd1kem0d.a(r5_core.o):/home/supercop/supercop-20240625/supercop-data/rome0/amd64/try/c/gcc_-march=native_-mtune=native_-Os_-fwrapv_-fPIC_-fPIE_-gdwarf-4_-Wall/timingleaks/crypto_kem/r5nd1kem0d/ref/work/r5_parameter_sets.h:63: multiple definition of `r5_parameter_sets'; libcrypto_kem_r5nd1kem0d.a(cpa_kem.o):/home/supercop/supercop-20240625/supercop-data/rome0/amd64/try/c/gcc_-march=native_-mtune=native_-Os_-fwrapv_-fPIC_-fPIE_-gdwarf-4_-Wall/timingleaks/crypto_kem/r5nd1kem0d/ref/work/r5_parameter_sets.h:63: first defined here
try.c: /usr/bin/ld: libcrypto_kem_r5nd1kem0d.a(a_fixed.o):/home/supercop/supercop-20240625/supercop-data/rome0/amd64/try/c/gcc_-march=native_-mtune=native_-Os_-fwrapv_-fPIC_-fPIE_-gdwarf-4_-Wall/timingleaks/crypto_kem/r5nd1kem0d/ref/work/r5_parameter_sets.h:66: multiple definition of `r5_parameter_set_names'; libcrypto_kem_r5nd1kem0d.a(cpa_kem.o):/home/supercop/supercop-20240625/supercop-data/rome0/amd64/try/c/gcc_-march=native_-mtune=native_-Os_-fwrapv_-fPIC_-fPIE_-gdwarf-4_-Wall/timingleaks/crypto_kem/r5nd1kem0d/ref/work/r5_parameter_sets.h:66: first defined here
try.c: /usr/bin/ld: libcrypto_kem_r5nd1kem0d.a(a_fixed.o):/home/supercop/supercop-20240625/supercop-data/rome0/amd64/try/c/gcc_-march=native_-mtune=native_-Os_-fwrapv_-fPIC_-fPIE_-gdwarf-4_-Wall/timingleaks/crypto_kem/r5nd1kem0d/ref/work/r5_parameter_sets.h:63: multiple definition of `r5_parameter_sets'; libcrypto_kem_r5nd1kem0d.a(cpa_kem.o):/home/supercop/supercop-20240625/supercop-data/rome0/amd64/try/c/gcc_-march=native_-mtune=native_-Os_-fwrapv_-fPIC_-fPIE_-gdwarf-4_-Wall/timingleaks/crypto_kem/r5nd1kem0d/ref/work/r5_parameter_sets.h:63: first defined here
try.c: /usr/bin/ld: libcrypto_kem_r5nd1kem0d.a(a_random.o):/home/supercop/supercop-20240625/supercop-data/rome0/amd64/try/c/gcc_-march=native_-mtune=native_-Os_-fwrapv_-fPIC_-fPIE_-gdwarf-4_-Wall/timingleaks/crypto_kem/r5nd1kem0d/ref/work/r5_parameter_sets.h:66: multiple definition of `r5_parameter_set_names'; libcrypto_kem_r5nd1kem0d.a(cpa_kem.o):/home/supercop/supercop-20240625/supercop-data/rome0/amd64/try/c/gcc_-march=native_-mtune=native_-Os_-fwrapv_-fPIC_-fPIE_-gdwarf-4_-Wall/timingleaks/crypto_kem/r5nd1kem0d/ref/work/r5_parameter_sets.h:66: first defined here
try.c: /usr/bin/ld: libcrypto_kem_r5nd1kem0d.a(a_random.o):/home/supercop/supercop-20240625/supercop-data/rome0/amd64/try/c/gcc_-march=native_-mtune=native_-Os_-fwrapv_-fPIC_-fPIE_-gdwarf-4_-Wall/timingleaks/crypto_kem/r5nd1kem0d/ref/work/r5_parameter_sets.h:63: multiple definition of `r5_parameter_sets'; libcrypto_kem_r5nd1kem0d.a(cpa_kem.o):/home/supercop/supercop-20240625/supercop-data/rome0/amd64/try/c/gcc_-march=native_-mtune=native_-Os_-fwrapv_-fPIC_-fPIE_-gdwarf-4_-Wall/timingleaks/crypto_kem/r5nd1kem0d/ref/work/r5_parameter_sets.h:63: first defined here
try.c: collect2: error: ld returned 1 exit status

Number of similar (compiler,implementation) pairs: 1, namely:
CompilerImplementations
gcc -march=native -mtune=native -Os -fwrapv -fPIC -fPIE -gdwarf-4 -Wall T:ref