Implementation notes: amd64, rome0, crypto_aead/morus640128v2

Computer: rome0
Microarchitecture: amd64; Zen 2 (830f10)
Architecture: amd64
CPU ID: AuthenticAMD-00830f10-178bfbff
SUPERCOP version: 20240625
Operation: crypto_aead
Primitive: morus640128v2
TimeObject sizeTest sizeImplementationCompilerBenchmark dateSUPERCOP version
70236562 0 022888 812 1016T:sse2clang_-mcpu=native_-O3_-fwrapv_-Qunused-arguments_-fPIC_-fPIE_-gdwarf-4_-Wall2024062520240625
71825637 0 021552 812 1048T:sse2clang_-march=native_-O2_-fwrapv_-Qunused-arguments_-fPIC_-fPIE_-gdwarf-4_-Wall2024062520240625
72445637 0 021680 812 1048T:sse2clang_-march=native_-O3_-fwrapv_-Qunused-arguments_-fPIC_-fPIE_-gdwarf-4_-Wall2024062520240625
107272901 0 016454 804 1016T:sse2clang_-march=native_-Os_-fwrapv_-Qunused-arguments_-fPIC_-fPIE_-gdwarf-4_-Wall2024062520240625
114855567 0 021800 780 1080T:sse2gcc_-march=native_-mtune=native_-O3_-fwrapv_-fPIC_-fPIE_-gdwarf-4_-Wall2024062520240625
115082157 0 016384 780 1080T:sse2gcc_-march=native_-mtune=native_-O_-fwrapv_-fPIC_-fPIE_-gdwarf-4_-Wall2024062520240625
119112343 0 016896 780 1080T:sse2gcc_-march=native_-mtune=native_-O2_-fwrapv_-fPIC_-fPIE_-gdwarf-4_-Wall2024062520240625
121001656 0 014635 756 1048T:sse2gcc_-march=native_-mtune=native_-Os_-fwrapv_-fPIC_-fPIE_-gdwarf-4_-Wall2024062520240625
122332224 0 016134 804 1016T:sse2clang_-march=native_-O_-fwrapv_-Qunused-arguments_-fPIC_-fPIE_-gdwarf-4_-Wall2024062520240625
2293212233 0 028488 780 1080T:refgcc_-march=native_-mtune=native_-O3_-fwrapv_-fPIC_-fPIE_-gdwarf-4_-Wall2024062520240625

Compiler output


encrypt.c: encrypt.c:242:16: warning: unused variable 'check' [-Wunused-variable]
encrypt.c:         unsigned char check = 0;
encrypt.c:                       ^
encrypt.c: 1 warning generated.
try.c: /usr/bin/ld: libcrypto_aead_morus640128v2.a(encrypt.o): in function `morus_initialization':
try.c: .../supercop-data/rome0/amd64/try/c/clang_-march=native_-O2_-fwrapv_-Qunused-arguments_-fPIC_-fPIE_-gdwarf-4_-Wall/timingleaks/crypto_aead/morus640128v2/ref/work/encrypt.c:67: undefined reference to `morus_stateupdate'
try.c: /usr/bin/ld: .../supercop-data/rome0/amd64/try/c/clang_-march=native_-O2_-fwrapv_-Qunused-arguments_-fPIC_-fPIE_-gdwarf-4_-Wall/timingleaks/crypto_aead/morus640128v2/ref/work/encrypt.c:67: undefined reference to `morus_stateupdate'
try.c: /usr/bin/ld: .../supercop-data/rome0/amd64/try/c/clang_-march=native_-O2_-fwrapv_-Qunused-arguments_-fPIC_-fPIE_-gdwarf-4_-Wall/timingleaks/crypto_aead/morus640128v2/ref/work/encrypt.c:67: undefined reference to `morus_stateupdate'
try.c: /usr/bin/ld: .../supercop-data/rome0/amd64/try/c/clang_-march=native_-O2_-fwrapv_-Qunused-arguments_-fPIC_-fPIE_-gdwarf-4_-Wall/timingleaks/crypto_aead/morus640128v2/ref/work/encrypt.c:67: undefined reference to `morus_stateupdate'
try.c: /usr/bin/ld: .../supercop-data/rome0/amd64/try/c/clang_-march=native_-O2_-fwrapv_-Qunused-arguments_-fPIC_-fPIE_-gdwarf-4_-Wall/timingleaks/crypto_aead/morus640128v2/ref/work/encrypt.c:67: undefined reference to `morus_stateupdate'
try.c: /usr/bin/ld: libcrypto_aead_morus640128v2.a(encrypt.o):.../supercop-data/rome0/amd64/try/c/clang_-march=native_-O2_-fwrapv_-Qunused-arguments_-fPIC_-fPIE_-gdwarf-4_-Wall/timingleaks/crypto_aead/morus640128v2/ref/work/encrypt.c:67: more undefined references to `morus_stateupdate' follow
try.c: clang: error: linker command failed with exit code 1 (use -v to see invocation)

Number of similar (implementation,compiler) pairs: 1, namely:
ImplementationCompiler
T:refclang -march=native -O2 -fwrapv -Qunused-arguments -fPIC -fPIE -gdwarf-4 -Wall (Debian_Clang_11.0.1)

Compiler output


encrypt.c: encrypt.c:242:16: warning: unused variable 'check' [-Wunused-variable]
encrypt.c:         unsigned char check = 0;
encrypt.c:                       ^
encrypt.c: 1 warning generated.
try.c: /usr/bin/ld: libcrypto_aead_morus640128v2.a(encrypt.o): in function `morus_initialization':
try.c: .../supercop-data/rome0/amd64/try/c/clang_-march=native_-O3_-fwrapv_-Qunused-arguments_-fPIC_-fPIE_-gdwarf-4_-Wall/timingleaks/crypto_aead/morus640128v2/ref/work/encrypt.c:67: undefined reference to `morus_stateupdate'
try.c: /usr/bin/ld: .../supercop-data/rome0/amd64/try/c/clang_-march=native_-O3_-fwrapv_-Qunused-arguments_-fPIC_-fPIE_-gdwarf-4_-Wall/timingleaks/crypto_aead/morus640128v2/ref/work/encrypt.c:67: undefined reference to `morus_stateupdate'
try.c: /usr/bin/ld: .../supercop-data/rome0/amd64/try/c/clang_-march=native_-O3_-fwrapv_-Qunused-arguments_-fPIC_-fPIE_-gdwarf-4_-Wall/timingleaks/crypto_aead/morus640128v2/ref/work/encrypt.c:67: undefined reference to `morus_stateupdate'
try.c: /usr/bin/ld: .../supercop-data/rome0/amd64/try/c/clang_-march=native_-O3_-fwrapv_-Qunused-arguments_-fPIC_-fPIE_-gdwarf-4_-Wall/timingleaks/crypto_aead/morus640128v2/ref/work/encrypt.c:67: undefined reference to `morus_stateupdate'
try.c: /usr/bin/ld: .../supercop-data/rome0/amd64/try/c/clang_-march=native_-O3_-fwrapv_-Qunused-arguments_-fPIC_-fPIE_-gdwarf-4_-Wall/timingleaks/crypto_aead/morus640128v2/ref/work/encrypt.c:67: undefined reference to `morus_stateupdate'
try.c: /usr/bin/ld: libcrypto_aead_morus640128v2.a(encrypt.o):.../supercop-data/rome0/amd64/try/c/clang_-march=native_-O3_-fwrapv_-Qunused-arguments_-fPIC_-fPIE_-gdwarf-4_-Wall/timingleaks/crypto_aead/morus640128v2/ref/work/encrypt.c:67: more undefined references to `morus_stateupdate' follow
try.c: clang: error: linker command failed with exit code 1 (use -v to see invocation)

Number of similar (implementation,compiler) pairs: 1, namely:
ImplementationCompiler
T:refclang -march=native -O3 -fwrapv -Qunused-arguments -fPIC -fPIE -gdwarf-4 -Wall (Debian_Clang_11.0.1)

Compiler output


encrypt.c: encrypt.c:242:16: warning: unused variable 'check' [-Wunused-variable]
encrypt.c:         unsigned char check = 0;
encrypt.c:                       ^
encrypt.c: 1 warning generated.
try.c: /usr/bin/ld: libcrypto_aead_morus640128v2.a(encrypt.o): in function `morus_initialization':
try.c: .../supercop-data/rome0/amd64/try/c/clang_-march=native_-O_-fwrapv_-Qunused-arguments_-fPIC_-fPIE_-gdwarf-4_-Wall/timingleaks/crypto_aead/morus640128v2/ref/work/encrypt.c:67: undefined reference to `morus_stateupdate'
try.c: /usr/bin/ld: libcrypto_aead_morus640128v2.a(encrypt.o): in function `morus_tag_generation':
try.c: .../supercop-data/rome0/amd64/try/c/clang_-march=native_-O_-fwrapv_-Qunused-arguments_-fPIC_-fPIE_-gdwarf-4_-Wall/timingleaks/crypto_aead/morus640128v2/ref/work/encrypt.c:82: undefined reference to `morus_stateupdate'
try.c: /usr/bin/ld: libcrypto_aead_morus640128v2.a(encrypt.o): in function `morus_tag_verification':
try.c: .../supercop-data/rome0/amd64/try/c/clang_-march=native_-O_-fwrapv_-Qunused-arguments_-fPIC_-fPIE_-gdwarf-4_-Wall/timingleaks/crypto_aead/morus640128v2/ref/work/encrypt.c:102: undefined reference to `morus_stateupdate'
try.c: /usr/bin/ld: libcrypto_aead_morus640128v2.a(encrypt.o): in function `morus_enc_aut_partialblock':
try.c: .../supercop-data/rome0/amd64/try/c/clang_-march=native_-O_-fwrapv_-Qunused-arguments_-fPIC_-fPIE_-gdwarf-4_-Wall/timingleaks/crypto_aead/morus640128v2/ref/work/encrypt.c:155: undefined reference to `morus_stateupdate'
try.c: /usr/bin/ld: libcrypto_aead_morus640128v2.a(encrypt.o): in function `morus_dec_aut_partialblock':
try.c: .../supercop-data/rome0/amd64/try/c/clang_-march=native_-O_-fwrapv_-Qunused-arguments_-fPIC_-fPIE_-gdwarf-4_-Wall/timingleaks/crypto_aead/morus640128v2/ref/work/encrypt.c:179: undefined reference to `morus_stateupdate'
try.c: /usr/bin/ld: libcrypto_aead_morus640128v2.a(encrypt.o): in function `crypto_aead_morus640128v2_ref_timingleaks_encrypt':
try.c: .../supercop-data/rome0/amd64/try/c/clang_-march=native_-O_-fwrapv_-Qunused-arguments_-fPIC_-fPIE_-gdwarf-4_-Wall/timingleaks/crypto_aead/morus640128v2/ref/work/encrypt.c:203: undefined reference to `morus_enc_aut_step'
try.c: /usr/bin/ld: .../supercop-data/rome0/amd64/try/c/clang_-march=native_-O_-fwrapv_-Qunused-arguments_-fPIC_-fPIE_-gdwarf-4_-Wall/timingleaks/crypto_aead/morus640128v2/ref/work/encrypt.c:214: undefined reference to `morus_enc_aut_step'
try.c: /usr/bin/ld: libcrypto_aead_morus640128v2.a(encrypt.o): in function `crypto_aead_morus640128v2_ref_timingleaks_decrypt':
try.c: .../supercop-data/rome0/amd64/try/c/clang_-march=native_-O_-fwrapv_-Qunused-arguments_-fPIC_-fPIE_-gdwarf-4_-Wall/timingleaks/crypto_aead/morus640128v2/ref/work/encrypt.c:251: undefined reference to `morus_enc_aut_step'
try.c: /usr/bin/ld: .../supercop-data/rome0/amd64/try/c/clang_-march=native_-O_-fwrapv_-Qunused-arguments_-fPIC_-fPIE_-gdwarf-4_-Wall/timingleaks/crypto_aead/morus640128v2/ref/work/encrypt.c:263: undefined reference to `morus_dec_aut_step'
try.c: clang: error: linker command failed with exit code 1 (use -v to see invocation)

Number of similar (implementation,compiler) pairs: 1, namely:
ImplementationCompiler
T:refclang -march=native -O -fwrapv -Qunused-arguments -fPIC -fPIE -gdwarf-4 -Wall (Debian_Clang_11.0.1)

Compiler output


encrypt.c: encrypt.c:242:16: warning: unused variable 'check' [-Wunused-variable]
encrypt.c:         unsigned char check = 0;
encrypt.c:                       ^
encrypt.c: 1 warning generated.
try.c: /usr/bin/ld: libcrypto_aead_morus640128v2.a(encrypt.o): in function `morus_initialization':
try.c: .../supercop-data/rome0/amd64/try/c/clang_-march=native_-Os_-fwrapv_-Qunused-arguments_-fPIC_-fPIE_-gdwarf-4_-Wall/timingleaks/crypto_aead/morus640128v2/ref/work/encrypt.c:67: undefined reference to `morus_stateupdate'
try.c: /usr/bin/ld: libcrypto_aead_morus640128v2.a(encrypt.o): in function `morus_tag_generation':
try.c: .../supercop-data/rome0/amd64/try/c/clang_-march=native_-Os_-fwrapv_-Qunused-arguments_-fPIC_-fPIE_-gdwarf-4_-Wall/timingleaks/crypto_aead/morus640128v2/ref/work/encrypt.c:82: undefined reference to `morus_stateupdate'
try.c: /usr/bin/ld: libcrypto_aead_morus640128v2.a(encrypt.o): in function `morus_tag_verification':
try.c: .../supercop-data/rome0/amd64/try/c/clang_-march=native_-Os_-fwrapv_-Qunused-arguments_-fPIC_-fPIE_-gdwarf-4_-Wall/timingleaks/crypto_aead/morus640128v2/ref/work/encrypt.c:102: undefined reference to `morus_stateupdate'
try.c: /usr/bin/ld: libcrypto_aead_morus640128v2.a(encrypt.o): in function `morus_enc_aut_partialblock':
try.c: .../supercop-data/rome0/amd64/try/c/clang_-march=native_-Os_-fwrapv_-Qunused-arguments_-fPIC_-fPIE_-gdwarf-4_-Wall/timingleaks/crypto_aead/morus640128v2/ref/work/encrypt.c:155: undefined reference to `morus_stateupdate'
try.c: /usr/bin/ld: libcrypto_aead_morus640128v2.a(encrypt.o): in function `morus_dec_aut_partialblock':
try.c: .../supercop-data/rome0/amd64/try/c/clang_-march=native_-Os_-fwrapv_-Qunused-arguments_-fPIC_-fPIE_-gdwarf-4_-Wall/timingleaks/crypto_aead/morus640128v2/ref/work/encrypt.c:179: undefined reference to `morus_stateupdate'
try.c: /usr/bin/ld: libcrypto_aead_morus640128v2.a(encrypt.o):.../supercop-data/rome0/amd64/try/c/clang_-march=native_-Os_-fwrapv_-Qunused-arguments_-fPIC_-fPIE_-gdwarf-4_-Wall/timingleaks/crypto_aead/morus640128v2/ref/work/encrypt.c:124: more undefined references to `morus_stateupdate' follow
try.c: clang: error: linker command failed with exit code 1 (use -v to see invocation)

Number of similar (implementation,compiler) pairs: 1, namely:
ImplementationCompiler
T:refclang -march=native -Os -fwrapv -Qunused-arguments -fPIC -fPIE -gdwarf-4 -Wall (Debian_Clang_11.0.1)

Compiler output


encrypt.c: encrypt.c:242:16: warning: unused variable 'check' [-Wunused-variable]
encrypt.c:         unsigned char check = 0;
encrypt.c:                       ^
encrypt.c: 1 warning generated.
try.c: /usr/bin/ld: libcrypto_aead_morus640128v2.a(encrypt.o): in function `morus_initialization':
try.c: .../supercop-data/rome0/amd64/try/c/clang_-mcpu=native_-O3_-fwrapv_-Qunused-arguments_-fPIC_-fPIE_-gdwarf-4_-Wall/timingleaks/crypto_aead/morus640128v2/ref/work/encrypt.c:67: undefined reference to `morus_stateupdate'
try.c: /usr/bin/ld: .../supercop-data/rome0/amd64/try/c/clang_-mcpu=native_-O3_-fwrapv_-Qunused-arguments_-fPIC_-fPIE_-gdwarf-4_-Wall/timingleaks/crypto_aead/morus640128v2/ref/work/encrypt.c:67: undefined reference to `morus_stateupdate'
try.c: /usr/bin/ld: .../supercop-data/rome0/amd64/try/c/clang_-mcpu=native_-O3_-fwrapv_-Qunused-arguments_-fPIC_-fPIE_-gdwarf-4_-Wall/timingleaks/crypto_aead/morus640128v2/ref/work/encrypt.c:67: undefined reference to `morus_stateupdate'
try.c: /usr/bin/ld: .../supercop-data/rome0/amd64/try/c/clang_-mcpu=native_-O3_-fwrapv_-Qunused-arguments_-fPIC_-fPIE_-gdwarf-4_-Wall/timingleaks/crypto_aead/morus640128v2/ref/work/encrypt.c:67: undefined reference to `morus_stateupdate'
try.c: /usr/bin/ld: .../supercop-data/rome0/amd64/try/c/clang_-mcpu=native_-O3_-fwrapv_-Qunused-arguments_-fPIC_-fPIE_-gdwarf-4_-Wall/timingleaks/crypto_aead/morus640128v2/ref/work/encrypt.c:67: undefined reference to `morus_stateupdate'
try.c: /usr/bin/ld: libcrypto_aead_morus640128v2.a(encrypt.o):.../supercop-data/rome0/amd64/try/c/clang_-mcpu=native_-O3_-fwrapv_-Qunused-arguments_-fPIC_-fPIE_-gdwarf-4_-Wall/timingleaks/crypto_aead/morus640128v2/ref/work/encrypt.c:67: more undefined references to `morus_stateupdate' follow
try.c: clang: error: linker command failed with exit code 1 (use -v to see invocation)

Number of similar (implementation,compiler) pairs: 1, namely:
ImplementationCompiler
T:refclang -mcpu=native -O3 -fwrapv -Qunused-arguments -fPIC -fPIE -gdwarf-4 -Wall (Debian_Clang_11.0.1)

Compiler output


encrypt.c: encrypt.c: In function 'crypto_aead_morus640128v2_ref_timingleaks_decrypt':
encrypt.c: encrypt.c:242:16: warning: unused variable 'check' [-Wunused-variable]
encrypt.c:   242 |  unsigned char check = 0;
encrypt.c:       |                ^~~~~
try.c: /usr/bin/ld: libcrypto_aead_morus640128v2.a(encrypt.o): in function `morus_initialization':
try.c: .../supercop-data/rome0/amd64/try/c/gcc_-march=native_-mtune=native_-O2_-fwrapv_-fPIC_-fPIE_-gdwarf-4_-Wall/timingleaks/crypto_aead/morus640128v2/ref/work/encrypt.c:67: undefined reference to `morus_stateupdate'
try.c: /usr/bin/ld: libcrypto_aead_morus640128v2.a(encrypt.o): in function `morus_tag_generation':
try.c: .../supercop-data/rome0/amd64/try/c/gcc_-march=native_-mtune=native_-O2_-fwrapv_-fPIC_-fPIE_-gdwarf-4_-Wall/timingleaks/crypto_aead/morus640128v2/ref/work/encrypt.c:82: undefined reference to `morus_stateupdate'
try.c: /usr/bin/ld: libcrypto_aead_morus640128v2.a(encrypt.o): in function `morus_tag_verification':
try.c: .../supercop-data/rome0/amd64/try/c/gcc_-march=native_-mtune=native_-O2_-fwrapv_-fPIC_-fPIE_-gdwarf-4_-Wall/timingleaks/crypto_aead/morus640128v2/ref/work/encrypt.c:102: undefined reference to `morus_stateupdate'
try.c: /usr/bin/ld: libcrypto_aead_morus640128v2.a(encrypt.o): in function `morus_enc_aut_partialblock':
try.c: .../supercop-data/rome0/amd64/try/c/gcc_-march=native_-mtune=native_-O2_-fwrapv_-fPIC_-fPIE_-gdwarf-4_-Wall/timingleaks/crypto_aead/morus640128v2/ref/work/encrypt.c:155: undefined reference to `morus_stateupdate'
try.c: /usr/bin/ld: libcrypto_aead_morus640128v2.a(encrypt.o): in function `morus_dec_aut_partialblock':
try.c: .../supercop-data/rome0/amd64/try/c/gcc_-march=native_-mtune=native_-O2_-fwrapv_-fPIC_-fPIE_-gdwarf-4_-Wall/timingleaks/crypto_aead/morus640128v2/ref/work/encrypt.c:179: undefined reference to `morus_stateupdate'
try.c: /usr/bin/ld: libcrypto_aead_morus640128v2.a(encrypt.o):.../supercop-data/rome0/amd64/try/c/gcc_-march=native_-mtune=native_-O2_-fwrapv_-fPIC_-fPIE_-gdwarf-4_-Wall/timingleaks/crypto_aead/morus640128v2/ref/work/encrypt.c:124: more undefined references to `morus_stateupdate' follow
try.c: collect2: error: ld returned 1 exit status

Number of similar (implementation,compiler) pairs: 1, namely:
ImplementationCompiler
T:refgcc -march=native -mtune=native -O2 -fwrapv -fPIC -fPIE -gdwarf-4 -Wall (10.2.1_20210110)

Compiler output


encrypt.c: encrypt.c: In function 'crypto_aead_morus640128v2_ref_timingleaks_decrypt':
encrypt.c: encrypt.c:242:16: warning: unused variable 'check' [-Wunused-variable]
encrypt.c:   242 |  unsigned char check = 0;
encrypt.c:       |                ^~~~~

Number of similar (implementation,compiler) pairs: 1, namely:
ImplementationCompiler
T:refgcc -march=native -mtune=native -O3 -fwrapv -fPIC -fPIE -gdwarf-4 -Wall (10.2.1_20210110)

Compiler output


encrypt.c: encrypt.c: In function 'crypto_aead_morus640128v2_ref_timingleaks_decrypt':
encrypt.c: encrypt.c:242:16: warning: unused variable 'check' [-Wunused-variable]
encrypt.c:   242 |  unsigned char check = 0;
encrypt.c:       |                ^~~~~
try.c: /usr/bin/ld: libcrypto_aead_morus640128v2.a(encrypt.o): in function `morus_initialization':
try.c: .../supercop-data/rome0/amd64/try/c/gcc_-march=native_-mtune=native_-O_-fwrapv_-fPIC_-fPIE_-gdwarf-4_-Wall/timingleaks/crypto_aead/morus640128v2/ref/work/encrypt.c:67: undefined reference to `morus_stateupdate'
try.c: /usr/bin/ld: libcrypto_aead_morus640128v2.a(encrypt.o): in function `morus_tag_generation':
try.c: .../supercop-data/rome0/amd64/try/c/gcc_-march=native_-mtune=native_-O_-fwrapv_-fPIC_-fPIE_-gdwarf-4_-Wall/timingleaks/crypto_aead/morus640128v2/ref/work/encrypt.c:82: undefined reference to `morus_stateupdate'
try.c: /usr/bin/ld: libcrypto_aead_morus640128v2.a(encrypt.o): in function `morus_tag_verification':
try.c: .../supercop-data/rome0/amd64/try/c/gcc_-march=native_-mtune=native_-O_-fwrapv_-fPIC_-fPIE_-gdwarf-4_-Wall/timingleaks/crypto_aead/morus640128v2/ref/work/encrypt.c:102: undefined reference to `morus_stateupdate'
try.c: /usr/bin/ld: libcrypto_aead_morus640128v2.a(encrypt.o): in function `morus_enc_aut_partialblock':
try.c: .../supercop-data/rome0/amd64/try/c/gcc_-march=native_-mtune=native_-O_-fwrapv_-fPIC_-fPIE_-gdwarf-4_-Wall/timingleaks/crypto_aead/morus640128v2/ref/work/encrypt.c:155: undefined reference to `morus_stateupdate'
try.c: /usr/bin/ld: libcrypto_aead_morus640128v2.a(encrypt.o): in function `morus_dec_aut_partialblock':
try.c: .../supercop-data/rome0/amd64/try/c/gcc_-march=native_-mtune=native_-O_-fwrapv_-fPIC_-fPIE_-gdwarf-4_-Wall/timingleaks/crypto_aead/morus640128v2/ref/work/encrypt.c:179: undefined reference to `morus_stateupdate'
try.c: /usr/bin/ld: libcrypto_aead_morus640128v2.a(encrypt.o):.../supercop-data/rome0/amd64/try/c/gcc_-march=native_-mtune=native_-O_-fwrapv_-fPIC_-fPIE_-gdwarf-4_-Wall/timingleaks/crypto_aead/morus640128v2/ref/work/encrypt.c:124: more undefined references to `morus_stateupdate' follow
try.c: collect2: error: ld returned 1 exit status

Number of similar (implementation,compiler) pairs: 1, namely:
ImplementationCompiler
T:refgcc -march=native -mtune=native -O -fwrapv -fPIC -fPIE -gdwarf-4 -Wall (10.2.1_20210110)

Compiler output


encrypt.c: encrypt.c: In function 'crypto_aead_morus640128v2_ref_timingleaks_decrypt':
encrypt.c: encrypt.c:242:16: warning: unused variable 'check' [-Wunused-variable]
encrypt.c:   242 |  unsigned char check = 0;
encrypt.c:       |                ^~~~~
try.c: /usr/bin/ld: libcrypto_aead_morus640128v2.a(encrypt.o): in function `morus_initialization':
try.c: .../supercop-data/rome0/amd64/try/c/gcc_-march=native_-mtune=native_-Os_-fwrapv_-fPIC_-fPIE_-gdwarf-4_-Wall/timingleaks/crypto_aead/morus640128v2/ref/work/encrypt.c:67: undefined reference to `morus_stateupdate'
try.c: /usr/bin/ld: libcrypto_aead_morus640128v2.a(encrypt.o): in function `morus_tag_generation':
try.c: .../supercop-data/rome0/amd64/try/c/gcc_-march=native_-mtune=native_-Os_-fwrapv_-fPIC_-fPIE_-gdwarf-4_-Wall/timingleaks/crypto_aead/morus640128v2/ref/work/encrypt.c:82: undefined reference to `morus_stateupdate'
try.c: /usr/bin/ld: libcrypto_aead_morus640128v2.a(encrypt.o): in function `morus_tag_verification':
try.c: .../supercop-data/rome0/amd64/try/c/gcc_-march=native_-mtune=native_-Os_-fwrapv_-fPIC_-fPIE_-gdwarf-4_-Wall/timingleaks/crypto_aead/morus640128v2/ref/work/encrypt.c:102: undefined reference to `morus_stateupdate'
try.c: /usr/bin/ld: libcrypto_aead_morus640128v2.a(encrypt.o): in function `morus_enc_aut_partialblock':
try.c: .../supercop-data/rome0/amd64/try/c/gcc_-march=native_-mtune=native_-Os_-fwrapv_-fPIC_-fPIE_-gdwarf-4_-Wall/timingleaks/crypto_aead/morus640128v2/ref/work/encrypt.c:155: undefined reference to `morus_stateupdate'
try.c: /usr/bin/ld: libcrypto_aead_morus640128v2.a(encrypt.o): in function `morus_dec_aut_partialblock':
try.c: .../supercop-data/rome0/amd64/try/c/gcc_-march=native_-mtune=native_-Os_-fwrapv_-fPIC_-fPIE_-gdwarf-4_-Wall/timingleaks/crypto_aead/morus640128v2/ref/work/encrypt.c:179: undefined reference to `morus_stateupdate'
try.c: /usr/bin/ld: libcrypto_aead_morus640128v2.a(encrypt.o): in function `crypto_aead_morus640128v2_ref_timingleaks_encrypt':
try.c: .../supercop-data/rome0/amd64/try/c/gcc_-march=native_-mtune=native_-Os_-fwrapv_-fPIC_-fPIE_-gdwarf-4_-Wall/timingleaks/crypto_aead/morus640128v2/ref/work/encrypt.c:203: undefined reference to `morus_enc_aut_step'
try.c: /usr/bin/ld: .../supercop-data/rome0/amd64/try/c/gcc_-march=native_-mtune=native_-Os_-fwrapv_-fPIC_-fPIE_-gdwarf-4_-Wall/timingleaks/crypto_aead/morus640128v2/ref/work/encrypt.c:214: undefined reference to `morus_enc_aut_step'
try.c: /usr/bin/ld: libcrypto_aead_morus640128v2.a(encrypt.o): in function `crypto_aead_morus640128v2_ref_timingleaks_decrypt':
try.c: .../supercop-data/rome0/amd64/try/c/gcc_-march=native_-mtune=native_-Os_-fwrapv_-fPIC_-fPIE_-gdwarf-4_-Wall/timingleaks/crypto_aead/morus640128v2/ref/work/encrypt.c:251: undefined reference to `morus_enc_aut_step'
try.c: /usr/bin/ld: .../supercop-data/rome0/amd64/try/c/gcc_-march=native_-mtune=native_-Os_-fwrapv_-fPIC_-fPIE_-gdwarf-4_-Wall/timingleaks/crypto_aead/morus640128v2/ref/work/encrypt.c:263: undefined reference to `morus_dec_aut_step'
try.c: collect2: error: ld returned 1 exit status

Number of similar (implementation,compiler) pairs: 1, namely:
ImplementationCompiler
T:refgcc -march=native -mtune=native -Os -fwrapv -fPIC -fPIE -gdwarf-4 -Wall (10.2.1_20210110)