Implementation notes: amd64, rome0, crypto_aead/morus1280128v2

Computer: rome0
Microarchitecture: amd64; Zen2 (830f10)
Architecture: amd64
CPU ID: AuthenticAMD-00830f10-178bfbff
SUPERCOP version: 20230530
Operation: crypto_aead
Primitive: morus1280128v2
TimeObject sizeTest sizeImplementationCompilerBenchmark dateSUPERCOP version
60525939 0 022056 812 1048T:avx2clang_-march=native_-O3_-fomit-frame-pointer_-fwrapv_-Qunused-arguments_-fPIC_-fPIE2023052120221122
60605939 0 021912 812 1048T:avx2clang_-march=native_-O2_-fomit-frame-pointer_-fwrapv_-Qunused-arguments_-fPIC_-fPIE2023052120221122
61003785 0 017334 804 1016T:avx2clang_-march=native_-Os_-fomit-frame-pointer_-fwrapv_-Qunused-arguments_-fPIC_-fPIE2023052120221122
64326230 0 022472 780 1080T:avx2gcc_-march=native_-mtune=native_-O3_-fomit-frame-pointer_-fwrapv_-fPIC_-fPIE2023052120221122
64783415 0 017992 780 1080T:avx2gcc_-march=native_-mtune=native_-O2_-fomit-frame-pointer_-fwrapv_-fPIC_-fPIE2023052120221122
64923389 0 017624 780 1080T:avx2gcc_-march=native_-mtune=native_-O_-fomit-frame-pointer_-fwrapv_-fPIC_-fPIE2023052120221122
66086838 0 020422 804 1016T:sse2clang_-march=native_-Os_-fomit-frame-pointer_-fwrapv_-Qunused-arguments_-fPIC_-fPIE2023052120221122
703312501 0 028768 812 1016T:sse2clang_-mcpu=native_-O3_-fomit-frame-pointer_-fwrapv_-Qunused-arguments_-fPIC_-fPIE2023052120221122
722510592 0 026528 812 1048T:sse2clang_-march=native_-O2_-fomit-frame-pointer_-fwrapv_-Qunused-arguments_-fPIC_-fPIE2023052120221122
723610592 0 026656 812 1048T:sse2clang_-march=native_-O3_-fomit-frame-pointer_-fwrapv_-Qunused-arguments_-fPIC_-fPIE2023052120221122
78608465 0 024712 780 1080T:sse2gcc_-march=native_-mtune=native_-O3_-fomit-frame-pointer_-fwrapv_-fPIC_-fPIE2023052120221122
1227216161 0 032424 780 1080T:refgcc_-march=native_-mtune=native_-O3_-fomit-frame-pointer_-fwrapv_-fPIC_-fPIE2023052120221122
1227216161 0 032424 780 1080T:ref64gcc_-march=native_-mtune=native_-O3_-fomit-frame-pointer_-fwrapv_-fPIC_-fPIE2023052120221122
173795678 0 020248 780 1080T:refgcc_-march=native_-mtune=native_-O2_-fomit-frame-pointer_-fwrapv_-fPIC_-fPIE2023052120221122
173815678 0 020248 780 1080T:ref64gcc_-march=native_-mtune=native_-O2_-fomit-frame-pointer_-fwrapv_-fPIC_-fPIE2023052120221122
177625119 0 018107 756 1048T:refgcc_-march=native_-mtune=native_-Os_-fomit-frame-pointer_-fwrapv_-fPIC_-fPIE2023052120221122
178245119 0 018107 756 1048T:ref64gcc_-march=native_-mtune=native_-Os_-fomit-frame-pointer_-fwrapv_-fPIC_-fPIE2023052120221122
178286009 0 022072 812 1048T:refclang_-march=native_-O2_-fomit-frame-pointer_-fwrapv_-Qunused-arguments_-fPIC_-fPIE2023052120221122
180296009 0 022072 812 1048T:ref64clang_-march=native_-O2_-fomit-frame-pointer_-fwrapv_-Qunused-arguments_-fPIC_-fPIE2023052120221122
180726009 0 022200 812 1048T:refclang_-march=native_-O3_-fomit-frame-pointer_-fwrapv_-Qunused-arguments_-fPIC_-fPIE2023052120221122
180744963 0 018590 804 1016T:ref64clang_-march=native_-Os_-fomit-frame-pointer_-fwrapv_-Qunused-arguments_-fPIC_-fPIE2023052120221122
181545625 0 019775 772 1080T:ref64gcc_-march=native_-mtune=native_-O_-fomit-frame-pointer_-fwrapv_-fPIC_-fPIE2023052120221122
181605625 0 019775 772 1080T:refgcc_-march=native_-mtune=native_-O_-fomit-frame-pointer_-fwrapv_-fPIC_-fPIE2023052120221122
183964963 0 018590 804 1016T:refclang_-march=native_-Os_-fomit-frame-pointer_-fwrapv_-Qunused-arguments_-fPIC_-fPIE2023052120221122
184476009 0 022200 812 1048T:ref64clang_-march=native_-O3_-fomit-frame-pointer_-fwrapv_-Qunused-arguments_-fPIC_-fPIE2023052120221122
191156763 0 023144 812 1016T:refclang_-mcpu=native_-O3_-fomit-frame-pointer_-fwrapv_-Qunused-arguments_-fPIC_-fPIE2023052120221122
191566763 0 023144 812 1016T:ref64clang_-mcpu=native_-O3_-fomit-frame-pointer_-fwrapv_-Qunused-arguments_-fPIC_-fPIE2023052120221122
227755908 0 019838 804 1016T:refclang_-march=native_-O_-fomit-frame-pointer_-fwrapv_-Qunused-arguments_-fPIC_-fPIE2023052120221122
227815908 0 019838 804 1016T:ref64clang_-march=native_-O_-fomit-frame-pointer_-fwrapv_-Qunused-arguments_-fPIC_-fPIE2023052120221122

Compiler output

Implementation: T:avx2
Security model: timingleaks
Compiler: clang -march=native -O -fomit-frame-pointer -fwrapv -Qunused-arguments -fPIC -fPIE
try.c: /usr/bin/ld: libcrypto_aead_morus1280128v2.a(encrypt.o): in function `crypto_aead_morus1280128v2_avx2_timingleaks_encrypt':
try.c: encrypt.c:(.text+0x...): undefined reference to `morus_enc_aut_step'
try.c: /usr/bin/ld: encrypt.c:(.text+0x...): undefined reference to `morus_enc_aut_step'
try.c: /usr/bin/ld: libcrypto_aead_morus1280128v2.a(encrypt.o): in function `crypto_aead_morus1280128v2_avx2_timingleaks_decrypt':
try.c: encrypt.c:(.text+0x...): undefined reference to `morus_enc_aut_step'
try.c: /usr/bin/ld: encrypt.c:(.text+0x...): undefined reference to `morus_dec_aut_step'
try.c: clang: error: linker command failed with exit code 1 (use -v to see invocation)

Number of similar (compiler,implementation) pairs: 1, namely:
CompilerImplementations
clang -march=native -O -fomit-frame-pointer -fwrapv -Qunused-arguments -fPIC -fPIE T:avx2

Compiler output

Implementation: T:avx2
Security model: timingleaks
Compiler: clang -mcpu=native -O3 -fomit-frame-pointer -fwrapv -Qunused-arguments -fPIC -fPIE
encrypt.c: encrypt.c:55:13: error: always_inline function '_mm256_xor_si256' requires target feature 'avx2', but would be inlined into function 'morus_stateupdate' that is compiled without support for 'avx2'
encrypt.c: state[0] = XOR256(state[0], state[3]);
encrypt.c: ^
encrypt.c: encrypt.c:25:27: note: expanded from macro 'XOR256'
encrypt.c: #define XOR256(x,y) _mm256_xor_si256((x),(y)) /*XOR256(x,y) = x ^ y, where x and y are two 256-bit word*/
encrypt.c: ^
encrypt.c: encrypt.c:55:13: error: AVX vector argument of type '__m256i' (vector of 4 'long long' values) without 'avx' enabled changes the ABI
encrypt.c: encrypt.c:25:27: note: expanded from macro 'XOR256'
encrypt.c: #define XOR256(x,y) _mm256_xor_si256((x),(y)) /*XOR256(x,y) = x ^ y, where x and y are two 256-bit word*/
encrypt.c: ^
encrypt.c: encrypt.c:56:30: error: always_inline function '_mm256_and_si256' requires target feature 'avx2', but would be inlined into function 'morus_stateupdate' that is compiled without support for 'avx2'
encrypt.c: state[0] = XOR256(state[0], AND256(state[1], state[2]));
encrypt.c: ^
encrypt.c: encrypt.c:26:27: note: expanded from macro 'AND256'
encrypt.c: #define AND256(x,y) _mm256_and_si256((x),(y)) /*AND(x,y) = x & y, where x and y are two 256-bit word*/
encrypt.c: ^
encrypt.c: encrypt.c:56:30: error: AVX vector argument of type '__m256i' (vector of 4 'long long' values) without 'avx' enabled changes the ABI
encrypt.c: encrypt.c:26:27: note: expanded from macro 'AND256'
encrypt.c: #define AND256(x,y) _mm256_and_si256((x),(y)) /*AND(x,y) = x & y, where x and y are two 256-bit word*/
encrypt.c: ^
encrypt.c: encrypt.c:56:13: error: always_inline function '_mm256_xor_si256' requires target feature 'avx2', but would be inlined into function 'morus_stateupdate' that is compiled without support for 'avx2'
encrypt.c: state[0] = XOR256(state[0], AND256(state[1], state[2]));
encrypt.c: ^
encrypt.c: encrypt.c:25:27: note: expanded from macro 'XOR256'
encrypt.c: #define XOR256(x,y) _mm256_xor_si256((x),(y)) /*XOR256(x,y) = x ^ y, where x and y are two 256-bit word*/
encrypt.c: ...

Number of similar (compiler,implementation) pairs: 1, namely:
CompilerImplementations
clang -mcpu=native -O3 -fomit-frame-pointer -fwrapv -Qunused-arguments -fPIC -fPIE T:avx2

Compiler output

Implementation: T:avx2
Security model: timingleaks
Compiler: gcc -march=native -mtune=native -Os -fomit-frame-pointer -fwrapv -fPIC -fPIE
try.c: /usr/bin/ld: libcrypto_aead_morus1280128v2.a(encrypt.o): in function `crypto_aead_morus1280128v2_avx2_timingleaks_encrypt':
try.c: encrypt.c:(.text+0x...): undefined reference to `morus_enc_aut_step'
try.c: /usr/bin/ld: encrypt.c:(.text+0x...): undefined reference to `morus_enc_aut_step'
try.c: /usr/bin/ld: libcrypto_aead_morus1280128v2.a(encrypt.o): in function `crypto_aead_morus1280128v2_avx2_timingleaks_decrypt':
try.c: encrypt.c:(.text+0x...): undefined reference to `morus_enc_aut_step'
try.c: /usr/bin/ld: encrypt.c:(.text+0x...): undefined reference to `morus_dec_aut_step'
try.c: collect2: error: ld returned 1 exit status

Number of similar (compiler,implementation) pairs: 1, namely:
CompilerImplementations
gcc -march=native -mtune=native -Os -fomit-frame-pointer -fwrapv -fPIC -fPIE T:avx2

Compiler output

Implementation: T:sse2
Security model: timingleaks
Compiler: clang -march=native -O -fomit-frame-pointer -fwrapv -Qunused-arguments -fPIC -fPIE
try.c: /usr/bin/ld: libcrypto_aead_morus1280128v2.a(encrypt.o): in function `morus_initialization':
try.c: encrypt.c:(.text+0x...): undefined reference to `morus_stateupdate'
try.c: /usr/bin/ld: libcrypto_aead_morus1280128v2.a(encrypt.o): in function `morus_initialization_key_256':
try.c: encrypt.c:(.text+0x...): undefined reference to `morus_stateupdate'
try.c: /usr/bin/ld: libcrypto_aead_morus1280128v2.a(encrypt.o): in function `morus_tag_generation':
try.c: encrypt.c:(.text+0x...): undefined reference to `morus_stateupdate'
try.c: /usr/bin/ld: libcrypto_aead_morus1280128v2.a(encrypt.o): in function `morus_tag_verification':
try.c: encrypt.c:(.text+0x...): undefined reference to `morus_stateupdate'
try.c: /usr/bin/ld: libcrypto_aead_morus1280128v2.a(encrypt.o): in function `morus_enc_aut_partialblock':
try.c: encrypt.c:(.text+0x...): undefined reference to `morus_stateupdate'
try.c: /usr/bin/ld: libcrypto_aead_morus1280128v2.a(encrypt.o):encrypt.c:(.text+0x...): more undefined references to `morus_stateupdate' follow
try.c: /usr/bin/ld: libcrypto_aead_morus1280128v2.a(encrypt.o): in function `crypto_aead_morus1280128v2_sse2_timingleaks_encrypt':
try.c: encrypt.c:(.text+0x...): undefined reference to `morus_enc_aut_step'
try.c: /usr/bin/ld: encrypt.c:(.text+0x...): undefined reference to `morus_enc_aut_step'
try.c: /usr/bin/ld: libcrypto_aead_morus1280128v2.a(encrypt.o): in function `crypto_aead_morus1280128v2_sse2_timingleaks_decrypt':
try.c: encrypt.c:(.text+0x...): undefined reference to `morus_enc_aut_step'
try.c: /usr/bin/ld: encrypt.c:(.text+0x...): undefined reference to `morus_dec_aut_step'
try.c: clang: error: linker command failed with exit code 1 (use -v to see invocation)

Number of similar (compiler,implementation) pairs: 1, namely:
CompilerImplementations
clang -march=native -O -fomit-frame-pointer -fwrapv -Qunused-arguments -fPIC -fPIE T:sse2

Compiler output

Implementation: T:sse2
Security model: timingleaks
Compiler: gcc -march=native -mtune=native -O2 -fomit-frame-pointer -fwrapv -fPIC -fPIE
try.c: /usr/bin/ld: libcrypto_aead_morus1280128v2.a(encrypt.o): in function `morus_initialization':
try.c: encrypt.c:(.text+0x...): undefined reference to `morus_stateupdate'
try.c: /usr/bin/ld: libcrypto_aead_morus1280128v2.a(encrypt.o): in function `morus_initialization_key_256':
try.c: encrypt.c:(.text+0x...): undefined reference to `morus_stateupdate'
try.c: /usr/bin/ld: libcrypto_aead_morus1280128v2.a(encrypt.o): in function `morus_tag_generation':
try.c: encrypt.c:(.text+0x...): undefined reference to `morus_stateupdate'
try.c: /usr/bin/ld: libcrypto_aead_morus1280128v2.a(encrypt.o): in function `morus_tag_verification':
try.c: encrypt.c:(.text+0x...): undefined reference to `morus_stateupdate'
try.c: /usr/bin/ld: libcrypto_aead_morus1280128v2.a(encrypt.o): in function `morus_enc_aut_partialblock':
try.c: encrypt.c:(.text+0x...): undefined reference to `morus_stateupdate'
try.c: /usr/bin/ld: libcrypto_aead_morus1280128v2.a(encrypt.o):encrypt.c:(.text+0x...): more undefined references to `morus_stateupdate' follow
try.c: collect2: error: ld returned 1 exit status

Number of similar (compiler,implementation) pairs: 2, namely:
CompilerImplementations
gcc -march=native -mtune=native -O2 -fomit-frame-pointer -fwrapv -fPIC -fPIE T:sse2
gcc -march=native -mtune=native -O -fomit-frame-pointer -fwrapv -fPIC -fPIE T:sse2

Compiler output

Implementation: T:sse2
Security model: timingleaks
Compiler: gcc -march=native -mtune=native -Os -fomit-frame-pointer -fwrapv -fPIC -fPIE
try.c: /usr/bin/ld: libcrypto_aead_morus1280128v2.a(encrypt.o): in function `morus_initialization':
try.c: encrypt.c:(.text+0x...): undefined reference to `morus_stateupdate'
try.c: /usr/bin/ld: libcrypto_aead_morus1280128v2.a(encrypt.o): in function `morus_initialization_key_256':
try.c: encrypt.c:(.text+0x...): undefined reference to `morus_stateupdate'
try.c: /usr/bin/ld: libcrypto_aead_morus1280128v2.a(encrypt.o): in function `morus_tag_generation':
try.c: encrypt.c:(.text+0x...): undefined reference to `morus_stateupdate'
try.c: /usr/bin/ld: libcrypto_aead_morus1280128v2.a(encrypt.o): in function `morus_tag_verification':
try.c: encrypt.c:(.text+0x...): undefined reference to `morus_stateupdate'
try.c: /usr/bin/ld: libcrypto_aead_morus1280128v2.a(encrypt.o): in function `morus_enc_aut_partialblock':
try.c: encrypt.c:(.text+0x...): undefined reference to `morus_stateupdate'
try.c: /usr/bin/ld: libcrypto_aead_morus1280128v2.a(encrypt.o):encrypt.c:(.text+0x...): more undefined references to `morus_stateupdate' follow
try.c: /usr/bin/ld: libcrypto_aead_morus1280128v2.a(encrypt.o): in function `crypto_aead_morus1280128v2_sse2_timingleaks_encrypt':
try.c: encrypt.c:(.text+0x...): undefined reference to `morus_enc_aut_step'
try.c: /usr/bin/ld: encrypt.c:(.text+0x...): undefined reference to `morus_enc_aut_step'
try.c: /usr/bin/ld: libcrypto_aead_morus1280128v2.a(encrypt.o): in function `crypto_aead_morus1280128v2_sse2_timingleaks_decrypt':
try.c: encrypt.c:(.text+0x...): undefined reference to `morus_enc_aut_step'
try.c: /usr/bin/ld: encrypt.c:(.text+0x...): undefined reference to `morus_dec_aut_step'
try.c: collect2: error: ld returned 1 exit status

Number of similar (compiler,implementation) pairs: 1, namely:
CompilerImplementations
gcc -march=native -mtune=native -Os -fomit-frame-pointer -fwrapv -fPIC -fPIE T:sse2