Implementation notes: amd64, rome0, crypto_aead/aegis128l

Computer: rome0
Microarchitecture: amd64; Zen 2 (830f10)
Architecture: amd64
CPU ID: AuthenticAMD-00830f10-178bfbff
SUPERCOP version: 20240425
Operation: crypto_aead
Primitive: aegis128l
TimeObject sizeTest sizeImplementationCompilerBenchmark dateSUPERCOP version
14303118 0 022750 804 1016sodium-aesniclang_-march=native_-Os_-fomit-frame-pointer_-fwrapv_-Qunused-arguments_-fPIC_-fPIE2024042520240425
14404596 0 026968 812 1016sodium-aesniclang_-mcpu=native_-O3_-fomit-frame-pointer_-fwrapv_-Qunused-arguments_-fPIC_-fPIE2024042520240425
14685869 0 021768 812 1048T:aesnibclang_-march=native_-O2_-fomit-frame-pointer_-fwrapv_-Qunused-arguments_-fPIC_-fPIE2024042520240425
14755869 0 021896 812 1048T:aesnibclang_-march=native_-O3_-fomit-frame-pointer_-fwrapv_-Qunused-arguments_-fPIC_-fPIE2024042520240425
14844949 0 027848 780 1080sodium-aesnigcc_-march=native_-mtune=native_-O3_-fomit-frame-pointer_-fwrapv_-fPIC_-fPIE2024042520240425
14854085 0 017614 804 1016T:aesnibclang_-march=native_-Os_-fomit-frame-pointer_-fwrapv_-Qunused-arguments_-fPIC_-fPIE2024042520240425
14864600 0 026720 812 1048sodium-aesniclang_-march=native_-O3_-fomit-frame-pointer_-fwrapv_-Qunused-arguments_-fPIC_-fPIE2024042520240425
14954600 0 026592 812 1048sodium-aesniclang_-march=native_-O2_-fomit-frame-pointer_-fwrapv_-Qunused-arguments_-fPIC_-fPIE2024042520240425
14984311 32 026624 852 1016jasmin-aesniclang_-mcpu=native_-O3_-fomit-frame-pointer_-fwrapv_-Qunused-arguments_-fPIC_-fPIE2024042520240425
15025458 0 021664 780 1080T:aesniagcc_-march=native_-mtune=native_-O3_-fomit-frame-pointer_-fwrapv_-fPIC_-fPIE2024042520240425
15054253 32 023814 844 1016jasmin-aesniclang_-march=native_-Os_-fomit-frame-pointer_-fwrapv_-Qunused-arguments_-fPIC_-fPIE2024042520240425
15084229 32 024623 812 1080jasmin-aesnigcc_-march=native_-mtune=native_-O_-fomit-frame-pointer_-fwrapv_-fPIC_-fPIE2024042520240425
15084207 32 023043 796 1048jasmin-aesnigcc_-march=native_-mtune=native_-Os_-fomit-frame-pointer_-fwrapv_-fPIC_-fPIE2024042520240425
15104323 32 025424 820 1080jasmin-aesnigcc_-march=native_-mtune=native_-O2_-fomit-frame-pointer_-fwrapv_-fPIC_-fPIE2024042520240425
15124323 32 027136 820 1080jasmin-aesnigcc_-march=native_-mtune=native_-O3_-fomit-frame-pointer_-fwrapv_-fPIC_-fPIE2024042520240425
15164308 32 026216 852 1048jasmin-aesniclang_-march=native_-O2_-fomit-frame-pointer_-fwrapv_-Qunused-arguments_-fPIC_-fPIE2024042520240425
15175722 0 021944 780 1080T:aesnibgcc_-march=native_-mtune=native_-O3_-fomit-frame-pointer_-fwrapv_-fPIC_-fPIE2024042520240425
15197486 0 023736 780 1080T:aesnicgcc_-march=native_-mtune=native_-O3_-fomit-frame-pointer_-fwrapv_-fPIC_-fPIE2024042520240425
15194308 32 026360 852 1048jasmin-aesniclang_-march=native_-O3_-fomit-frame-pointer_-fwrapv_-Qunused-arguments_-fPIC_-fPIE2024042520240425
15334149 0 025376 780 1080sodium-aesnigcc_-march=native_-mtune=native_-O2_-fomit-frame-pointer_-fwrapv_-fPIC_-fPIE2024042520240425
15444355 0 017902 804 1016T:aesnicclang_-march=native_-Os_-fomit-frame-pointer_-fwrapv_-Qunused-arguments_-fPIC_-fPIE2024042520240425
15714242 32 023974 844 1016jasmin-aesniclang_-march=native_-O_-fomit-frame-pointer_-fwrapv_-Qunused-arguments_-fPIC_-fPIE2024042520240425
15832716 0 016606 804 1016T:aesnibclang_-march=native_-O_-fomit-frame-pointer_-fwrapv_-Qunused-arguments_-fPIC_-fPIE2024042520240425
15899107 0 025032 812 1048T:aesnicclang_-march=native_-O2_-fomit-frame-pointer_-fwrapv_-Qunused-arguments_-fPIC_-fPIE2024042520240425
15939107 0 025160 812 1048T:aesnicclang_-march=native_-O3_-fomit-frame-pointer_-fwrapv_-Qunused-arguments_-fPIC_-fPIE2024042520240425
16024186 0 018720 780 1080T:aesniagcc_-march=native_-mtune=native_-O2_-fomit-frame-pointer_-fwrapv_-fPIC_-fPIE2024042520240425
16283624 0 018168 780 1080T:aesnibgcc_-march=native_-mtune=native_-O2_-fomit-frame-pointer_-fwrapv_-fPIC_-fPIE2024042520240425
16335491 0 020064 780 1080T:aesnicgcc_-march=native_-mtune=native_-O2_-fomit-frame-pointer_-fwrapv_-fPIC_-fPIE2024042520240425
16393989 0 018111 772 1080T:aesniagcc_-march=native_-mtune=native_-O_-fomit-frame-pointer_-fwrapv_-fPIC_-fPIE2024042520240425
16424111 0 018014 804 1016T:aesnicclang_-march=native_-O_-fomit-frame-pointer_-fwrapv_-Qunused-arguments_-fPIC_-fPIE2024042520240425
16564711 0 018863 772 1080T:aesnicgcc_-march=native_-mtune=native_-O_-fomit-frame-pointer_-fwrapv_-fPIC_-fPIE2024042520240425
16582533 0 015491 756 1048T:aesnibgcc_-march=native_-mtune=native_-Os_-fomit-frame-pointer_-fwrapv_-fPIC_-fPIE2024042520240425
16633539 0 017671 772 1080T:aesnibgcc_-march=native_-mtune=native_-O_-fomit-frame-pointer_-fwrapv_-fPIC_-fPIE2024042520240425
16753718 0 016699 756 1048T:aesnicgcc_-march=native_-mtune=native_-Os_-fomit-frame-pointer_-fwrapv_-fPIC_-fPIE2024042520240425
21483903 0 017414 804 1016T:aesniaclang_-march=native_-Os_-fomit-frame-pointer_-fwrapv_-Qunused-arguments_-fPIC_-fPIE2024042520240425
24493729 0 024320 780 1080sodium-aesnigcc_-march=native_-mtune=native_-O_-fomit-frame-pointer_-fwrapv_-fPIC_-fPIE2024042520240425
27715710 0 021600 812 1048T:aesniaclang_-march=native_-O2_-fomit-frame-pointer_-fwrapv_-Qunused-arguments_-fPIC_-fPIE2024042520240425
27735742 0 021760 812 1048T:aesniaclang_-march=native_-O3_-fomit-frame-pointer_-fwrapv_-Qunused-arguments_-fPIC_-fPIE2024042520240425
35111791 0 020755 756 1048sodium-aesnigcc_-march=native_-mtune=native_-Os_-fomit-frame-pointer_-fwrapv_-fPIC_-fPIE2024042520240425
37872358 0 022278 804 1016sodium-aesniclang_-march=native_-O_-fomit-frame-pointer_-fwrapv_-Qunused-arguments_-fPIC_-fPIE2024042520240425
419526893 4096 023168 4884 1080T:refgcc_-march=native_-mtune=native_-O3_-fomit-frame-pointer_-fwrapv_-fPIC_-fPIE2024042520240425
5090668339 0 030528 812 1048T:sodium-softaesclang_-march=native_-O3_-fomit-frame-pointer_-fwrapv_-Qunused-arguments_-fPIC_-fPIE2024042520240425
5103308339 0 030416 812 1048T:sodium-softaesclang_-march=native_-O2_-fomit-frame-pointer_-fwrapv_-Qunused-arguments_-fPIC_-fPIE2024042520240425
5145458259 0 030696 812 1016T:sodium-softaesclang_-mcpu=native_-O3_-fomit-frame-pointer_-fwrapv_-Qunused-arguments_-fPIC_-fPIE2024042520240425
60883010606 1024 033528 1812 1080T:sodium-softaesgcc_-march=native_-mtune=native_-O3_-fomit-frame-pointer_-fwrapv_-fPIC_-fPIE2024042520240425
6684186232 0 025966 804 1016T:sodium-softaesclang_-march=native_-Os_-fomit-frame-pointer_-fwrapv_-Qunused-arguments_-fPIC_-fPIE2024042520240425
6800729382 1024 029976 1812 1080T:sodium-softaesgcc_-march=native_-mtune=native_-O_-fomit-frame-pointer_-fwrapv_-fPIC_-fPIE2024042520240425
6893278566 1024 029808 1812 1080T:sodium-softaesgcc_-march=native_-mtune=native_-O2_-fomit-frame-pointer_-fwrapv_-fPIC_-fPIE2024042520240425
6897094245 1024 023259 1788 1048T:sodium-softaesgcc_-march=native_-mtune=native_-Os_-fomit-frame-pointer_-fwrapv_-fPIC_-fPIE2024042520240425
7340716525 0 026526 804 1016T:sodium-softaesclang_-march=native_-O_-fomit-frame-pointer_-fwrapv_-Qunused-arguments_-fPIC_-fPIE2024042520240425

Compiler output

Implementation: T:aesnia
Security model: timingleaks
Compiler: clang -march=native -O -fomit-frame-pointer -fwrapv -Qunused-arguments -fPIC -fPIE
try.c: /usr/bin/ld: libcrypto_aead_aegis128l.a(encrypt.o): in function `crypto_aead_aegis128l_aesnia_timingleaks_encrypt':
try.c: encrypt.c:(.text+0x...): undefined reference to `aegis128L_enc_aut_step'
try.c: /usr/bin/ld: encrypt.c:(.text+0x...): undefined reference to `aegis128L_enc_aut_step'
try.c: /usr/bin/ld: encrypt.c:(.text+0x...): undefined reference to `aegis128L_enc_aut_step'
try.c: /usr/bin/ld: encrypt.c:(.text+0x...): undefined reference to `aegis128L_enc_aut_step'
try.c: /usr/bin/ld: libcrypto_aead_aegis128l.a(encrypt.o): in function `crypto_aead_aegis128l_aesnia_timingleaks_decrypt':
try.c: encrypt.c:(.text+0x...): undefined reference to `aegis128L_enc_aut_step'
try.c: /usr/bin/ld: libcrypto_aead_aegis128l.a(encrypt.o):encrypt.c:(.text+0x...): more undefined references to `aegis128L_enc_aut_step' follow
try.c: /usr/bin/ld: libcrypto_aead_aegis128l.a(encrypt.o): in function `crypto_aead_aegis128l_aesnia_timingleaks_decrypt':
try.c: encrypt.c:(.text+0x...): undefined reference to `aegis128L_dec_aut_step'
try.c: /usr/bin/ld: encrypt.c:(.text+0x...): undefined reference to `aegis128L_dec_aut_step'
try.c: clang: error: linker command failed with exit code 1 (use -v to see invocation)

Number of similar (compiler,implementation) pairs: 1, namely:
CompilerImplementations
clang -march=native -O -fomit-frame-pointer -fwrapv -Qunused-arguments -fPIC -fPIE T:aesnia

Compiler output

Implementation: T:aesnia
Security model: timingleaks
Compiler: clang -mcpu=native -O3 -fomit-frame-pointer -fwrapv -Qunused-arguments -fPIC -fPIE
encrypt.c: encrypt.c:34:25: error: always_inline function '_mm_aesenc_si128' requires target feature 'aes', but would be inlined into function 'aegis128L_initialization' that is compiled without support for 'aes'
encrypt.c: state[7] = _mm_aesenc_si128(state[6],state[7]);
encrypt.c: ^
encrypt.c: encrypt.c:35:25: error: always_inline function '_mm_aesenc_si128' requires target feature 'aes', but would be inlined into function 'aegis128L_initialization' that is compiled without support for 'aes'
encrypt.c: state[6] = _mm_aesenc_si128(state[5],state[6]);
encrypt.c: ^
encrypt.c: encrypt.c:36:25: error: always_inline function '_mm_aesenc_si128' requires target feature 'aes', but would be inlined into function 'aegis128L_initialization' that is compiled without support for 'aes'
encrypt.c: state[5] = _mm_aesenc_si128(state[4],state[5]);
encrypt.c: ^
encrypt.c: encrypt.c:37:25: error: always_inline function '_mm_aesenc_si128' requires target feature 'aes', but would be inlined into function 'aegis128L_initialization' that is compiled without support for 'aes'
encrypt.c: state[4] = _mm_aesenc_si128(state[3],state[4]);
encrypt.c: ^
encrypt.c: encrypt.c:38:25: error: always_inline function '_mm_aesenc_si128' requires target feature 'aes', but would be inlined into function 'aegis128L_initialization' that is compiled without support for 'aes'
encrypt.c: state[3] = _mm_aesenc_si128(state[2],state[3]);
encrypt.c: ^
encrypt.c: encrypt.c:39:25: error: always_inline function '_mm_aesenc_si128' requires target feature 'aes', but would be inlined into function 'aegis128L_initialization' that is compiled without support for 'aes'
encrypt.c: state[2] = _mm_aesenc_si128(state[1],state[2]);
encrypt.c: ^
encrypt.c: encrypt.c:40:25: error: always_inline function '_mm_aesenc_si128' requires target feature 'aes', but would be inlined into function 'aegis128L_initialization' that is compiled without support for 'aes'
encrypt.c: state[1] = _mm_aesenc_si128(state[0],state[1]);
encrypt.c: ^
encrypt.c: encrypt.c:41:25: error: always_inline function '_mm_aesenc_si128' requires target feature 'aes', but would be inlined into function 'aegis128L_initialization' that is compiled without support for 'aes'
encrypt.c: state[0] = _mm_aesenc_si128(tmp,state[0]);
encrypt.c: ^
encrypt.c: 8 errors generated.

Number of similar (compiler,implementation) pairs: 3, namely:
CompilerImplementations
clang -mcpu=native -O3 -fomit-frame-pointer -fwrapv -Qunused-arguments -fPIC -fPIE T:aesnia T:aesnib T:aesnic

Compiler output

Implementation: T:aesnia
Security model: timingleaks
Compiler: gcc -march=native -mtune=native -Os -fomit-frame-pointer -fwrapv -fPIC -fPIE
try.c: /usr/bin/ld: libcrypto_aead_aegis128l.a(encrypt.o): in function `crypto_aead_aegis128l_aesnia_timingleaks_encrypt':
try.c: encrypt.c:(.text+0x...): undefined reference to `aegis128L_enc_aut_step'
try.c: /usr/bin/ld: encrypt.c:(.text+0x...): undefined reference to `aegis128L_enc_aut_step'
try.c: /usr/bin/ld: encrypt.c:(.text+0x...): undefined reference to `aegis128L_enc_aut_step'
try.c: /usr/bin/ld: encrypt.c:(.text+0x...): undefined reference to `aegis128L_enc_aut_step'
try.c: /usr/bin/ld: libcrypto_aead_aegis128l.a(encrypt.o): in function `crypto_aead_aegis128l_aesnia_timingleaks_decrypt':
try.c: encrypt.c:(.text+0x...): undefined reference to `aegis128L_enc_aut_step'
try.c: /usr/bin/ld: libcrypto_aead_aegis128l.a(encrypt.o):encrypt.c:(.text+0x...): more undefined references to `aegis128L_enc_aut_step' follow
try.c: /usr/bin/ld: libcrypto_aead_aegis128l.a(encrypt.o): in function `crypto_aead_aegis128l_aesnia_timingleaks_decrypt':
try.c: encrypt.c:(.text+0x...): undefined reference to `aegis128L_dec_aut_step'
try.c: /usr/bin/ld: encrypt.c:(.text+0x...): undefined reference to `aegis128L_dec_aut_step'
try.c: collect2: error: ld returned 1 exit status

Number of similar (compiler,implementation) pairs: 1, namely:
CompilerImplementations
gcc -march=native -mtune=native -Os -fomit-frame-pointer -fwrapv -fPIC -fPIE T:aesnia

Compiler output

Implementation: T:ref
Security model: timingleaks
Compiler: clang -march=native -O2 -fomit-frame-pointer -fwrapv -Qunused-arguments -fPIC -fPIE
try.c: /usr/bin/ld: libcrypto_aead_aegis128l.a(ecrypt.o): in function `crypto_aead_aegis128l_ref_timingleaks_encrypt':
try.c: ecrypt.c:(.text+0x...): undefined reference to `aegis128L_enc_aut_step'
try.c: /usr/bin/ld: ecrypt.c:(.text+0x...): undefined reference to `aegis128L_enc_aut_step'
try.c: /usr/bin/ld: ecrypt.c:(.text+0x...): undefined reference to `aegis128L_enc_aut_step'
try.c: /usr/bin/ld: ecrypt.c:(.text+0x...): undefined reference to `aegis128L_enc_aut_step'
try.c: /usr/bin/ld: libcrypto_aead_aegis128l.a(ecrypt.o): in function `crypto_aead_aegis128l_ref_timingleaks_decrypt':
try.c: ecrypt.c:(.text+0x...): undefined reference to `aegis128L_enc_aut_step'
try.c: /usr/bin/ld: libcrypto_aead_aegis128l.a(ecrypt.o):ecrypt.c:(.text+0x...): more undefined references to `aegis128L_enc_aut_step' follow
try.c: /usr/bin/ld: libcrypto_aead_aegis128l.a(ecrypt.o): in function `crypto_aead_aegis128l_ref_timingleaks_decrypt':
try.c: ecrypt.c:(.text+0x...): undefined reference to `aegis128L_dec_aut_step'
try.c: /usr/bin/ld: ecrypt.c:(.text+0x...): undefined reference to `aegis128L_dec_aut_step'
try.c: clang: error: linker command failed with exit code 1 (use -v to see invocation)

Number of similar (compiler,implementation) pairs: 5, namely:
CompilerImplementations
clang -march=native -O2 -fomit-frame-pointer -fwrapv -Qunused-arguments -fPIC -fPIE T:ref
clang -march=native -O3 -fomit-frame-pointer -fwrapv -Qunused-arguments -fPIC -fPIE T:ref
clang -march=native -O -fomit-frame-pointer -fwrapv -Qunused-arguments -fPIC -fPIE T:ref
clang -march=native -Os -fomit-frame-pointer -fwrapv -Qunused-arguments -fPIC -fPIE T:ref
clang -mcpu=native -O3 -fomit-frame-pointer -fwrapv -Qunused-arguments -fPIC -fPIE T:ref

Compiler output

Implementation: T:ref
Security model: timingleaks
Compiler: gcc -march=native -mtune=native -O2 -fomit-frame-pointer -fwrapv -fPIC -fPIE
try.c: /usr/bin/ld: libcrypto_aead_aegis128l.a(ecrypt.o): in function `crypto_aead_aegis128l_ref_timingleaks_encrypt':
try.c: ecrypt.c:(.text+0x...): undefined reference to `aegis128L_enc_aut_step'
try.c: /usr/bin/ld: ecrypt.c:(.text+0x...): undefined reference to `aegis128L_enc_aut_step'
try.c: /usr/bin/ld: ecrypt.c:(.text+0x...): undefined reference to `aegis128L_enc_aut_step'
try.c: /usr/bin/ld: ecrypt.c:(.text+0x...): undefined reference to `aegis128L_enc_aut_step'
try.c: /usr/bin/ld: libcrypto_aead_aegis128l.a(ecrypt.o): in function `crypto_aead_aegis128l_ref_timingleaks_decrypt':
try.c: ecrypt.c:(.text+0x...): undefined reference to `aegis128L_enc_aut_step'
try.c: /usr/bin/ld: ecrypt.c:(.text+0x...): undefined reference to `aegis128L_dec_aut_step'
try.c: /usr/bin/ld: ecrypt.c:(.text+0x...): undefined reference to `aegis128L_enc_aut_step'
try.c: /usr/bin/ld: ecrypt.c:(.text+0x...): undefined reference to `aegis128L_dec_aut_step'
try.c: collect2: error: ld returned 1 exit status

Number of similar (compiler,implementation) pairs: 2, namely:
CompilerImplementations
gcc -march=native -mtune=native -O2 -fomit-frame-pointer -fwrapv -fPIC -fPIE T:ref
gcc -march=native -mtune=native -O -fomit-frame-pointer -fwrapv -fPIC -fPIE T:ref

Compiler output

Implementation: T:ref
Security model: timingleaks
Compiler: gcc -march=native -mtune=native -Os -fomit-frame-pointer -fwrapv -fPIC -fPIE
try.c: /usr/bin/ld: libcrypto_aead_aegis128l.a(ecrypt.o): in function `crypto_aead_aegis128l_ref_timingleaks_encrypt':
try.c: ecrypt.c:(.text+0x...): undefined reference to `aegis128L_enc_aut_step'
try.c: /usr/bin/ld: ecrypt.c:(.text+0x...): undefined reference to `aegis128L_enc_aut_step'
try.c: /usr/bin/ld: ecrypt.c:(.text+0x...): undefined reference to `aegis128L_enc_aut_step'
try.c: /usr/bin/ld: ecrypt.c:(.text+0x...): undefined reference to `aegis128L_enc_aut_step'
try.c: /usr/bin/ld: libcrypto_aead_aegis128l.a(ecrypt.o): in function `crypto_aead_aegis128l_ref_timingleaks_decrypt':
try.c: ecrypt.c:(.text+0x...): undefined reference to `aegis128L_enc_aut_step'
try.c: /usr/bin/ld: libcrypto_aead_aegis128l.a(ecrypt.o):ecrypt.c:(.text+0x...): more undefined references to `aegis128L_enc_aut_step' follow
try.c: /usr/bin/ld: libcrypto_aead_aegis128l.a(ecrypt.o): in function `crypto_aead_aegis128l_ref_timingleaks_decrypt':
try.c: ecrypt.c:(.text+0x...): undefined reference to `aegis128L_dec_aut_step'
try.c: /usr/bin/ld: ecrypt.c:(.text+0x...): undefined reference to `aegis128L_dec_aut_step'
try.c: collect2: error: ld returned 1 exit status

Number of similar (compiler,implementation) pairs: 1, namely:
CompilerImplementations
gcc -march=native -mtune=native -Os -fomit-frame-pointer -fwrapv -fPIC -fPIE T:ref