Implementation notes: amd64, renoir, crypto_kem/titaniumccastd

Computer: renoir
Microarchitecture: amd64; Zen 2 (860f01)
Architecture: amd64
CPU ID: AuthenticAMD-00860f01-178bfbff
SUPERCOP version: 20240625
Operation: crypto_kem
Primitive: titaniumccastd
TimeObject sizeTest sizeImplementationCompilerBenchmark dateSUPERCOP version
254735085256 0 64244904 788 1816T:avx2gcc_-march=native_-mtune=native_-O2_-fwrapv_-fPIC_-fPIE_-gdwarf-4_-Wall2024062920240625
254798588084 0 64249312 788 1816T:avx2gcc_-march=native_-mtune=native_-O3_-fwrapv_-fPIC_-fPIE_-gdwarf-4_-Wall2024062920240625
261587484975 0 64244136 788 1816T:avx2gcc_-march=native_-mtune=native_-O_-fwrapv_-fPIC_-fPIE_-gdwarf-4_-Wall2024062920240625
337033182845 0 36243728 820 1752T:optclang_-march=native_-O3_-fwrapv_-Qunused-arguments_-fPIC_-fPIE_-gdwarf-4_-Wall2024062920240625
338058473803 0 36234512 820 1752T:optclang_-march=native_-O2_-fwrapv_-Qunused-arguments_-fPIC_-fPIE_-gdwarf-4_-Wall2024062920240625
362670851338 0 36210022 812 1752T:optclang_-march=native_-Os_-fwrapv_-Qunused-arguments_-fPIC_-fPIE_-gdwarf-4_-Wall2024062920240625
383435381887 0 64242904 788 1816T:optgcc_-march=native_-mtune=native_-O3_-fwrapv_-fPIC_-fPIE_-gdwarf-4_-Wall2024062920240625
394742465903 0 36227208 820 1752T:optclang_-mcpu=native_-O3_-fwrapv_-Qunused-arguments_-fPIC_-fPIE_-gdwarf-4_-Wall2024062920240625
402744750006 0 64209384 788 1816T:optgcc_-march=native_-mtune=native_-O_-fwrapv_-fPIC_-fPIE_-gdwarf-4_-Wall2024062920240625
404449850203 0 64210088 788 1816T:optgcc_-march=native_-mtune=native_-O2_-fwrapv_-fPIC_-fPIE_-gdwarf-4_-Wall2024062920240625
36452447852391 0 36213616 820 1752T:refclang_-mcpu=native_-O3_-fwrapv_-Qunused-arguments_-fPIC_-fPIE_-gdwarf-4_-Wall2024062920240625
36573019275136 0 36236160 820 1752T:refclang_-march=native_-O3_-fwrapv_-Qunused-arguments_-fPIC_-fPIE_-gdwarf-4_-Wall2024062920240625
36741481542645 0 36203528 820 1752T:refclang_-march=native_-O2_-fwrapv_-Qunused-arguments_-fPIC_-fPIE_-gdwarf-4_-Wall2024062920240625
36888760232984 0 36191606 812 1752T:refclang_-march=native_-Os_-fwrapv_-Qunused-arguments_-fPIC_-fPIE_-gdwarf-4_-Wall2024062920240625
36891631132762 0 36191726 812 1752T:refclang_-march=native_-O_-fwrapv_-Qunused-arguments_-fPIC_-fPIE_-gdwarf-4_-Wall2024062920240625
37081768332607 0 64191872 788 1816T:refgcc_-march=native_-mtune=native_-O_-fwrapv_-fPIC_-fPIE_-gdwarf-4_-Wall2024062920240625
37304369153290 0 64214320 788 1816T:refgcc_-march=native_-mtune=native_-O3_-fwrapv_-fPIC_-fPIE_-gdwarf-4_-Wall2024062920240625
37636642532527 0 64192288 788 1816T:refgcc_-march=native_-mtune=native_-O2_-fwrapv_-fPIC_-fPIE_-gdwarf-4_-Wall2024062920240625
93199096131244 0 64189376 780 1784T:refgcc_-march=native_-mtune=native_-Os_-fwrapv_-fPIC_-fPIE_-gdwarf-4_-Wall2024062920240625

Compiler output


encrypt.c: In file included from encrypt.c:18:
encrypt.c: In file included from /usr/lib/llvm-11/lib/clang/11.0.1/include/x86intrin.h:13:
encrypt.c: /usr/lib/llvm-11/lib/clang/11.0.1/include/ia32intrin.h:210:16: error: expected identifier or '('
encrypt.c:   unsigned int D;
encrypt.c:                ^
encrypt.c: ./param.h:28:11: note: expanded from macro 'D'
encrypt.c: #define D 256
encrypt.c:           ^
encrypt.c: In file included from encrypt.c:18:
encrypt.c: In file included from /usr/lib/llvm-11/lib/clang/11.0.1/include/x86intrin.h:13:
encrypt.c: /usr/lib/llvm-11/lib/clang/11.0.1/include/ia32intrin.h:211:20: error: cannot take the address of an rvalue of type 'int'
encrypt.c:   __builtin_memcpy(&D, &__A, sizeof(__A));
encrypt.c:                    ^~
encrypt.c: /usr/lib/llvm-11/lib/clang/11.0.1/include/ia32intrin.h:227:22: error: expected identifier or '('
encrypt.c:   unsigned long long D;
encrypt.c:                      ^
encrypt.c: ./param.h:28:11: note: expanded from macro 'D'
encrypt.c: #define D 256
encrypt.c:           ^
encrypt.c: In file included from encrypt.c:18:
encrypt.c: In file included from /usr/lib/llvm-11/lib/clang/11.0.1/include/x86intrin.h:13:
encrypt.c: /usr/lib/llvm-11/lib/clang/11.0.1/include/ia32intrin.h:228:20: error: cannot take the address of an rvalue of type 'int'
encrypt.c:   __builtin_memcpy(&D, &__A, sizeof(__A));
encrypt.c:                    ^~
encrypt.c: /usr/lib/llvm-11/lib/clang/11.0.1/include/ia32intrin.h:244:9: error: expected identifier or '('
encrypt.c: ...

Number of similar (implementation,compiler) pairs: 5, namely:
ImplementationCompiler
T:avx2clang -march=native -O2 -fwrapv -Qunused-arguments -fPIC -fPIE -gdwarf-4 -Wall (Debian_Clang_11.0.1)
T:avx2clang -march=native -O3 -fwrapv -Qunused-arguments -fPIC -fPIE -gdwarf-4 -Wall (Debian_Clang_11.0.1)
T:avx2clang -march=native -O -fwrapv -Qunused-arguments -fPIC -fPIE -gdwarf-4 -Wall (Debian_Clang_11.0.1)
T:avx2clang -march=native -Os -fwrapv -Qunused-arguments -fPIC -fPIE -gdwarf-4 -Wall (Debian_Clang_11.0.1)
T:avx2clang -mcpu=native -O3 -fwrapv -Qunused-arguments -fPIC -fPIE -gdwarf-4 -Wall (Debian_Clang_11.0.1)

Compiler output


try.c: /usr/bin/ld: libcrypto_kem_titaniumccastd.a(sampler.o): in function `sampler_zq':
try.c: .../supercop-data/renoir/amd64/try/c/gcc_-march=native_-mtune=native_-Os_-fwrapv_-fPIC_-fPIE_-gdwarf-4_-Wall/timingleaks/crypto_kem/titaniumccastd/avx2/work/sampler.c:160: undefined reference to `barrett_zq'
try.c: collect2: error: ld returned 1 exit status

Number of similar (implementation,compiler) pairs: 1, namely:
ImplementationCompiler
T:avx2gcc -march=native -mtune=native -Os -fwrapv -fPIC -fPIE -gdwarf-4 -Wall (10.2.1_20210110)

Compiler output


try.c: /usr/bin/ld: libcrypto_kem_titaniumccastd.a(encrypt.o): in function `crypto_encrypt_keypair':
try.c: .../supercop-data/renoir/amd64/try/c/clang_-march=native_-O_-fwrapv_-Qunused-arguments_-fPIC_-fPIE_-gdwarf-4_-Wall/timingleaks/crypto_kem/titaniumccastd/opt/work/encrypt.c:59: undefined reference to `barrett_4q2'
try.c: /usr/bin/ld: .../supercop-data/renoir/amd64/try/c/clang_-march=native_-O_-fwrapv_-Qunused-arguments_-fPIC_-fPIE_-gdwarf-4_-Wall/timingleaks/crypto_kem/titaniumccastd/opt/work/encrypt.c:67: undefined reference to `barrett_4q'
try.c: /usr/bin/ld: libcrypto_kem_titaniumccastd.a(encrypt.o): in function `crypto_encrypt':
try.c: .../supercop-data/renoir/amd64/try/c/clang_-march=native_-O_-fwrapv_-Qunused-arguments_-fPIC_-fPIE_-gdwarf-4_-Wall/timingleaks/crypto_kem/titaniumccastd/opt/work/encrypt.c:140: undefined reference to `barrett_4q2'
try.c: /usr/bin/ld: .../supercop-data/renoir/amd64/try/c/clang_-march=native_-O_-fwrapv_-Qunused-arguments_-fPIC_-fPIE_-gdwarf-4_-Wall/timingleaks/crypto_kem/titaniumccastd/opt/work/encrypt.c:150: undefined reference to `barrett_4q2'
try.c: /usr/bin/ld: libcrypto_kem_titaniumccastd.a(encrypt.o): in function `crypto_encrypt_open':
try.c: .../supercop-data/renoir/amd64/try/c/clang_-march=native_-O_-fwrapv_-Qunused-arguments_-fPIC_-fPIE_-gdwarf-4_-Wall/timingleaks/crypto_kem/titaniumccastd/opt/work/encrypt.c:194: undefined reference to `barrett_4q2'
try.c: /usr/bin/ld: libcrypto_kem_titaniumccastd.a(ntt.o): in function `ntt_core':
try.c: .../supercop-data/renoir/amd64/try/c/clang_-march=native_-O_-fwrapv_-Qunused-arguments_-fPIC_-fPIE_-gdwarf-4_-Wall/timingleaks/crypto_kem/titaniumccastd/opt/work/ntt.c:536: undefined reference to `barrett_2q2'
try.c: /usr/bin/ld: libcrypto_kem_titaniumccastd.a(ntt.o): in function `ntt_butterfly_1024_1792':
try.c: .../supercop-data/renoir/amd64/try/c/clang_-march=native_-O_-fwrapv_-Qunused-arguments_-fPIC_-fPIE_-gdwarf-4_-Wall/timingleaks/crypto_kem/titaniumccastd/opt/work/ntt.c:590: undefined reference to `barrett_8q'
try.c: /usr/bin/ld: libcrypto_kem_titaniumccastd.a(ntt.o): in function `intt_core':
try.c: .../supercop-data/renoir/amd64/try/c/clang_-march=native_-O_-fwrapv_-Qunused-arguments_-fPIC_-fPIE_-gdwarf-4_-Wall/timingleaks/crypto_kem/titaniumccastd/opt/work/ntt.c:564: undefined reference to `barrett_2q2'
try.c: /usr/bin/ld: .../supercop-data/renoir/amd64/try/c/clang_-march=native_-O_-fwrapv_-Qunused-arguments_-fPIC_-fPIE_-gdwarf-4_-Wall/timingleaks/crypto_kem/titaniumccastd/opt/work/ntt.c:576: undefined reference to `barrett_2q2'
try.c: /usr/bin/ld: libcrypto_kem_titaniumccastd.a(ntt.o): in function `ntt_butterfly_1792_768':
try.c: .../supercop-data/renoir/amd64/try/c/clang_-march=native_-O_-fwrapv_-Qunused-arguments_-fPIC_-fPIE_-gdwarf-4_-Wall/timingleaks/crypto_kem/titaniumccastd/opt/work/ntt.c:612: undefined reference to `barrett_16q'
try.c: /usr/bin/ld: libcrypto_kem_titaniumccastd.a(ntt.o): in function `ntt_butterfly_1024_1536':
try.c: .../supercop-data/renoir/amd64/try/c/clang_-march=native_-O_-fwrapv_-Qunused-arguments_-fPIC_-fPIE_-gdwarf-4_-Wall/timingleaks/crypto_kem/titaniumccastd/opt/work/ntt.c:632: undefined reference to `barrett_4q'
try.c: /usr/bin/ld: libcrypto_kem_titaniumccastd.a(ntt.o): in function `ntt_butterfly_1536_1536_inv':
try.c: .../supercop-data/renoir/amd64/try/c/clang_-march=native_-O_-fwrapv_-Qunused-arguments_-fPIC_-fPIE_-gdwarf-4_-Wall/timingleaks/crypto_kem/titaniumccastd/opt/work/ntt.c:646: undefined reference to `barrett_8q'
try.c: /usr/bin/ld: libcrypto_kem_titaniumccastd.a(ntt.o): in function `ntt_butterfly_768_768_inv':
try.c: .../supercop-data/renoir/amd64/try/c/clang_-march=native_-O_-fwrapv_-Qunused-arguments_-fPIC_-fPIE_-gdwarf-4_-Wall/timingleaks/crypto_kem/titaniumccastd/opt/work/ntt.c:660: undefined reference to `barrett_8q'
try.c: /usr/bin/ld: libcrypto_kem_titaniumccastd.a(ntt.o): in function `ntt_butterfly_768_256':
try.c: .../supercop-data/renoir/amd64/try/c/clang_-march=native_-O_-fwrapv_-Qunused-arguments_-fPIC_-fPIE_-gdwarf-4_-Wall/timingleaks/crypto_kem/titaniumccastd/opt/work/ntt.c:668: undefined reference to `barrett_8q'
try.c: ...

Number of similar (implementation,compiler) pairs: 1, namely:
ImplementationCompiler
T:optclang -march=native -O -fwrapv -Qunused-arguments -fPIC -fPIE -gdwarf-4 -Wall (Debian_Clang_11.0.1)

Compiler output


try.c: /usr/bin/ld: libcrypto_kem_titaniumccastd.a(encrypt.o): in function `crypto_encrypt_keypair':
try.c: .../supercop-data/renoir/amd64/try/c/gcc_-march=native_-mtune=native_-Os_-fwrapv_-fPIC_-fPIE_-gdwarf-4_-Wall/timingleaks/crypto_kem/titaniumccastd/opt/work/encrypt.c:59: undefined reference to `barrett_4q2'
try.c: /usr/bin/ld: .../supercop-data/renoir/amd64/try/c/gcc_-march=native_-mtune=native_-Os_-fwrapv_-fPIC_-fPIE_-gdwarf-4_-Wall/timingleaks/crypto_kem/titaniumccastd/opt/work/encrypt.c:67: undefined reference to `barrett_4q'
try.c: /usr/bin/ld: libcrypto_kem_titaniumccastd.a(encrypt.o): in function `crypto_encrypt':
try.c: .../supercop-data/renoir/amd64/try/c/gcc_-march=native_-mtune=native_-Os_-fwrapv_-fPIC_-fPIE_-gdwarf-4_-Wall/timingleaks/crypto_kem/titaniumccastd/opt/work/encrypt.c:140: undefined reference to `barrett_4q2'
try.c: /usr/bin/ld: .../supercop-data/renoir/amd64/try/c/gcc_-march=native_-mtune=native_-Os_-fwrapv_-fPIC_-fPIE_-gdwarf-4_-Wall/timingleaks/crypto_kem/titaniumccastd/opt/work/encrypt.c:150: undefined reference to `barrett_4q2'
try.c: /usr/bin/ld: libcrypto_kem_titaniumccastd.a(encrypt.o): in function `crypto_encrypt_open':
try.c: .../supercop-data/renoir/amd64/try/c/gcc_-march=native_-mtune=native_-Os_-fwrapv_-fPIC_-fPIE_-gdwarf-4_-Wall/timingleaks/crypto_kem/titaniumccastd/opt/work/encrypt.c:194: undefined reference to `barrett_4q2'
try.c: /usr/bin/ld: libcrypto_kem_titaniumccastd.a(ntt.o): in function `ntt_2':
try.c: .../supercop-data/renoir/amd64/try/c/gcc_-march=native_-mtune=native_-Os_-fwrapv_-fPIC_-fPIE_-gdwarf-4_-Wall/timingleaks/crypto_kem/titaniumccastd/opt/work/ntt.c:459: undefined reference to `barrett_4q'
try.c: /usr/bin/ld: .../supercop-data/renoir/amd64/try/c/gcc_-march=native_-mtune=native_-Os_-fwrapv_-fPIC_-fPIE_-gdwarf-4_-Wall/timingleaks/crypto_kem/titaniumccastd/opt/work/ntt.c:460: undefined reference to `barrett_4q'
try.c: /usr/bin/ld: .../supercop-data/renoir/amd64/try/c/gcc_-march=native_-mtune=native_-Os_-fwrapv_-fPIC_-fPIE_-gdwarf-4_-Wall/timingleaks/crypto_kem/titaniumccastd/opt/work/ntt.c:471: undefined reference to `barrett_4q'
try.c: /usr/bin/ld: .../supercop-data/renoir/amd64/try/c/gcc_-march=native_-mtune=native_-Os_-fwrapv_-fPIC_-fPIE_-gdwarf-4_-Wall/timingleaks/crypto_kem/titaniumccastd/opt/work/ntt.c:472: undefined reference to `barrett_4q2'
try.c: /usr/bin/ld: .../supercop-data/renoir/amd64/try/c/gcc_-march=native_-mtune=native_-Os_-fwrapv_-fPIC_-fPIE_-gdwarf-4_-Wall/timingleaks/crypto_kem/titaniumccastd/opt/work/ntt.c:490: undefined reference to `barrett_4q'
try.c: /usr/bin/ld: .../supercop-data/renoir/amd64/try/c/gcc_-march=native_-mtune=native_-Os_-fwrapv_-fPIC_-fPIE_-gdwarf-4_-Wall/timingleaks/crypto_kem/titaniumccastd/opt/work/ntt.c:491: undefined reference to `barrett_4q'
try.c: /usr/bin/ld: .../supercop-data/renoir/amd64/try/c/gcc_-march=native_-mtune=native_-Os_-fwrapv_-fPIC_-fPIE_-gdwarf-4_-Wall/timingleaks/crypto_kem/titaniumccastd/opt/work/ntt.c:496: undefined reference to `barrett_4q'
try.c: /usr/bin/ld: .../supercop-data/renoir/amd64/try/c/gcc_-march=native_-mtune=native_-Os_-fwrapv_-fPIC_-fPIE_-gdwarf-4_-Wall/timingleaks/crypto_kem/titaniumccastd/opt/work/ntt.c:497: undefined reference to `barrett_4q2'
try.c: /usr/bin/ld: .../supercop-data/renoir/amd64/try/c/gcc_-march=native_-mtune=native_-Os_-fwrapv_-fPIC_-fPIE_-gdwarf-4_-Wall/timingleaks/crypto_kem/titaniumccastd/opt/work/ntt.c:507: undefined reference to `barrett_4q'
try.c: /usr/bin/ld: .../supercop-data/renoir/amd64/try/c/gcc_-march=native_-mtune=native_-Os_-fwrapv_-fPIC_-fPIE_-gdwarf-4_-Wall/timingleaks/crypto_kem/titaniumccastd/opt/work/ntt.c:508: undefined reference to `barrett_4q'
try.c: /usr/bin/ld: libcrypto_kem_titaniumccastd.a(ntt.o): in function `ntt_core':
try.c: .../supercop-data/renoir/amd64/try/c/gcc_-march=native_-mtune=native_-Os_-fwrapv_-fPIC_-fPIE_-gdwarf-4_-Wall/timingleaks/crypto_kem/titaniumccastd/opt/work/ntt.c:536: undefined reference to `barrett_2q2'
try.c: /usr/bin/ld: libcrypto_kem_titaniumccastd.a(ntt.o): in function `intt_core':
try.c: .../supercop-data/renoir/amd64/try/c/gcc_-march=native_-mtune=native_-Os_-fwrapv_-fPIC_-fPIE_-gdwarf-4_-Wall/timingleaks/crypto_kem/titaniumccastd/opt/work/ntt.c:564: undefined reference to `barrett_2q2'
try.c: /usr/bin/ld: .../supercop-data/renoir/amd64/try/c/gcc_-march=native_-mtune=native_-Os_-fwrapv_-fPIC_-fPIE_-gdwarf-4_-Wall/timingleaks/crypto_kem/titaniumccastd/opt/work/ntt.c:576: undefined reference to `barrett_2q2'
try.c: /usr/bin/ld: libcrypto_kem_titaniumccastd.a(ntt.o): in function `ntt_butterfly_1024_1792':
try.c: ...

Number of similar (implementation,compiler) pairs: 1, namely:
ImplementationCompiler
T:optgcc -march=native -mtune=native -Os -fwrapv -fPIC -fPIE -gdwarf-4 -Wall (10.2.1_20210110)