Implementation notes: amd64, renoir, crypto_kem/edonk192ref

Computer: renoir
Microarchitecture: amd64; Zen 2 (860f01)
Architecture: amd64
CPU ID: AuthenticAMD-00860f01-178bfbff
SUPERCOP version: 20240625
Operation: crypto_kem
Primitive: edonk192ref

Compiler output


dec.c: dec.c:713:89: warning: for loop has empty body [-Wempty-body]
dec.c:                 for(i=0; i<(1<<(ErrorBasisDimension+1))+2; i++) Kclear(allcandidates[i]);
dec.c:                                                                                         ^
dec.c: dec.c:713:89: note: put the semicolon on a separate line to silence this warning
dec.c: dec.c:593:76: warning: for loop has empty body [-Wempty-body]
dec.c:     for(i=0; i<(1<<(ErrorBasisDimension+1))+2; i++) Kinit(allcandidates[i]);
dec.c:                                                                            ^
dec.c: dec.c:593:76: note: put the semicolon on a separate line to silence this warning
dec.c: dec.c:598:56: warning: for loop has empty body [-Wempty-body]
dec.c:     for(i=0; i<NrColumns; i++) Kinit(Ciphertext.cph[i]);
dec.c:                                                        ^
dec.c: dec.c:598:56: note: put the semicolon on a separate line to silence this warning
dec.c: 3 warnings generated.
mpfq_2_192.c: mpfq_2_192.c:154:35: warning: passing 'char *' to parameter of type 'const unsigned char *' converts between pointers to integer types with different sign [-Wpointer-sign]
mpfq_2_192.c:         int ret = mpn_set_str(zz, tmp, len, k->io_type);
mpfq_2_192.c:                                   ^~~
mpfq_2_192.c: .../supercop-data/renoir/amd64/include/gmp.h:1595:68: note: passing argument to parameter here
mpfq_2_192.c: __GMP_DECLSPEC mp_size_t mpn_set_str (mp_ptr, const unsigned char *, size_t, int);
mpfq_2_192.c:                                                                    ^
mpfq_2_192.c: 1 warning generated.
try.c: /usr/bin/ld: libcrypto_kem_edonk192ref.a(enc.o):.../supercop-data/renoir/amd64/try/c/clang_-march=native_-O2_-fwrapv_-Qunused-arguments_-fPIC_-fPIE_-gdwarf-4_-Wall/timingleaks/crypto_kem/edonk192ref/ref/work/enc.c:21: multiple definition of `K'; libcrypto_kem_edonk192ref.a(dec.o):.../supercop-data/renoir/amd64/try/c/clang_-march=native_-O2_-fwrapv_-Qunused-arguments_-fPIC_-fPIE_-gdwarf-4_-Wall/timingleaks/crypto_kem/edonk192ref/ref/work/dec.c:22: first defined here
try.c: clang: error: linker command failed with exit code 1 (use -v to see invocation)

Number of similar (implementation,compiler) pairs: 1, namely:
ImplementationCompiler
T:refclang -march=native -O2 -fwrapv -Qunused-arguments -fPIC -fPIE -gdwarf-4 -Wall (Debian_Clang_11.0.1)

Compiler output


dec.c: dec.c:713:89: warning: for loop has empty body [-Wempty-body]
dec.c:                 for(i=0; i<(1<<(ErrorBasisDimension+1))+2; i++) Kclear(allcandidates[i]);
dec.c:                                                                                         ^
dec.c: dec.c:713:89: note: put the semicolon on a separate line to silence this warning
dec.c: dec.c:593:76: warning: for loop has empty body [-Wempty-body]
dec.c:     for(i=0; i<(1<<(ErrorBasisDimension+1))+2; i++) Kinit(allcandidates[i]);
dec.c:                                                                            ^
dec.c: dec.c:593:76: note: put the semicolon on a separate line to silence this warning
dec.c: dec.c:598:56: warning: for loop has empty body [-Wempty-body]
dec.c:     for(i=0; i<NrColumns; i++) Kinit(Ciphertext.cph[i]);
dec.c:                                                        ^
dec.c: dec.c:598:56: note: put the semicolon on a separate line to silence this warning
dec.c: 3 warnings generated.
mpfq_2_192.c: mpfq_2_192.c:154:35: warning: passing 'char *' to parameter of type 'const unsigned char *' converts between pointers to integer types with different sign [-Wpointer-sign]
mpfq_2_192.c:         int ret = mpn_set_str(zz, tmp, len, k->io_type);
mpfq_2_192.c:                                   ^~~
mpfq_2_192.c: .../supercop-data/renoir/amd64/include/gmp.h:1595:68: note: passing argument to parameter here
mpfq_2_192.c: __GMP_DECLSPEC mp_size_t mpn_set_str (mp_ptr, const unsigned char *, size_t, int);
mpfq_2_192.c:                                                                    ^
mpfq_2_192.c: 1 warning generated.
try.c: /usr/bin/ld: libcrypto_kem_edonk192ref.a(enc.o):.../supercop-data/renoir/amd64/try/c/clang_-march=native_-O3_-fwrapv_-Qunused-arguments_-fPIC_-fPIE_-gdwarf-4_-Wall/timingleaks/crypto_kem/edonk192ref/ref/work/enc.c:21: multiple definition of `K'; libcrypto_kem_edonk192ref.a(dec.o):.../supercop-data/renoir/amd64/try/c/clang_-march=native_-O3_-fwrapv_-Qunused-arguments_-fPIC_-fPIE_-gdwarf-4_-Wall/timingleaks/crypto_kem/edonk192ref/ref/work/dec.c:22: first defined here
try.c: clang: error: linker command failed with exit code 1 (use -v to see invocation)

Number of similar (implementation,compiler) pairs: 1, namely:
ImplementationCompiler
T:refclang -march=native -O3 -fwrapv -Qunused-arguments -fPIC -fPIE -gdwarf-4 -Wall (Debian_Clang_11.0.1)

Compiler output


dec.c: dec.c:713:89: warning: for loop has empty body [-Wempty-body]
dec.c:                 for(i=0; i<(1<<(ErrorBasisDimension+1))+2; i++) Kclear(allcandidates[i]);
dec.c:                                                                                         ^
dec.c: dec.c:713:89: note: put the semicolon on a separate line to silence this warning
dec.c: dec.c:593:76: warning: for loop has empty body [-Wempty-body]
dec.c:     for(i=0; i<(1<<(ErrorBasisDimension+1))+2; i++) Kinit(allcandidates[i]);
dec.c:                                                                            ^
dec.c: dec.c:593:76: note: put the semicolon on a separate line to silence this warning
dec.c: dec.c:598:56: warning: for loop has empty body [-Wempty-body]
dec.c:     for(i=0; i<NrColumns; i++) Kinit(Ciphertext.cph[i]);
dec.c:                                                        ^
dec.c: dec.c:598:56: note: put the semicolon on a separate line to silence this warning
dec.c: 3 warnings generated.
mpfq_2_192.c: mpfq_2_192.c:154:35: warning: passing 'char *' to parameter of type 'const unsigned char *' converts between pointers to integer types with different sign [-Wpointer-sign]
mpfq_2_192.c:         int ret = mpn_set_str(zz, tmp, len, k->io_type);
mpfq_2_192.c:                                   ^~~
mpfq_2_192.c: .../supercop-data/renoir/amd64/include/gmp.h:1595:68: note: passing argument to parameter here
mpfq_2_192.c: __GMP_DECLSPEC mp_size_t mpn_set_str (mp_ptr, const unsigned char *, size_t, int);
mpfq_2_192.c:                                                                    ^
mpfq_2_192.c: 1 warning generated.
try.c: /usr/bin/ld: libcrypto_kem_edonk192ref.a(enc.o):.../supercop-data/renoir/amd64/try/c/clang_-march=native_-O_-fwrapv_-Qunused-arguments_-fPIC_-fPIE_-gdwarf-4_-Wall/timingleaks/crypto_kem/edonk192ref/ref/work/enc.c:21: multiple definition of `K'; libcrypto_kem_edonk192ref.a(dec.o):.../supercop-data/renoir/amd64/try/c/clang_-march=native_-O_-fwrapv_-Qunused-arguments_-fPIC_-fPIE_-gdwarf-4_-Wall/timingleaks/crypto_kem/edonk192ref/ref/work/dec.c:22: first defined here
try.c: clang: error: linker command failed with exit code 1 (use -v to see invocation)

Number of similar (implementation,compiler) pairs: 1, namely:
ImplementationCompiler
T:refclang -march=native -O -fwrapv -Qunused-arguments -fPIC -fPIE -gdwarf-4 -Wall (Debian_Clang_11.0.1)

Compiler output


dec.c: dec.c:713:89: warning: for loop has empty body [-Wempty-body]
dec.c:                 for(i=0; i<(1<<(ErrorBasisDimension+1))+2; i++) Kclear(allcandidates[i]);
dec.c:                                                                                         ^
dec.c: dec.c:713:89: note: put the semicolon on a separate line to silence this warning
dec.c: dec.c:593:76: warning: for loop has empty body [-Wempty-body]
dec.c:     for(i=0; i<(1<<(ErrorBasisDimension+1))+2; i++) Kinit(allcandidates[i]);
dec.c:                                                                            ^
dec.c: dec.c:593:76: note: put the semicolon on a separate line to silence this warning
dec.c: dec.c:598:56: warning: for loop has empty body [-Wempty-body]
dec.c:     for(i=0; i<NrColumns; i++) Kinit(Ciphertext.cph[i]);
dec.c:                                                        ^
dec.c: dec.c:598:56: note: put the semicolon on a separate line to silence this warning
dec.c: 3 warnings generated.
mpfq_2_192.c: mpfq_2_192.c:154:35: warning: passing 'char *' to parameter of type 'const unsigned char *' converts between pointers to integer types with different sign [-Wpointer-sign]
mpfq_2_192.c:         int ret = mpn_set_str(zz, tmp, len, k->io_type);
mpfq_2_192.c:                                   ^~~
mpfq_2_192.c: .../supercop-data/renoir/amd64/include/gmp.h:1595:68: note: passing argument to parameter here
mpfq_2_192.c: __GMP_DECLSPEC mp_size_t mpn_set_str (mp_ptr, const unsigned char *, size_t, int);
mpfq_2_192.c:                                                                    ^
mpfq_2_192.c: 1 warning generated.
try.c: /usr/bin/ld: libcrypto_kem_edonk192ref.a(enc.o):.../supercop-data/renoir/amd64/try/c/clang_-march=native_-Os_-fwrapv_-Qunused-arguments_-fPIC_-fPIE_-gdwarf-4_-Wall/timingleaks/crypto_kem/edonk192ref/ref/work/enc.c:21: multiple definition of `K'; libcrypto_kem_edonk192ref.a(dec.o):.../supercop-data/renoir/amd64/try/c/clang_-march=native_-Os_-fwrapv_-Qunused-arguments_-fPIC_-fPIE_-gdwarf-4_-Wall/timingleaks/crypto_kem/edonk192ref/ref/work/dec.c:22: first defined here
try.c: clang: error: linker command failed with exit code 1 (use -v to see invocation)

Number of similar (implementation,compiler) pairs: 1, namely:
ImplementationCompiler
T:refclang -march=native -Os -fwrapv -Qunused-arguments -fPIC -fPIE -gdwarf-4 -Wall (Debian_Clang_11.0.1)

Compiler output


dec.c: dec.c:713:89: warning: for loop has empty body [-Wempty-body]
dec.c:                 for(i=0; i<(1<<(ErrorBasisDimension+1))+2; i++) Kclear(allcandidates[i]);
dec.c:                                                                                         ^
dec.c: dec.c:713:89: note: put the semicolon on a separate line to silence this warning
dec.c: dec.c:593:76: warning: for loop has empty body [-Wempty-body]
dec.c:     for(i=0; i<(1<<(ErrorBasisDimension+1))+2; i++) Kinit(allcandidates[i]);
dec.c:                                                                            ^
dec.c: dec.c:593:76: note: put the semicolon on a separate line to silence this warning
dec.c: dec.c:598:56: warning: for loop has empty body [-Wempty-body]
dec.c:     for(i=0; i<NrColumns; i++) Kinit(Ciphertext.cph[i]);
dec.c:                                                        ^
dec.c: dec.c:598:56: note: put the semicolon on a separate line to silence this warning
dec.c: 3 warnings generated.
mpfq_2_192.c: mpfq_2_192.c:154:35: warning: passing 'char *' to parameter of type 'const unsigned char *' converts between pointers to integer types with different sign [-Wpointer-sign]
mpfq_2_192.c:         int ret = mpn_set_str(zz, tmp, len, k->io_type);
mpfq_2_192.c:                                   ^~~
mpfq_2_192.c: .../supercop-data/renoir/amd64/include/gmp.h:1595:68: note: passing argument to parameter here
mpfq_2_192.c: __GMP_DECLSPEC mp_size_t mpn_set_str (mp_ptr, const unsigned char *, size_t, int);
mpfq_2_192.c:                                                                    ^
mpfq_2_192.c: 1 warning generated.
try.c: /usr/bin/ld: libcrypto_kem_edonk192ref.a(enc.o):.../supercop-data/renoir/amd64/try/c/clang_-mcpu=native_-O3_-fwrapv_-Qunused-arguments_-fPIC_-fPIE_-gdwarf-4_-Wall/timingleaks/crypto_kem/edonk192ref/ref/work/enc.c:21: multiple definition of `K'; libcrypto_kem_edonk192ref.a(dec.o):.../supercop-data/renoir/amd64/try/c/clang_-mcpu=native_-O3_-fwrapv_-Qunused-arguments_-fPIC_-fPIE_-gdwarf-4_-Wall/timingleaks/crypto_kem/edonk192ref/ref/work/dec.c:22: first defined here
try.c: clang: error: linker command failed with exit code 1 (use -v to see invocation)

Number of similar (implementation,compiler) pairs: 1, namely:
ImplementationCompiler
T:refclang -mcpu=native -O3 -fwrapv -Qunused-arguments -fPIC -fPIE -gdwarf-4 -Wall (Debian_Clang_11.0.1)

Compiler output


mpfq_2_192.c: mpfq_2_192.c: In function 'mpfq_2_192_sscan':
mpfq_2_192.c: mpfq_2_192.c:154:35: warning: pointer targets in passing argument 2 of '__gmpn_set_str' differ in signedness [-Wpointer-sign]
mpfq_2_192.c:   154 |         int ret = mpn_set_str(zz, tmp, len, k->io_type);
mpfq_2_192.c:       |                                   ^~~
mpfq_2_192.c:       |                                   |
mpfq_2_192.c:       |                                   char *
mpfq_2_192.c: In file included from mpfq.h:6,
mpfq_2_192.c:                  from mpfq_2_192.h:6,
mpfq_2_192.c:                  from mpfq_2_192.c:3:
mpfq_2_192.c: .../supercop-data/renoir/amd64/include/gmp.h:1595:47: note: expected 'const unsigned char *' but argument is of type 'char *'
mpfq_2_192.c:  1595 | __GMP_DECLSPEC mp_size_t mpn_set_str (mp_ptr, const unsigned char *, size_t, int);
mpfq_2_192.c:       |                                               ^~~~~~~~~~~~~~~~~~~~~
try.c: /usr/bin/ld: libcrypto_kem_edonk192ref.a(enc.o):.../supercop-data/renoir/amd64/try/c/gcc_-march=native_-mtune=native_-O2_-fwrapv_-fPIC_-fPIE_-gdwarf-4_-Wall/timingleaks/crypto_kem/edonk192ref/ref/work/enc.c:21: multiple definition of `K'; libcrypto_kem_edonk192ref.a(dec.o):.../supercop-data/renoir/amd64/try/c/gcc_-march=native_-mtune=native_-O2_-fwrapv_-fPIC_-fPIE_-gdwarf-4_-Wall/timingleaks/crypto_kem/edonk192ref/ref/work/dec.c:22: first defined here
try.c: collect2: error: ld returned 1 exit status

Number of similar (implementation,compiler) pairs: 1, namely:
ImplementationCompiler
T:refgcc -march=native -mtune=native -O2 -fwrapv -fPIC -fPIE -gdwarf-4 -Wall (10.2.1_20210110)

Compiler output


mpfq_2_192.c: mpfq_2_192.c: In function 'mpfq_2_192_sscan':
mpfq_2_192.c: mpfq_2_192.c:154:35: warning: pointer targets in passing argument 2 of '__gmpn_set_str' differ in signedness [-Wpointer-sign]
mpfq_2_192.c:   154 |         int ret = mpn_set_str(zz, tmp, len, k->io_type);
mpfq_2_192.c:       |                                   ^~~
mpfq_2_192.c:       |                                   |
mpfq_2_192.c:       |                                   char *
mpfq_2_192.c: In file included from mpfq.h:6,
mpfq_2_192.c:                  from mpfq_2_192.h:6,
mpfq_2_192.c:                  from mpfq_2_192.c:3:
mpfq_2_192.c: .../supercop-data/renoir/amd64/include/gmp.h:1595:47: note: expected 'const unsigned char *' but argument is of type 'char *'
mpfq_2_192.c:  1595 | __GMP_DECLSPEC mp_size_t mpn_set_str (mp_ptr, const unsigned char *, size_t, int);
mpfq_2_192.c:       |                                               ^~~~~~~~~~~~~~~~~~~~~
try.c: /usr/bin/ld: libcrypto_kem_edonk192ref.a(enc.o):.../supercop-data/renoir/amd64/try/c/gcc_-march=native_-mtune=native_-O3_-fwrapv_-fPIC_-fPIE_-gdwarf-4_-Wall/timingleaks/crypto_kem/edonk192ref/ref/work/enc.c:21: multiple definition of `K'; libcrypto_kem_edonk192ref.a(dec.o):.../supercop-data/renoir/amd64/try/c/gcc_-march=native_-mtune=native_-O3_-fwrapv_-fPIC_-fPIE_-gdwarf-4_-Wall/timingleaks/crypto_kem/edonk192ref/ref/work/dec.c:22: first defined here
try.c: collect2: error: ld returned 1 exit status

Number of similar (implementation,compiler) pairs: 1, namely:
ImplementationCompiler
T:refgcc -march=native -mtune=native -O3 -fwrapv -fPIC -fPIE -gdwarf-4 -Wall (10.2.1_20210110)

Compiler output


mpfq_2_192.c: mpfq_2_192.c: In function 'mpfq_2_192_sscan':
mpfq_2_192.c: mpfq_2_192.c:154:35: warning: pointer targets in passing argument 2 of '__gmpn_set_str' differ in signedness [-Wpointer-sign]
mpfq_2_192.c:   154 |         int ret = mpn_set_str(zz, tmp, len, k->io_type);
mpfq_2_192.c:       |                                   ^~~
mpfq_2_192.c:       |                                   |
mpfq_2_192.c:       |                                   char *
mpfq_2_192.c: In file included from mpfq.h:6,
mpfq_2_192.c:                  from mpfq_2_192.h:6,
mpfq_2_192.c:                  from mpfq_2_192.c:3:
mpfq_2_192.c: .../supercop-data/renoir/amd64/include/gmp.h:1595:47: note: expected 'const unsigned char *' but argument is of type 'char *'
mpfq_2_192.c:  1595 | __GMP_DECLSPEC mp_size_t mpn_set_str (mp_ptr, const unsigned char *, size_t, int);
mpfq_2_192.c:       |                                               ^~~~~~~~~~~~~~~~~~~~~
try.c: /usr/bin/ld: libcrypto_kem_edonk192ref.a(enc.o):.../supercop-data/renoir/amd64/try/c/gcc_-march=native_-mtune=native_-O_-fwrapv_-fPIC_-fPIE_-gdwarf-4_-Wall/timingleaks/crypto_kem/edonk192ref/ref/work/enc.c:21: multiple definition of `K'; libcrypto_kem_edonk192ref.a(dec.o):.../supercop-data/renoir/amd64/try/c/gcc_-march=native_-mtune=native_-O_-fwrapv_-fPIC_-fPIE_-gdwarf-4_-Wall/timingleaks/crypto_kem/edonk192ref/ref/work/dec.c:22: first defined here
try.c: collect2: error: ld returned 1 exit status

Number of similar (implementation,compiler) pairs: 1, namely:
ImplementationCompiler
T:refgcc -march=native -mtune=native -O -fwrapv -fPIC -fPIE -gdwarf-4 -Wall (10.2.1_20210110)

Compiler output


mpfq_2_192.c: mpfq_2_192.c: In function 'mpfq_2_192_sscan':
mpfq_2_192.c: mpfq_2_192.c:154:35: warning: pointer targets in passing argument 2 of '__gmpn_set_str' differ in signedness [-Wpointer-sign]
mpfq_2_192.c:   154 |         int ret = mpn_set_str(zz, tmp, len, k->io_type);
mpfq_2_192.c:       |                                   ^~~
mpfq_2_192.c:       |                                   |
mpfq_2_192.c:       |                                   char *
mpfq_2_192.c: In file included from mpfq.h:6,
mpfq_2_192.c:                  from mpfq_2_192.h:6,
mpfq_2_192.c:                  from mpfq_2_192.c:3:
mpfq_2_192.c: .../supercop-data/renoir/amd64/include/gmp.h:1595:47: note: expected 'const unsigned char *' but argument is of type 'char *'
mpfq_2_192.c:  1595 | __GMP_DECLSPEC mp_size_t mpn_set_str (mp_ptr, const unsigned char *, size_t, int);
mpfq_2_192.c:       |                                               ^~~~~~~~~~~~~~~~~~~~~
try.c: /usr/bin/ld: libcrypto_kem_edonk192ref.a(enc.o):.../supercop-data/renoir/amd64/try/c/gcc_-march=native_-mtune=native_-Os_-fwrapv_-fPIC_-fPIE_-gdwarf-4_-Wall/timingleaks/crypto_kem/edonk192ref/ref/work/enc.c:21: multiple definition of `K'; libcrypto_kem_edonk192ref.a(dec.o):.../supercop-data/renoir/amd64/try/c/gcc_-march=native_-mtune=native_-Os_-fwrapv_-fPIC_-fPIE_-gdwarf-4_-Wall/timingleaks/crypto_kem/edonk192ref/ref/work/dec.c:22: first defined here
try.c: collect2: error: ld returned 1 exit status

Number of similar (implementation,compiler) pairs: 1, namely:
ImplementationCompiler
T:refgcc -march=native -mtune=native -Os -fwrapv -fPIC -fPIE -gdwarf-4 -Wall (10.2.1_20210110)