Implementation notes: amd64, renoir, crypto_aead/omdsha256k128n96tau96v1

Computer: renoir
Microarchitecture: amd64; Zen 2 (860f01)
Architecture: amd64
CPU ID: AuthenticAMD-00860f01-178bfbff
SUPERCOP version: 20240625
Operation: crypto_aead
Primitive: omdsha256k128n96tau96v1
TimeObject sizeTest sizeImplementationCompilerBenchmark dateSUPERCOP version
14654716843 0 039688 780 1080T:refgcc_-march=native_-mtune=native_-O3_-fwrapv_-fPIC_-fPIE_-gdwarf-4_-Wall2024062620240625
1715757946 0 030080 812 1048T:refclang_-march=native_-O3_-fwrapv_-Qunused-arguments_-fPIC_-fPIE_-gdwarf-4_-Wall2024062620240625
1726726216 0 028272 812 1048T:refclang_-march=native_-O2_-fwrapv_-Qunused-arguments_-fPIC_-fPIE_-gdwarf-4_-Wall2024062620240625
1755766473 0 027672 780 1080T:refgcc_-march=native_-mtune=native_-O2_-fwrapv_-fPIC_-fPIE_-gdwarf-4_-Wall2024062620240625
1760388710 0 031128 812 1016T:refclang_-mcpu=native_-O3_-fwrapv_-Qunused-arguments_-fPIC_-fPIE_-gdwarf-4_-Wall2024062620240625
1776204417 0 024262 804 1016T:refclang_-march=native_-O_-fwrapv_-Qunused-arguments_-fPIC_-fPIE_-gdwarf-4_-Wall2024062620240625
1859924641 0 024302 804 1016T:refclang_-march=native_-Os_-fwrapv_-Qunused-arguments_-fPIC_-fPIE_-gdwarf-4_-Wall2024062620240625
1874285901 0 026359 772 1080T:refgcc_-march=native_-mtune=native_-O_-fwrapv_-fPIC_-fPIE_-gdwarf-4_-Wall2024062620240625
1955704146 0 023059 756 1048T:refgcc_-march=native_-mtune=native_-Os_-fwrapv_-fPIC_-fPIE_-gdwarf-4_-Wall2024062620240625

Compiler output


try.c: /usr/bin/ld: libcrypto_aead_omdsha256k128n96tau96v1.a(omdsha256.o):.../supercop-data/renoir/amd64/try/c/clang_-march=native_-O2_-fwrapv_-Qunused-arguments_-fPIC_-fPIE_-gdwarf-4_-Wall/timingleaks/crypto_aead/omdsha256k128n96tau96v1/avx1/work/./omdsha256.h:137: multiple definition of `Hash'; libcrypto_aead_omdsha256k128n96tau96v1.a(encrypt.o):.../supercop-data/renoir/amd64/try/c/clang_-march=native_-O2_-fwrapv_-Qunused-arguments_-fPIC_-fPIE_-gdwarf-4_-Wall/timingleaks/crypto_aead/omdsha256k128n96tau96v1/avx1/work/./omdsha256.h:137: first defined here
try.c: clang: error: linker command failed with exit code 1 (use -v to see invocation)

Number of similar (implementation,compiler) pairs: 1, namely:
ImplementationCompiler
T:avx1clang -march=native -O2 -fwrapv -Qunused-arguments -fPIC -fPIE -gdwarf-4 -Wall (Debian_Clang_11.0.1)

Compiler output


try.c: /usr/bin/ld: libcrypto_aead_omdsha256k128n96tau96v1.a(omdsha256.o):.../supercop-data/renoir/amd64/try/c/clang_-march=native_-O3_-fwrapv_-Qunused-arguments_-fPIC_-fPIE_-gdwarf-4_-Wall/timingleaks/crypto_aead/omdsha256k128n96tau96v1/avx1/work/./omdsha256.h:137: multiple definition of `Hash'; libcrypto_aead_omdsha256k128n96tau96v1.a(encrypt.o):.../supercop-data/renoir/amd64/try/c/clang_-march=native_-O3_-fwrapv_-Qunused-arguments_-fPIC_-fPIE_-gdwarf-4_-Wall/timingleaks/crypto_aead/omdsha256k128n96tau96v1/avx1/work/./omdsha256.h:137: first defined here
try.c: clang: error: linker command failed with exit code 1 (use -v to see invocation)

Number of similar (implementation,compiler) pairs: 1, namely:
ImplementationCompiler
T:avx1clang -march=native -O3 -fwrapv -Qunused-arguments -fPIC -fPIE -gdwarf-4 -Wall (Debian_Clang_11.0.1)

Compiler output


try.c: /usr/bin/ld: libcrypto_aead_omdsha256k128n96tau96v1.a(omdsha256.o):.../supercop-data/renoir/amd64/try/c/clang_-march=native_-O_-fwrapv_-Qunused-arguments_-fPIC_-fPIE_-gdwarf-4_-Wall/timingleaks/crypto_aead/omdsha256k128n96tau96v1/avx1/work/./omdsha256.h:137: multiple definition of `Hash'; libcrypto_aead_omdsha256k128n96tau96v1.a(encrypt.o):.../supercop-data/renoir/amd64/try/c/clang_-march=native_-O_-fwrapv_-Qunused-arguments_-fPIC_-fPIE_-gdwarf-4_-Wall/timingleaks/crypto_aead/omdsha256k128n96tau96v1/avx1/work/./omdsha256.h:137: first defined here
try.c: clang: error: linker command failed with exit code 1 (use -v to see invocation)

Number of similar (implementation,compiler) pairs: 1, namely:
ImplementationCompiler
T:avx1clang -march=native -O -fwrapv -Qunused-arguments -fPIC -fPIE -gdwarf-4 -Wall (Debian_Clang_11.0.1)

Compiler output


try.c: /usr/bin/ld: libcrypto_aead_omdsha256k128n96tau96v1.a(omdsha256.o):.../supercop-data/renoir/amd64/try/c/clang_-march=native_-Os_-fwrapv_-Qunused-arguments_-fPIC_-fPIE_-gdwarf-4_-Wall/timingleaks/crypto_aead/omdsha256k128n96tau96v1/avx1/work/./omdsha256.h:137: multiple definition of `Hash'; libcrypto_aead_omdsha256k128n96tau96v1.a(encrypt.o):.../supercop-data/renoir/amd64/try/c/clang_-march=native_-Os_-fwrapv_-Qunused-arguments_-fPIC_-fPIE_-gdwarf-4_-Wall/timingleaks/crypto_aead/omdsha256k128n96tau96v1/avx1/work/./omdsha256.h:137: first defined here
try.c: clang: error: linker command failed with exit code 1 (use -v to see invocation)

Number of similar (implementation,compiler) pairs: 1, namely:
ImplementationCompiler
T:avx1clang -march=native -Os -fwrapv -Qunused-arguments -fPIC -fPIE -gdwarf-4 -Wall (Debian_Clang_11.0.1)

Compiler output


try.c: /usr/bin/ld: libcrypto_aead_omdsha256k128n96tau96v1.a(omdsha256.o):.../supercop-data/renoir/amd64/try/c/clang_-mcpu=native_-O3_-fwrapv_-Qunused-arguments_-fPIC_-fPIE_-gdwarf-4_-Wall/timingleaks/crypto_aead/omdsha256k128n96tau96v1/avx1/work/./omdsha256.h:137: multiple definition of `Hash'; libcrypto_aead_omdsha256k128n96tau96v1.a(encrypt.o):.../supercop-data/renoir/amd64/try/c/clang_-mcpu=native_-O3_-fwrapv_-Qunused-arguments_-fPIC_-fPIE_-gdwarf-4_-Wall/timingleaks/crypto_aead/omdsha256k128n96tau96v1/avx1/work/./omdsha256.h:137: first defined here
try.c: clang: error: linker command failed with exit code 1 (use -v to see invocation)

Number of similar (implementation,compiler) pairs: 1, namely:
ImplementationCompiler
T:avx1clang -mcpu=native -O3 -fwrapv -Qunused-arguments -fPIC -fPIE -gdwarf-4 -Wall (Debian_Clang_11.0.1)

Compiler output


encrypt.c: /tmp/ccLJA8tv.s: Assembler messages:
encrypt.c: /tmp/ccLJA8tv.s:5268: Error: can't resolve `.data' {.data section} - `.Ltext0' {.text section}
encrypt.c: /tmp/ccLJA8tv.s:5269: Error: can't resolve `.data' {.data section} - `.Ltext0' {.text section}
encrypt.c: /tmp/ccLJA8tv.s:5272: Error: can't resolve `.data' {.data section} - `.Ltext0' {.text section}
encrypt.c: /tmp/ccLJA8tv.s:5273: Error: can't resolve `.data' {.data section} - `.Ltext0' {.text section}
encrypt.c: /tmp/ccLJA8tv.s:5289: Error: can't resolve `.data' {.data section} - `.Ltext0' {.text section}
encrypt.c: /tmp/ccLJA8tv.s:5290: Error: can't resolve `.data' {.data section} - `.Ltext0' {.text section}
encrypt.c: /tmp/ccLJA8tv.s:5293: Error: can't resolve `.data' {.data section} - `.Ltext0' {.text section}
encrypt.c: /tmp/ccLJA8tv.s:5294: Error: can't resolve `.data' {.data section} - `.Ltext0' {.text section}
encrypt.c: /tmp/ccLJA8tv.s:5297: Error: can't resolve `.data' {.data section} - `.Ltext0' {.text section}
encrypt.c: /tmp/ccLJA8tv.s:5298: Error: can't resolve `.data' {.data section} - `.Ltext0' {.text section}
encrypt.c: /tmp/ccLJA8tv.s:5312: Error: can't resolve `.data' {.data section} - `.Ltext0' {.text section}
encrypt.c: /tmp/ccLJA8tv.s:5313: Error: can't resolve `.data' {.data section} - `.Ltext0' {.text section}
encrypt.c: /tmp/ccLJA8tv.s:5316: Error: can't resolve `.data' {.data section} - `.Ltext0' {.text section}
encrypt.c: /tmp/ccLJA8tv.s:5317: Error: can't resolve `.data' {.data section} - `.Ltext0' {.text section}
encrypt.c: /tmp/ccLJA8tv.s:5333: Error: can't resolve `.data' {.data section} - `.Ltext0' {.text section}
encrypt.c: /tmp/ccLJA8tv.s:5334: Error: can't resolve `.data' {.data section} - `.Ltext0' {.text section}
encrypt.c: /tmp/ccLJA8tv.s:5337: Error: can't resolve `.data' {.data section} - `.Ltext0' {.text section}
encrypt.c: /tmp/ccLJA8tv.s:5338: Error: can't resolve `.data' {.data section} - `.Ltext0' {.text section}
encrypt.c: /tmp/ccLJA8tv.s:5341: Error: can't resolve `.data' {.data section} - `.Ltext0' {.text section}
encrypt.c: /tmp/ccLJA8tv.s:5342: Error: can't resolve `.data' {.data section} - `.Ltext0' {.text section}
encrypt.c: /tmp/ccLJA8tv.s:5360: Error: can't resolve `.data' {.data section} - `.Ltext0' {.text section}
encrypt.c: /tmp/ccLJA8tv.s:5361: Error: can't resolve `.data' {.data section} - `.Ltext0' {.text section}
encrypt.c: /tmp/ccLJA8tv.s:5364: Error: can't resolve `.data' {.data section} - `.Ltext0' {.text section}
encrypt.c: /tmp/ccLJA8tv.s:5365: Error: can't resolve `.data' {.data section} - `.Ltext0' {.text section}
encrypt.c: ...

Number of similar (implementation,compiler) pairs: 1, namely:
ImplementationCompiler
T:avx1gcc -march=native -mtune=native -O2 -fwrapv -fPIC -fPIE -gdwarf-4 -Wall (10.2.1_20210110)

Compiler output


encrypt.c: /tmp/ccdZ5Vq7.s: Assembler messages:
encrypt.c: /tmp/ccdZ5Vq7.s:5268: Error: can't resolve `.data' {.data section} - `.Ltext0' {.text section}
encrypt.c: /tmp/ccdZ5Vq7.s:5269: Error: can't resolve `.data' {.data section} - `.Ltext0' {.text section}
encrypt.c: /tmp/ccdZ5Vq7.s:5272: Error: can't resolve `.data' {.data section} - `.Ltext0' {.text section}
encrypt.c: /tmp/ccdZ5Vq7.s:5273: Error: can't resolve `.data' {.data section} - `.Ltext0' {.text section}
encrypt.c: /tmp/ccdZ5Vq7.s:5289: Error: can't resolve `.data' {.data section} - `.Ltext0' {.text section}
encrypt.c: /tmp/ccdZ5Vq7.s:5290: Error: can't resolve `.data' {.data section} - `.Ltext0' {.text section}
encrypt.c: /tmp/ccdZ5Vq7.s:5293: Error: can't resolve `.data' {.data section} - `.Ltext0' {.text section}
encrypt.c: /tmp/ccdZ5Vq7.s:5294: Error: can't resolve `.data' {.data section} - `.Ltext0' {.text section}
encrypt.c: /tmp/ccdZ5Vq7.s:5297: Error: can't resolve `.data' {.data section} - `.Ltext0' {.text section}
encrypt.c: /tmp/ccdZ5Vq7.s:5298: Error: can't resolve `.data' {.data section} - `.Ltext0' {.text section}
encrypt.c: /tmp/ccdZ5Vq7.s:5312: Error: can't resolve `.data' {.data section} - `.Ltext0' {.text section}
encrypt.c: /tmp/ccdZ5Vq7.s:5313: Error: can't resolve `.data' {.data section} - `.Ltext0' {.text section}
encrypt.c: /tmp/ccdZ5Vq7.s:5316: Error: can't resolve `.data' {.data section} - `.Ltext0' {.text section}
encrypt.c: /tmp/ccdZ5Vq7.s:5317: Error: can't resolve `.data' {.data section} - `.Ltext0' {.text section}
encrypt.c: /tmp/ccdZ5Vq7.s:5333: Error: can't resolve `.data' {.data section} - `.Ltext0' {.text section}
encrypt.c: /tmp/ccdZ5Vq7.s:5334: Error: can't resolve `.data' {.data section} - `.Ltext0' {.text section}
encrypt.c: /tmp/ccdZ5Vq7.s:5337: Error: can't resolve `.data' {.data section} - `.Ltext0' {.text section}
encrypt.c: /tmp/ccdZ5Vq7.s:5338: Error: can't resolve `.data' {.data section} - `.Ltext0' {.text section}
encrypt.c: /tmp/ccdZ5Vq7.s:5341: Error: can't resolve `.data' {.data section} - `.Ltext0' {.text section}
encrypt.c: /tmp/ccdZ5Vq7.s:5342: Error: can't resolve `.data' {.data section} - `.Ltext0' {.text section}
encrypt.c: /tmp/ccdZ5Vq7.s:5360: Error: can't resolve `.data' {.data section} - `.Ltext0' {.text section}
encrypt.c: /tmp/ccdZ5Vq7.s:5361: Error: can't resolve `.data' {.data section} - `.Ltext0' {.text section}
encrypt.c: /tmp/ccdZ5Vq7.s:5364: Error: can't resolve `.data' {.data section} - `.Ltext0' {.text section}
encrypt.c: /tmp/ccdZ5Vq7.s:5365: Error: can't resolve `.data' {.data section} - `.Ltext0' {.text section}
encrypt.c: ...

Number of similar (implementation,compiler) pairs: 1, namely:
ImplementationCompiler
T:avx1gcc -march=native -mtune=native -O3 -fwrapv -fPIC -fPIE -gdwarf-4 -Wall (10.2.1_20210110)

Compiler output


encrypt.c: /tmp/ccdO9PuF.s: Assembler messages:
encrypt.c: /tmp/ccdO9PuF.s:5261: Error: can't resolve `.data' {.data section} - `.Ltext0' {.text section}
encrypt.c: /tmp/ccdO9PuF.s:5262: Error: can't resolve `.data' {.data section} - `.Ltext0' {.text section}
encrypt.c: /tmp/ccdO9PuF.s:5265: Error: can't resolve `.data' {.data section} - `.Ltext0' {.text section}
encrypt.c: /tmp/ccdO9PuF.s:5266: Error: can't resolve `.data' {.data section} - `.Ltext0' {.text section}
encrypt.c: /tmp/ccdO9PuF.s:5282: Error: can't resolve `.data' {.data section} - `.Ltext0' {.text section}
encrypt.c: /tmp/ccdO9PuF.s:5283: Error: can't resolve `.data' {.data section} - `.Ltext0' {.text section}
encrypt.c: /tmp/ccdO9PuF.s:5286: Error: can't resolve `.data' {.data section} - `.Ltext0' {.text section}
encrypt.c: /tmp/ccdO9PuF.s:5287: Error: can't resolve `.data' {.data section} - `.Ltext0' {.text section}
encrypt.c: /tmp/ccdO9PuF.s:5290: Error: can't resolve `.data' {.data section} - `.Ltext0' {.text section}
encrypt.c: /tmp/ccdO9PuF.s:5291: Error: can't resolve `.data' {.data section} - `.Ltext0' {.text section}
encrypt.c: /tmp/ccdO9PuF.s:5305: Error: can't resolve `.data' {.data section} - `.Ltext0' {.text section}
encrypt.c: /tmp/ccdO9PuF.s:5306: Error: can't resolve `.data' {.data section} - `.Ltext0' {.text section}
encrypt.c: /tmp/ccdO9PuF.s:5309: Error: can't resolve `.data' {.data section} - `.Ltext0' {.text section}
encrypt.c: /tmp/ccdO9PuF.s:5310: Error: can't resolve `.data' {.data section} - `.Ltext0' {.text section}
encrypt.c: /tmp/ccdO9PuF.s:5326: Error: can't resolve `.data' {.data section} - `.Ltext0' {.text section}
encrypt.c: /tmp/ccdO9PuF.s:5327: Error: can't resolve `.data' {.data section} - `.Ltext0' {.text section}
encrypt.c: /tmp/ccdO9PuF.s:5330: Error: can't resolve `.data' {.data section} - `.Ltext0' {.text section}
encrypt.c: /tmp/ccdO9PuF.s:5331: Error: can't resolve `.data' {.data section} - `.Ltext0' {.text section}
encrypt.c: /tmp/ccdO9PuF.s:5334: Error: can't resolve `.data' {.data section} - `.Ltext0' {.text section}
encrypt.c: /tmp/ccdO9PuF.s:5335: Error: can't resolve `.data' {.data section} - `.Ltext0' {.text section}
encrypt.c: /tmp/ccdO9PuF.s:5353: Error: can't resolve `.data' {.data section} - `.Ltext0' {.text section}
encrypt.c: /tmp/ccdO9PuF.s:5354: Error: can't resolve `.data' {.data section} - `.Ltext0' {.text section}
encrypt.c: /tmp/ccdO9PuF.s:5357: Error: can't resolve `.data' {.data section} - `.Ltext0' {.text section}
encrypt.c: /tmp/ccdO9PuF.s:5358: Error: can't resolve `.data' {.data section} - `.Ltext0' {.text section}
encrypt.c: ...

Number of similar (implementation,compiler) pairs: 1, namely:
ImplementationCompiler
T:avx1gcc -march=native -mtune=native -O -fwrapv -fPIC -fPIE -gdwarf-4 -Wall (10.2.1_20210110)

Compiler output


encrypt.c: /tmp/ccVoLtzH.s: Assembler messages:
encrypt.c: /tmp/ccVoLtzH.s:5267: Error: can't resolve `.data' {.data section} - `.Ltext0' {.text section}
encrypt.c: /tmp/ccVoLtzH.s:5268: Error: can't resolve `.data' {.data section} - `.Ltext0' {.text section}
encrypt.c: /tmp/ccVoLtzH.s:5271: Error: can't resolve `.data' {.data section} - `.Ltext0' {.text section}
encrypt.c: /tmp/ccVoLtzH.s:5272: Error: can't resolve `.data' {.data section} - `.Ltext0' {.text section}
encrypt.c: /tmp/ccVoLtzH.s:5288: Error: can't resolve `.data' {.data section} - `.Ltext0' {.text section}
encrypt.c: /tmp/ccVoLtzH.s:5289: Error: can't resolve `.data' {.data section} - `.Ltext0' {.text section}
encrypt.c: /tmp/ccVoLtzH.s:5292: Error: can't resolve `.data' {.data section} - `.Ltext0' {.text section}
encrypt.c: /tmp/ccVoLtzH.s:5293: Error: can't resolve `.data' {.data section} - `.Ltext0' {.text section}
encrypt.c: /tmp/ccVoLtzH.s:5296: Error: can't resolve `.data' {.data section} - `.Ltext0' {.text section}
encrypt.c: /tmp/ccVoLtzH.s:5297: Error: can't resolve `.data' {.data section} - `.Ltext0' {.text section}
encrypt.c: /tmp/ccVoLtzH.s:5311: Error: can't resolve `.data' {.data section} - `.Ltext0' {.text section}
encrypt.c: /tmp/ccVoLtzH.s:5312: Error: can't resolve `.data' {.data section} - `.Ltext0' {.text section}
encrypt.c: /tmp/ccVoLtzH.s:5315: Error: can't resolve `.data' {.data section} - `.Ltext0' {.text section}
encrypt.c: /tmp/ccVoLtzH.s:5316: Error: can't resolve `.data' {.data section} - `.Ltext0' {.text section}
encrypt.c: /tmp/ccVoLtzH.s:5332: Error: can't resolve `.data' {.data section} - `.Ltext0' {.text section}
encrypt.c: /tmp/ccVoLtzH.s:5333: Error: can't resolve `.data' {.data section} - `.Ltext0' {.text section}
encrypt.c: /tmp/ccVoLtzH.s:5336: Error: can't resolve `.data' {.data section} - `.Ltext0' {.text section}
encrypt.c: /tmp/ccVoLtzH.s:5337: Error: can't resolve `.data' {.data section} - `.Ltext0' {.text section}
encrypt.c: /tmp/ccVoLtzH.s:5340: Error: can't resolve `.data' {.data section} - `.Ltext0' {.text section}
encrypt.c: /tmp/ccVoLtzH.s:5341: Error: can't resolve `.data' {.data section} - `.Ltext0' {.text section}
encrypt.c: /tmp/ccVoLtzH.s:5359: Error: can't resolve `.data' {.data section} - `.Ltext0' {.text section}
encrypt.c: /tmp/ccVoLtzH.s:5360: Error: can't resolve `.data' {.data section} - `.Ltext0' {.text section}
encrypt.c: /tmp/ccVoLtzH.s:5363: Error: can't resolve `.data' {.data section} - `.Ltext0' {.text section}
encrypt.c: /tmp/ccVoLtzH.s:5364: Error: can't resolve `.data' {.data section} - `.Ltext0' {.text section}
encrypt.c: ...

Number of similar (implementation,compiler) pairs: 1, namely:
ImplementationCompiler
T:avx1gcc -march=native -mtune=native -Os -fwrapv -fPIC -fPIE -gdwarf-4 -Wall (10.2.1_20210110)

Compiler output


try.c: /usr/bin/ld: libcrypto_aead_omdsha256k128n96tau96v1.a(omdsha256.o):.../supercop-data/renoir/amd64/try/c/clang_-march=native_-O2_-fwrapv_-Qunused-arguments_-fPIC_-fPIE_-gdwarf-4_-Wall/timingleaks/crypto_aead/omdsha256k128n96tau96v1/sse4/work/./omdsha256.h:137: multiple definition of `Hash'; libcrypto_aead_omdsha256k128n96tau96v1.a(encrypt.o):.../supercop-data/renoir/amd64/try/c/clang_-march=native_-O2_-fwrapv_-Qunused-arguments_-fPIC_-fPIE_-gdwarf-4_-Wall/timingleaks/crypto_aead/omdsha256k128n96tau96v1/sse4/work/./omdsha256.h:137: first defined here
try.c: clang: error: linker command failed with exit code 1 (use -v to see invocation)

Number of similar (implementation,compiler) pairs: 1, namely:
ImplementationCompiler
T:sse4clang -march=native -O2 -fwrapv -Qunused-arguments -fPIC -fPIE -gdwarf-4 -Wall (Debian_Clang_11.0.1)

Compiler output


try.c: /usr/bin/ld: libcrypto_aead_omdsha256k128n96tau96v1.a(omdsha256.o):.../supercop-data/renoir/amd64/try/c/clang_-march=native_-O3_-fwrapv_-Qunused-arguments_-fPIC_-fPIE_-gdwarf-4_-Wall/timingleaks/crypto_aead/omdsha256k128n96tau96v1/sse4/work/./omdsha256.h:137: multiple definition of `Hash'; libcrypto_aead_omdsha256k128n96tau96v1.a(encrypt.o):.../supercop-data/renoir/amd64/try/c/clang_-march=native_-O3_-fwrapv_-Qunused-arguments_-fPIC_-fPIE_-gdwarf-4_-Wall/timingleaks/crypto_aead/omdsha256k128n96tau96v1/sse4/work/./omdsha256.h:137: first defined here
try.c: clang: error: linker command failed with exit code 1 (use -v to see invocation)

Number of similar (implementation,compiler) pairs: 1, namely:
ImplementationCompiler
T:sse4clang -march=native -O3 -fwrapv -Qunused-arguments -fPIC -fPIE -gdwarf-4 -Wall (Debian_Clang_11.0.1)

Compiler output


try.c: /usr/bin/ld: libcrypto_aead_omdsha256k128n96tau96v1.a(omdsha256.o):.../supercop-data/renoir/amd64/try/c/clang_-march=native_-O_-fwrapv_-Qunused-arguments_-fPIC_-fPIE_-gdwarf-4_-Wall/timingleaks/crypto_aead/omdsha256k128n96tau96v1/sse4/work/./omdsha256.h:137: multiple definition of `Hash'; libcrypto_aead_omdsha256k128n96tau96v1.a(encrypt.o):.../supercop-data/renoir/amd64/try/c/clang_-march=native_-O_-fwrapv_-Qunused-arguments_-fPIC_-fPIE_-gdwarf-4_-Wall/timingleaks/crypto_aead/omdsha256k128n96tau96v1/sse4/work/./omdsha256.h:137: first defined here
try.c: clang: error: linker command failed with exit code 1 (use -v to see invocation)

Number of similar (implementation,compiler) pairs: 1, namely:
ImplementationCompiler
T:sse4clang -march=native -O -fwrapv -Qunused-arguments -fPIC -fPIE -gdwarf-4 -Wall (Debian_Clang_11.0.1)

Compiler output


try.c: /usr/bin/ld: libcrypto_aead_omdsha256k128n96tau96v1.a(omdsha256.o):.../supercop-data/renoir/amd64/try/c/clang_-march=native_-Os_-fwrapv_-Qunused-arguments_-fPIC_-fPIE_-gdwarf-4_-Wall/timingleaks/crypto_aead/omdsha256k128n96tau96v1/sse4/work/./omdsha256.h:137: multiple definition of `Hash'; libcrypto_aead_omdsha256k128n96tau96v1.a(encrypt.o):.../supercop-data/renoir/amd64/try/c/clang_-march=native_-Os_-fwrapv_-Qunused-arguments_-fPIC_-fPIE_-gdwarf-4_-Wall/timingleaks/crypto_aead/omdsha256k128n96tau96v1/sse4/work/./omdsha256.h:137: first defined here
try.c: clang: error: linker command failed with exit code 1 (use -v to see invocation)

Number of similar (implementation,compiler) pairs: 1, namely:
ImplementationCompiler
T:sse4clang -march=native -Os -fwrapv -Qunused-arguments -fPIC -fPIE -gdwarf-4 -Wall (Debian_Clang_11.0.1)

Compiler output


try.c: /usr/bin/ld: libcrypto_aead_omdsha256k128n96tau96v1.a(omdsha256.o):.../supercop-data/renoir/amd64/try/c/clang_-mcpu=native_-O3_-fwrapv_-Qunused-arguments_-fPIC_-fPIE_-gdwarf-4_-Wall/timingleaks/crypto_aead/omdsha256k128n96tau96v1/sse4/work/./omdsha256.h:137: multiple definition of `Hash'; libcrypto_aead_omdsha256k128n96tau96v1.a(encrypt.o):.../supercop-data/renoir/amd64/try/c/clang_-mcpu=native_-O3_-fwrapv_-Qunused-arguments_-fPIC_-fPIE_-gdwarf-4_-Wall/timingleaks/crypto_aead/omdsha256k128n96tau96v1/sse4/work/./omdsha256.h:137: first defined here
try.c: clang: error: linker command failed with exit code 1 (use -v to see invocation)

Number of similar (implementation,compiler) pairs: 1, namely:
ImplementationCompiler
T:sse4clang -mcpu=native -O3 -fwrapv -Qunused-arguments -fPIC -fPIE -gdwarf-4 -Wall (Debian_Clang_11.0.1)

Compiler output


encrypt.c: /tmp/ccSpiwY9.s: Assembler messages:
encrypt.c: /tmp/ccSpiwY9.s:5307: Error: can't resolve `.data' {.data section} - `.Ltext0' {.text section}
encrypt.c: /tmp/ccSpiwY9.s:5308: Error: can't resolve `.data' {.data section} - `.Ltext0' {.text section}
encrypt.c: /tmp/ccSpiwY9.s:5311: Error: can't resolve `.data' {.data section} - `.Ltext0' {.text section}
encrypt.c: /tmp/ccSpiwY9.s:5312: Error: can't resolve `.data' {.data section} - `.Ltext0' {.text section}
encrypt.c: /tmp/ccSpiwY9.s:5328: Error: can't resolve `.data' {.data section} - `.Ltext0' {.text section}
encrypt.c: /tmp/ccSpiwY9.s:5329: Error: can't resolve `.data' {.data section} - `.Ltext0' {.text section}
encrypt.c: /tmp/ccSpiwY9.s:5332: Error: can't resolve `.data' {.data section} - `.Ltext0' {.text section}
encrypt.c: /tmp/ccSpiwY9.s:5333: Error: can't resolve `.data' {.data section} - `.Ltext0' {.text section}
encrypt.c: /tmp/ccSpiwY9.s:5336: Error: can't resolve `.data' {.data section} - `.Ltext0' {.text section}
encrypt.c: /tmp/ccSpiwY9.s:5337: Error: can't resolve `.data' {.data section} - `.Ltext0' {.text section}
encrypt.c: /tmp/ccSpiwY9.s:5351: Error: can't resolve `.data' {.data section} - `.Ltext0' {.text section}
encrypt.c: /tmp/ccSpiwY9.s:5352: Error: can't resolve `.data' {.data section} - `.Ltext0' {.text section}
encrypt.c: /tmp/ccSpiwY9.s:5355: Error: can't resolve `.data' {.data section} - `.Ltext0' {.text section}
encrypt.c: /tmp/ccSpiwY9.s:5356: Error: can't resolve `.data' {.data section} - `.Ltext0' {.text section}
encrypt.c: /tmp/ccSpiwY9.s:5372: Error: can't resolve `.data' {.data section} - `.Ltext0' {.text section}
encrypt.c: /tmp/ccSpiwY9.s:5373: Error: can't resolve `.data' {.data section} - `.Ltext0' {.text section}
encrypt.c: /tmp/ccSpiwY9.s:5376: Error: can't resolve `.data' {.data section} - `.Ltext0' {.text section}
encrypt.c: /tmp/ccSpiwY9.s:5377: Error: can't resolve `.data' {.data section} - `.Ltext0' {.text section}
encrypt.c: /tmp/ccSpiwY9.s:5380: Error: can't resolve `.data' {.data section} - `.Ltext0' {.text section}
encrypt.c: /tmp/ccSpiwY9.s:5381: Error: can't resolve `.data' {.data section} - `.Ltext0' {.text section}
encrypt.c: /tmp/ccSpiwY9.s:5399: Error: can't resolve `.data' {.data section} - `.Ltext0' {.text section}
encrypt.c: /tmp/ccSpiwY9.s:5400: Error: can't resolve `.data' {.data section} - `.Ltext0' {.text section}
encrypt.c: /tmp/ccSpiwY9.s:5403: Error: can't resolve `.data' {.data section} - `.Ltext0' {.text section}
encrypt.c: /tmp/ccSpiwY9.s:5404: Error: can't resolve `.data' {.data section} - `.Ltext0' {.text section}
encrypt.c: ...

Number of similar (implementation,compiler) pairs: 1, namely:
ImplementationCompiler
T:sse4gcc -march=native -mtune=native -O2 -fwrapv -fPIC -fPIE -gdwarf-4 -Wall (10.2.1_20210110)

Compiler output


encrypt.c: /tmp/ccHlxGx5.s: Assembler messages:
encrypt.c: /tmp/ccHlxGx5.s:5307: Error: can't resolve `.data' {.data section} - `.Ltext0' {.text section}
encrypt.c: /tmp/ccHlxGx5.s:5308: Error: can't resolve `.data' {.data section} - `.Ltext0' {.text section}
encrypt.c: /tmp/ccHlxGx5.s:5311: Error: can't resolve `.data' {.data section} - `.Ltext0' {.text section}
encrypt.c: /tmp/ccHlxGx5.s:5312: Error: can't resolve `.data' {.data section} - `.Ltext0' {.text section}
encrypt.c: /tmp/ccHlxGx5.s:5328: Error: can't resolve `.data' {.data section} - `.Ltext0' {.text section}
encrypt.c: /tmp/ccHlxGx5.s:5329: Error: can't resolve `.data' {.data section} - `.Ltext0' {.text section}
encrypt.c: /tmp/ccHlxGx5.s:5332: Error: can't resolve `.data' {.data section} - `.Ltext0' {.text section}
encrypt.c: /tmp/ccHlxGx5.s:5333: Error: can't resolve `.data' {.data section} - `.Ltext0' {.text section}
encrypt.c: /tmp/ccHlxGx5.s:5336: Error: can't resolve `.data' {.data section} - `.Ltext0' {.text section}
encrypt.c: /tmp/ccHlxGx5.s:5337: Error: can't resolve `.data' {.data section} - `.Ltext0' {.text section}
encrypt.c: /tmp/ccHlxGx5.s:5351: Error: can't resolve `.data' {.data section} - `.Ltext0' {.text section}
encrypt.c: /tmp/ccHlxGx5.s:5352: Error: can't resolve `.data' {.data section} - `.Ltext0' {.text section}
encrypt.c: /tmp/ccHlxGx5.s:5355: Error: can't resolve `.data' {.data section} - `.Ltext0' {.text section}
encrypt.c: /tmp/ccHlxGx5.s:5356: Error: can't resolve `.data' {.data section} - `.Ltext0' {.text section}
encrypt.c: /tmp/ccHlxGx5.s:5372: Error: can't resolve `.data' {.data section} - `.Ltext0' {.text section}
encrypt.c: /tmp/ccHlxGx5.s:5373: Error: can't resolve `.data' {.data section} - `.Ltext0' {.text section}
encrypt.c: /tmp/ccHlxGx5.s:5376: Error: can't resolve `.data' {.data section} - `.Ltext0' {.text section}
encrypt.c: /tmp/ccHlxGx5.s:5377: Error: can't resolve `.data' {.data section} - `.Ltext0' {.text section}
encrypt.c: /tmp/ccHlxGx5.s:5380: Error: can't resolve `.data' {.data section} - `.Ltext0' {.text section}
encrypt.c: /tmp/ccHlxGx5.s:5381: Error: can't resolve `.data' {.data section} - `.Ltext0' {.text section}
encrypt.c: /tmp/ccHlxGx5.s:5399: Error: can't resolve `.data' {.data section} - `.Ltext0' {.text section}
encrypt.c: /tmp/ccHlxGx5.s:5400: Error: can't resolve `.data' {.data section} - `.Ltext0' {.text section}
encrypt.c: /tmp/ccHlxGx5.s:5403: Error: can't resolve `.data' {.data section} - `.Ltext0' {.text section}
encrypt.c: /tmp/ccHlxGx5.s:5404: Error: can't resolve `.data' {.data section} - `.Ltext0' {.text section}
encrypt.c: ...

Number of similar (implementation,compiler) pairs: 1, namely:
ImplementationCompiler
T:sse4gcc -march=native -mtune=native -O3 -fwrapv -fPIC -fPIE -gdwarf-4 -Wall (10.2.1_20210110)

Compiler output


encrypt.c: /tmp/ccSW6JId.s: Assembler messages:
encrypt.c: /tmp/ccSW6JId.s:5300: Error: can't resolve `.data' {.data section} - `.Ltext0' {.text section}
encrypt.c: /tmp/ccSW6JId.s:5301: Error: can't resolve `.data' {.data section} - `.Ltext0' {.text section}
encrypt.c: /tmp/ccSW6JId.s:5304: Error: can't resolve `.data' {.data section} - `.Ltext0' {.text section}
encrypt.c: /tmp/ccSW6JId.s:5305: Error: can't resolve `.data' {.data section} - `.Ltext0' {.text section}
encrypt.c: /tmp/ccSW6JId.s:5321: Error: can't resolve `.data' {.data section} - `.Ltext0' {.text section}
encrypt.c: /tmp/ccSW6JId.s:5322: Error: can't resolve `.data' {.data section} - `.Ltext0' {.text section}
encrypt.c: /tmp/ccSW6JId.s:5325: Error: can't resolve `.data' {.data section} - `.Ltext0' {.text section}
encrypt.c: /tmp/ccSW6JId.s:5326: Error: can't resolve `.data' {.data section} - `.Ltext0' {.text section}
encrypt.c: /tmp/ccSW6JId.s:5329: Error: can't resolve `.data' {.data section} - `.Ltext0' {.text section}
encrypt.c: /tmp/ccSW6JId.s:5330: Error: can't resolve `.data' {.data section} - `.Ltext0' {.text section}
encrypt.c: /tmp/ccSW6JId.s:5344: Error: can't resolve `.data' {.data section} - `.Ltext0' {.text section}
encrypt.c: /tmp/ccSW6JId.s:5345: Error: can't resolve `.data' {.data section} - `.Ltext0' {.text section}
encrypt.c: /tmp/ccSW6JId.s:5348: Error: can't resolve `.data' {.data section} - `.Ltext0' {.text section}
encrypt.c: /tmp/ccSW6JId.s:5349: Error: can't resolve `.data' {.data section} - `.Ltext0' {.text section}
encrypt.c: /tmp/ccSW6JId.s:5365: Error: can't resolve `.data' {.data section} - `.Ltext0' {.text section}
encrypt.c: /tmp/ccSW6JId.s:5366: Error: can't resolve `.data' {.data section} - `.Ltext0' {.text section}
encrypt.c: /tmp/ccSW6JId.s:5369: Error: can't resolve `.data' {.data section} - `.Ltext0' {.text section}
encrypt.c: /tmp/ccSW6JId.s:5370: Error: can't resolve `.data' {.data section} - `.Ltext0' {.text section}
encrypt.c: /tmp/ccSW6JId.s:5373: Error: can't resolve `.data' {.data section} - `.Ltext0' {.text section}
encrypt.c: /tmp/ccSW6JId.s:5374: Error: can't resolve `.data' {.data section} - `.Ltext0' {.text section}
encrypt.c: /tmp/ccSW6JId.s:5392: Error: can't resolve `.data' {.data section} - `.Ltext0' {.text section}
encrypt.c: /tmp/ccSW6JId.s:5393: Error: can't resolve `.data' {.data section} - `.Ltext0' {.text section}
encrypt.c: /tmp/ccSW6JId.s:5396: Error: can't resolve `.data' {.data section} - `.Ltext0' {.text section}
encrypt.c: /tmp/ccSW6JId.s:5397: Error: can't resolve `.data' {.data section} - `.Ltext0' {.text section}
encrypt.c: ...

Number of similar (implementation,compiler) pairs: 1, namely:
ImplementationCompiler
T:sse4gcc -march=native -mtune=native -O -fwrapv -fPIC -fPIE -gdwarf-4 -Wall (10.2.1_20210110)

Compiler output


encrypt.c: /tmp/ccN2xnLv.s: Assembler messages:
encrypt.c: /tmp/ccN2xnLv.s:5306: Error: can't resolve `.data' {.data section} - `.Ltext0' {.text section}
encrypt.c: /tmp/ccN2xnLv.s:5307: Error: can't resolve `.data' {.data section} - `.Ltext0' {.text section}
encrypt.c: /tmp/ccN2xnLv.s:5310: Error: can't resolve `.data' {.data section} - `.Ltext0' {.text section}
encrypt.c: /tmp/ccN2xnLv.s:5311: Error: can't resolve `.data' {.data section} - `.Ltext0' {.text section}
encrypt.c: /tmp/ccN2xnLv.s:5327: Error: can't resolve `.data' {.data section} - `.Ltext0' {.text section}
encrypt.c: /tmp/ccN2xnLv.s:5328: Error: can't resolve `.data' {.data section} - `.Ltext0' {.text section}
encrypt.c: /tmp/ccN2xnLv.s:5331: Error: can't resolve `.data' {.data section} - `.Ltext0' {.text section}
encrypt.c: /tmp/ccN2xnLv.s:5332: Error: can't resolve `.data' {.data section} - `.Ltext0' {.text section}
encrypt.c: /tmp/ccN2xnLv.s:5335: Error: can't resolve `.data' {.data section} - `.Ltext0' {.text section}
encrypt.c: /tmp/ccN2xnLv.s:5336: Error: can't resolve `.data' {.data section} - `.Ltext0' {.text section}
encrypt.c: /tmp/ccN2xnLv.s:5350: Error: can't resolve `.data' {.data section} - `.Ltext0' {.text section}
encrypt.c: /tmp/ccN2xnLv.s:5351: Error: can't resolve `.data' {.data section} - `.Ltext0' {.text section}
encrypt.c: /tmp/ccN2xnLv.s:5354: Error: can't resolve `.data' {.data section} - `.Ltext0' {.text section}
encrypt.c: /tmp/ccN2xnLv.s:5355: Error: can't resolve `.data' {.data section} - `.Ltext0' {.text section}
encrypt.c: /tmp/ccN2xnLv.s:5371: Error: can't resolve `.data' {.data section} - `.Ltext0' {.text section}
encrypt.c: /tmp/ccN2xnLv.s:5372: Error: can't resolve `.data' {.data section} - `.Ltext0' {.text section}
encrypt.c: /tmp/ccN2xnLv.s:5375: Error: can't resolve `.data' {.data section} - `.Ltext0' {.text section}
encrypt.c: /tmp/ccN2xnLv.s:5376: Error: can't resolve `.data' {.data section} - `.Ltext0' {.text section}
encrypt.c: /tmp/ccN2xnLv.s:5379: Error: can't resolve `.data' {.data section} - `.Ltext0' {.text section}
encrypt.c: /tmp/ccN2xnLv.s:5380: Error: can't resolve `.data' {.data section} - `.Ltext0' {.text section}
encrypt.c: /tmp/ccN2xnLv.s:5398: Error: can't resolve `.data' {.data section} - `.Ltext0' {.text section}
encrypt.c: /tmp/ccN2xnLv.s:5399: Error: can't resolve `.data' {.data section} - `.Ltext0' {.text section}
encrypt.c: /tmp/ccN2xnLv.s:5402: Error: can't resolve `.data' {.data section} - `.Ltext0' {.text section}
encrypt.c: /tmp/ccN2xnLv.s:5403: Error: can't resolve `.data' {.data section} - `.Ltext0' {.text section}
encrypt.c: ...

Number of similar (implementation,compiler) pairs: 1, namely:
ImplementationCompiler
T:sse4gcc -march=native -mtune=native -Os -fwrapv -fPIC -fPIE -gdwarf-4 -Wall (10.2.1_20210110)