Implementation notes: amd64, renoir, crypto_aead/morus1280256v2

Computer: renoir
Microarchitecture: amd64; Zen 2 (860f01)
Architecture: amd64
CPU ID: AuthenticAMD-00860f01-178bfbff
SUPERCOP version: 20240625
Operation: crypto_aead
Primitive: morus1280256v2
TimeObject sizeTest sizeImplementationCompilerBenchmark dateSUPERCOP version
60525955 0 022016 812 1048T:avx2clang_-march=native_-O3_-fwrapv_-Qunused-arguments_-fPIC_-fPIE_-gdwarf-4_-Wall2024062620240625
60565955 0 021872 812 1048T:avx2clang_-march=native_-O2_-fwrapv_-Qunused-arguments_-fPIC_-fPIE_-gdwarf-4_-Wall2024062620240625
60943805 0 017358 804 1016T:avx2clang_-march=native_-Os_-fwrapv_-Qunused-arguments_-fPIC_-fPIE_-gdwarf-4_-Wall2024062620240625
64386261 0 022520 780 1080T:avx2gcc_-march=native_-mtune=native_-O3_-fwrapv_-fPIC_-fPIE_-gdwarf-4_-Wall2024062620240625
64683394 0 017640 780 1080T:avx2gcc_-march=native_-mtune=native_-O_-fwrapv_-fPIC_-fPIE_-gdwarf-4_-Wall2024062620240625
65063441 0 018040 780 1080T:avx2gcc_-march=native_-mtune=native_-O2_-fwrapv_-fPIC_-fPIE_-gdwarf-4_-Wall2024062620240625
698512505 0 028832 812 1016T:sse2clang_-mcpu=native_-O3_-fwrapv_-Qunused-arguments_-fPIC_-fPIE_-gdwarf-4_-Wall2024062620240625
708710560 0 026600 812 1048T:sse2clang_-march=native_-O3_-fwrapv_-Qunused-arguments_-fPIC_-fPIE_-gdwarf-4_-Wall2024062620240625
710410560 0 026472 812 1048T:sse2clang_-march=native_-O2_-fwrapv_-Qunused-arguments_-fPIC_-fPIE_-gdwarf-4_-Wall2024062620240625
114476836 0 023096 780 1080T:sse2gcc_-march=native_-mtune=native_-O3_-fwrapv_-fPIC_-fPIE_-gdwarf-4_-Wall2024062620240625
1221116201 0 032480 780 1080T:ref64gcc_-march=native_-mtune=native_-O3_-fwrapv_-fPIC_-fPIE_-gdwarf-4_-Wall2024062620240625
1234512959 0 029208 780 1080T:refgcc_-march=native_-mtune=native_-O3_-fwrapv_-fPIC_-fPIE_-gdwarf-4_-Wall2024062620240625
124373303 0 017880 780 1080T:sse2gcc_-march=native_-mtune=native_-O2_-fwrapv_-fPIC_-fPIE_-gdwarf-4_-Wall2024062620240625
127823386 0 017624 780 1080T:sse2gcc_-march=native_-mtune=native_-O_-fwrapv_-fPIC_-fPIE_-gdwarf-4_-Wall2024062620240625
129883614 0 017222 804 1016T:sse2clang_-march=native_-Os_-fwrapv_-Qunused-arguments_-fPIC_-fPIE_-gdwarf-4_-Wall2024062620240625
173395598 0 020184 780 1080T:ref64gcc_-march=native_-mtune=native_-O2_-fwrapv_-fPIC_-fPIE_-gdwarf-4_-Wall2024062620240625
177815089 0 018091 756 1048T:ref64gcc_-march=native_-mtune=native_-Os_-fwrapv_-fPIC_-fPIE_-gdwarf-4_-Wall2024062620240625
178124872 0 018494 804 1016T:ref64clang_-march=native_-Os_-fwrapv_-Qunused-arguments_-fPIC_-fPIE_-gdwarf-4_-Wall2024062620240625
180245969 0 022104 812 1048T:ref64clang_-march=native_-O3_-fwrapv_-Qunused-arguments_-fPIC_-fPIE_-gdwarf-4_-Wall2024062620240625
180525969 0 021976 812 1048T:ref64clang_-march=native_-O2_-fwrapv_-Qunused-arguments_-fPIC_-fPIE_-gdwarf-4_-Wall2024062620240625
181355606 0 019767 772 1080T:ref64gcc_-march=native_-mtune=native_-O_-fwrapv_-fPIC_-fPIE_-gdwarf-4_-Wall2024062620240625
190886683 0 023096 812 1016T:ref64clang_-mcpu=native_-O3_-fwrapv_-Qunused-arguments_-fPIC_-fPIE_-gdwarf-4_-Wall2024062620240625
227505876 0 019790 804 1016T:ref64clang_-march=native_-O_-fwrapv_-Qunused-arguments_-fPIC_-fPIE_-gdwarf-4_-Wall2024062620240625

Compiler output


encrypt.c: encrypt.c:374:16: warning: unused variable 'check' [-Wunused-variable]
encrypt.c:         unsigned char check = 0;
encrypt.c:                       ^
encrypt.c: 1 warning generated.

Number of similar (implementation,compiler) pairs: 3, namely:
ImplementationCompiler
T:avx2clang -march=native -O2 -fwrapv -Qunused-arguments -fPIC -fPIE -gdwarf-4 -Wall (Debian_Clang_11.0.1)
T:avx2clang -march=native -O3 -fwrapv -Qunused-arguments -fPIC -fPIE -gdwarf-4 -Wall (Debian_Clang_11.0.1)
T:avx2clang -march=native -Os -fwrapv -Qunused-arguments -fPIC -fPIE -gdwarf-4 -Wall (Debian_Clang_11.0.1)

Compiler output


encrypt.c: encrypt.c:374:16: warning: unused variable 'check' [-Wunused-variable]
encrypt.c:         unsigned char check = 0;
encrypt.c:                       ^
encrypt.c: 1 warning generated.
try.c: /usr/bin/ld: libcrypto_aead_morus1280256v2.a(encrypt.o): in function `crypto_aead_morus1280256v2_avx2_timingleaks_encrypt':
try.c: .../supercop-data/renoir/amd64/try/c/clang_-march=native_-O_-fwrapv_-Qunused-arguments_-fPIC_-fPIE_-gdwarf-4_-Wall/timingleaks/crypto_aead/morus1280256v2/avx2/work/encrypt.c:335: undefined reference to `morus_enc_aut_step'
try.c: /usr/bin/ld: .../supercop-data/renoir/amd64/try/c/clang_-march=native_-O_-fwrapv_-Qunused-arguments_-fPIC_-fPIE_-gdwarf-4_-Wall/timingleaks/crypto_aead/morus1280256v2/avx2/work/encrypt.c:347: undefined reference to `morus_enc_aut_step'
try.c: /usr/bin/ld: libcrypto_aead_morus1280256v2.a(encrypt.o): in function `crypto_aead_morus1280256v2_avx2_timingleaks_decrypt':
try.c: .../supercop-data/renoir/amd64/try/c/clang_-march=native_-O_-fwrapv_-Qunused-arguments_-fPIC_-fPIE_-gdwarf-4_-Wall/timingleaks/crypto_aead/morus1280256v2/avx2/work/encrypt.c:383: undefined reference to `morus_enc_aut_step'
try.c: /usr/bin/ld: .../supercop-data/renoir/amd64/try/c/clang_-march=native_-O_-fwrapv_-Qunused-arguments_-fPIC_-fPIE_-gdwarf-4_-Wall/timingleaks/crypto_aead/morus1280256v2/avx2/work/encrypt.c:395: undefined reference to `morus_dec_aut_step'
try.c: clang: error: linker command failed with exit code 1 (use -v to see invocation)

Number of similar (implementation,compiler) pairs: 1, namely:
ImplementationCompiler
T:avx2clang -march=native -O -fwrapv -Qunused-arguments -fPIC -fPIE -gdwarf-4 -Wall (Debian_Clang_11.0.1)

Compiler output


encrypt.c: encrypt.c:70:13: error: always_inline function '_mm256_xor_si256' requires target feature 'avx2', but would be inlined into function 'morus_stateupdate' that is compiled without support for 'avx2'
encrypt.c:         state[0] = XOR256(state[0], state[3]);
encrypt.c:                    ^
encrypt.c: encrypt.c:25:27: note: expanded from macro 'XOR256'
encrypt.c: #define XOR256(x,y)       _mm256_xor_si256((x),(y))        /*XOR256(x,y) = x ^ y, where x and y are two 256-bit word*/
encrypt.c:                           ^
encrypt.c: encrypt.c:70:13: error: AVX vector argument of type '__m256i' (vector of 4 'long long' values) without 'avx' enabled changes the ABI
encrypt.c: encrypt.c:25:27: note: expanded from macro 'XOR256'
encrypt.c: #define XOR256(x,y)       _mm256_xor_si256((x),(y))        /*XOR256(x,y) = x ^ y, where x and y are two 256-bit word*/
encrypt.c:                           ^
encrypt.c: encrypt.c:71:30: error: always_inline function '_mm256_and_si256' requires target feature 'avx2', but would be inlined into function 'morus_stateupdate' that is compiled without support for 'avx2'
encrypt.c:         state[0] = XOR256(state[0], AND256(state[1], state[2]));
encrypt.c:                                     ^
encrypt.c: encrypt.c:26:27: note: expanded from macro 'AND256'
encrypt.c: #define AND256(x,y)       _mm256_and_si256((x),(y))        /*AND(x,y) = x & y, where x and y are two 256-bit word*/
encrypt.c:                           ^
encrypt.c: encrypt.c:71:30: error: AVX vector argument of type '__m256i' (vector of 4 'long long' values) without 'avx' enabled changes the ABI
encrypt.c: encrypt.c:26:27: note: expanded from macro 'AND256'
encrypt.c: #define AND256(x,y)       _mm256_and_si256((x),(y))        /*AND(x,y) = x & y, where x and y are two 256-bit word*/
encrypt.c:                           ^
encrypt.c: encrypt.c:71:13: error: always_inline function '_mm256_xor_si256' requires target feature 'avx2', but would be inlined into function 'morus_stateupdate' that is compiled without support for 'avx2'
encrypt.c:         state[0] = XOR256(state[0], AND256(state[1], state[2]));
encrypt.c:                    ^
encrypt.c: encrypt.c:25:27: note: expanded from macro 'XOR256'
encrypt.c: #define XOR256(x,y)       _mm256_xor_si256((x),(y))        /*XOR256(x,y) = x ^ y, where x and y are two 256-bit word*/
encrypt.c: ...

Number of similar (implementation,compiler) pairs: 1, namely:
ImplementationCompiler
T:avx2clang -mcpu=native -O3 -fwrapv -Qunused-arguments -fPIC -fPIE -gdwarf-4 -Wall (Debian_Clang_11.0.1)

Compiler output


encrypt.c: encrypt.c: In function 'crypto_aead_morus1280256v2_avx2_timingleaks_decrypt':
encrypt.c: encrypt.c:374:16: warning: unused variable 'check' [-Wunused-variable]
encrypt.c:   374 |  unsigned char check = 0;
encrypt.c:       |                ^~~~~

Number of similar (implementation,compiler) pairs: 3, namely:
ImplementationCompiler
T:avx2gcc -march=native -mtune=native -O2 -fwrapv -fPIC -fPIE -gdwarf-4 -Wall (10.2.1_20210110)
T:avx2gcc -march=native -mtune=native -O3 -fwrapv -fPIC -fPIE -gdwarf-4 -Wall (10.2.1_20210110)
T:avx2gcc -march=native -mtune=native -O -fwrapv -fPIC -fPIE -gdwarf-4 -Wall (10.2.1_20210110)

Compiler output


encrypt.c: encrypt.c: In function 'crypto_aead_morus1280256v2_avx2_timingleaks_decrypt':
encrypt.c: encrypt.c:374:16: warning: unused variable 'check' [-Wunused-variable]
encrypt.c:   374 |  unsigned char check = 0;
encrypt.c:       |                ^~~~~
try.c: /usr/bin/ld: libcrypto_aead_morus1280256v2.a(encrypt.o): in function `crypto_aead_morus1280256v2_avx2_timingleaks_encrypt':
try.c: .../supercop-data/renoir/amd64/try/c/gcc_-march=native_-mtune=native_-Os_-fwrapv_-fPIC_-fPIE_-gdwarf-4_-Wall/timingleaks/crypto_aead/morus1280256v2/avx2/work/encrypt.c:335: undefined reference to `morus_enc_aut_step'
try.c: /usr/bin/ld: .../supercop-data/renoir/amd64/try/c/gcc_-march=native_-mtune=native_-Os_-fwrapv_-fPIC_-fPIE_-gdwarf-4_-Wall/timingleaks/crypto_aead/morus1280256v2/avx2/work/encrypt.c:347: undefined reference to `morus_enc_aut_step'
try.c: /usr/bin/ld: libcrypto_aead_morus1280256v2.a(encrypt.o): in function `crypto_aead_morus1280256v2_avx2_timingleaks_decrypt':
try.c: .../supercop-data/renoir/amd64/try/c/gcc_-march=native_-mtune=native_-Os_-fwrapv_-fPIC_-fPIE_-gdwarf-4_-Wall/timingleaks/crypto_aead/morus1280256v2/avx2/work/encrypt.c:383: undefined reference to `morus_enc_aut_step'
try.c: /usr/bin/ld: .../supercop-data/renoir/amd64/try/c/gcc_-march=native_-mtune=native_-Os_-fwrapv_-fPIC_-fPIE_-gdwarf-4_-Wall/timingleaks/crypto_aead/morus1280256v2/avx2/work/encrypt.c:395: undefined reference to `morus_dec_aut_step'
try.c: collect2: error: ld returned 1 exit status

Number of similar (implementation,compiler) pairs: 1, namely:
ImplementationCompiler
T:avx2gcc -march=native -mtune=native -Os -fwrapv -fPIC -fPIE -gdwarf-4 -Wall (10.2.1_20210110)

Compiler output


encrypt.c: encrypt.c:251:10: warning: unused variable 'check' [-Wunused-variable]
encrypt.c:         uint8_t check = 0;
encrypt.c:                 ^
encrypt.c: 1 warning generated.
try.c: /usr/bin/ld: libcrypto_aead_morus1280256v2.a(encrypt.o): in function `morus_initialization':
try.c: .../supercop-data/renoir/amd64/try/c/clang_-march=native_-O2_-fwrapv_-Qunused-arguments_-fPIC_-fPIE_-gdwarf-4_-Wall/timingleaks/crypto_aead/morus1280256v2/ref/work/encrypt.c:66: undefined reference to `morus_stateupdate'
try.c: /usr/bin/ld: .../supercop-data/renoir/amd64/try/c/clang_-march=native_-O2_-fwrapv_-Qunused-arguments_-fPIC_-fPIE_-gdwarf-4_-Wall/timingleaks/crypto_aead/morus1280256v2/ref/work/encrypt.c:66: undefined reference to `morus_stateupdate'
try.c: /usr/bin/ld: .../supercop-data/renoir/amd64/try/c/clang_-march=native_-O2_-fwrapv_-Qunused-arguments_-fPIC_-fPIE_-gdwarf-4_-Wall/timingleaks/crypto_aead/morus1280256v2/ref/work/encrypt.c:66: undefined reference to `morus_stateupdate'
try.c: /usr/bin/ld: .../supercop-data/renoir/amd64/try/c/clang_-march=native_-O2_-fwrapv_-Qunused-arguments_-fPIC_-fPIE_-gdwarf-4_-Wall/timingleaks/crypto_aead/morus1280256v2/ref/work/encrypt.c:66: undefined reference to `morus_stateupdate'
try.c: /usr/bin/ld: .../supercop-data/renoir/amd64/try/c/clang_-march=native_-O2_-fwrapv_-Qunused-arguments_-fPIC_-fPIE_-gdwarf-4_-Wall/timingleaks/crypto_aead/morus1280256v2/ref/work/encrypt.c:66: undefined reference to `morus_stateupdate'
try.c: /usr/bin/ld: libcrypto_aead_morus1280256v2.a(encrypt.o):.../supercop-data/renoir/amd64/try/c/clang_-march=native_-O2_-fwrapv_-Qunused-arguments_-fPIC_-fPIE_-gdwarf-4_-Wall/timingleaks/crypto_aead/morus1280256v2/ref/work/encrypt.c:66: more undefined references to `morus_stateupdate' follow
try.c: clang: error: linker command failed with exit code 1 (use -v to see invocation)

Number of similar (implementation,compiler) pairs: 1, namely:
ImplementationCompiler
T:refclang -march=native -O2 -fwrapv -Qunused-arguments -fPIC -fPIE -gdwarf-4 -Wall (Debian_Clang_11.0.1)

Compiler output


encrypt.c: encrypt.c:251:10: warning: unused variable 'check' [-Wunused-variable]
encrypt.c:         uint8_t check = 0;
encrypt.c:                 ^
encrypt.c: 1 warning generated.
try.c: /usr/bin/ld: libcrypto_aead_morus1280256v2.a(encrypt.o): in function `morus_initialization':
try.c: .../supercop-data/renoir/amd64/try/c/clang_-march=native_-O3_-fwrapv_-Qunused-arguments_-fPIC_-fPIE_-gdwarf-4_-Wall/timingleaks/crypto_aead/morus1280256v2/ref/work/encrypt.c:66: undefined reference to `morus_stateupdate'
try.c: /usr/bin/ld: .../supercop-data/renoir/amd64/try/c/clang_-march=native_-O3_-fwrapv_-Qunused-arguments_-fPIC_-fPIE_-gdwarf-4_-Wall/timingleaks/crypto_aead/morus1280256v2/ref/work/encrypt.c:66: undefined reference to `morus_stateupdate'
try.c: /usr/bin/ld: .../supercop-data/renoir/amd64/try/c/clang_-march=native_-O3_-fwrapv_-Qunused-arguments_-fPIC_-fPIE_-gdwarf-4_-Wall/timingleaks/crypto_aead/morus1280256v2/ref/work/encrypt.c:66: undefined reference to `morus_stateupdate'
try.c: /usr/bin/ld: .../supercop-data/renoir/amd64/try/c/clang_-march=native_-O3_-fwrapv_-Qunused-arguments_-fPIC_-fPIE_-gdwarf-4_-Wall/timingleaks/crypto_aead/morus1280256v2/ref/work/encrypt.c:66: undefined reference to `morus_stateupdate'
try.c: /usr/bin/ld: .../supercop-data/renoir/amd64/try/c/clang_-march=native_-O3_-fwrapv_-Qunused-arguments_-fPIC_-fPIE_-gdwarf-4_-Wall/timingleaks/crypto_aead/morus1280256v2/ref/work/encrypt.c:66: undefined reference to `morus_stateupdate'
try.c: /usr/bin/ld: libcrypto_aead_morus1280256v2.a(encrypt.o):.../supercop-data/renoir/amd64/try/c/clang_-march=native_-O3_-fwrapv_-Qunused-arguments_-fPIC_-fPIE_-gdwarf-4_-Wall/timingleaks/crypto_aead/morus1280256v2/ref/work/encrypt.c:66: more undefined references to `morus_stateupdate' follow
try.c: clang: error: linker command failed with exit code 1 (use -v to see invocation)

Number of similar (implementation,compiler) pairs: 1, namely:
ImplementationCompiler
T:refclang -march=native -O3 -fwrapv -Qunused-arguments -fPIC -fPIE -gdwarf-4 -Wall (Debian_Clang_11.0.1)

Compiler output


encrypt.c: encrypt.c:251:10: warning: unused variable 'check' [-Wunused-variable]
encrypt.c:         uint8_t check = 0;
encrypt.c:                 ^
encrypt.c: 1 warning generated.
try.c: /usr/bin/ld: libcrypto_aead_morus1280256v2.a(encrypt.o): in function `morus_initialization':
try.c: .../supercop-data/renoir/amd64/try/c/clang_-march=native_-O_-fwrapv_-Qunused-arguments_-fPIC_-fPIE_-gdwarf-4_-Wall/timingleaks/crypto_aead/morus1280256v2/ref/work/encrypt.c:66: undefined reference to `morus_stateupdate'
try.c: /usr/bin/ld: libcrypto_aead_morus1280256v2.a(encrypt.o): in function `morus_tag_generation':
try.c: .../supercop-data/renoir/amd64/try/c/clang_-march=native_-O_-fwrapv_-Qunused-arguments_-fPIC_-fPIE_-gdwarf-4_-Wall/timingleaks/crypto_aead/morus1280256v2/ref/work/encrypt.c:85: undefined reference to `morus_stateupdate'
try.c: /usr/bin/ld: libcrypto_aead_morus1280256v2.a(encrypt.o): in function `morus_tag_verification':
try.c: .../supercop-data/renoir/amd64/try/c/clang_-march=native_-O_-fwrapv_-Qunused-arguments_-fPIC_-fPIE_-gdwarf-4_-Wall/timingleaks/crypto_aead/morus1280256v2/ref/work/encrypt.c:107: undefined reference to `morus_stateupdate'
try.c: /usr/bin/ld: libcrypto_aead_morus1280256v2.a(encrypt.o): in function `morus_enc_aut_partialblock':
try.c: .../supercop-data/renoir/amd64/try/c/clang_-march=native_-O_-fwrapv_-Qunused-arguments_-fPIC_-fPIE_-gdwarf-4_-Wall/timingleaks/crypto_aead/morus1280256v2/ref/work/encrypt.c:165: undefined reference to `morus_stateupdate'
try.c: /usr/bin/ld: libcrypto_aead_morus1280256v2.a(encrypt.o): in function `morus_dec_aut_partialblock':
try.c: .../supercop-data/renoir/amd64/try/c/clang_-march=native_-O_-fwrapv_-Qunused-arguments_-fPIC_-fPIE_-gdwarf-4_-Wall/timingleaks/crypto_aead/morus1280256v2/ref/work/encrypt.c:189: undefined reference to `morus_stateupdate'
try.c: /usr/bin/ld: libcrypto_aead_morus1280256v2.a(encrypt.o): in function `crypto_aead_morus1280256v2_ref_timingleaks_encrypt':
try.c: .../supercop-data/renoir/amd64/try/c/clang_-march=native_-O_-fwrapv_-Qunused-arguments_-fPIC_-fPIE_-gdwarf-4_-Wall/timingleaks/crypto_aead/morus1280256v2/ref/work/encrypt.c:213: undefined reference to `morus_enc_aut_step'
try.c: /usr/bin/ld: .../supercop-data/renoir/amd64/try/c/clang_-march=native_-O_-fwrapv_-Qunused-arguments_-fPIC_-fPIE_-gdwarf-4_-Wall/timingleaks/crypto_aead/morus1280256v2/ref/work/encrypt.c:224: undefined reference to `morus_enc_aut_step'
try.c: /usr/bin/ld: libcrypto_aead_morus1280256v2.a(encrypt.o): in function `crypto_aead_morus1280256v2_ref_timingleaks_decrypt':
try.c: .../supercop-data/renoir/amd64/try/c/clang_-march=native_-O_-fwrapv_-Qunused-arguments_-fPIC_-fPIE_-gdwarf-4_-Wall/timingleaks/crypto_aead/morus1280256v2/ref/work/encrypt.c:258: undefined reference to `morus_enc_aut_step'
try.c: /usr/bin/ld: .../supercop-data/renoir/amd64/try/c/clang_-march=native_-O_-fwrapv_-Qunused-arguments_-fPIC_-fPIE_-gdwarf-4_-Wall/timingleaks/crypto_aead/morus1280256v2/ref/work/encrypt.c:270: undefined reference to `morus_dec_aut_step'
try.c: clang: error: linker command failed with exit code 1 (use -v to see invocation)

Number of similar (implementation,compiler) pairs: 1, namely:
ImplementationCompiler
T:refclang -march=native -O -fwrapv -Qunused-arguments -fPIC -fPIE -gdwarf-4 -Wall (Debian_Clang_11.0.1)

Compiler output


encrypt.c: encrypt.c:251:10: warning: unused variable 'check' [-Wunused-variable]
encrypt.c:         uint8_t check = 0;
encrypt.c:                 ^
encrypt.c: 1 warning generated.
try.c: /usr/bin/ld: libcrypto_aead_morus1280256v2.a(encrypt.o): in function `morus_initialization':
try.c: .../supercop-data/renoir/amd64/try/c/clang_-march=native_-Os_-fwrapv_-Qunused-arguments_-fPIC_-fPIE_-gdwarf-4_-Wall/timingleaks/crypto_aead/morus1280256v2/ref/work/encrypt.c:66: undefined reference to `morus_stateupdate'
try.c: /usr/bin/ld: libcrypto_aead_morus1280256v2.a(encrypt.o): in function `morus_tag_generation':
try.c: .../supercop-data/renoir/amd64/try/c/clang_-march=native_-Os_-fwrapv_-Qunused-arguments_-fPIC_-fPIE_-gdwarf-4_-Wall/timingleaks/crypto_aead/morus1280256v2/ref/work/encrypt.c:85: undefined reference to `morus_stateupdate'
try.c: /usr/bin/ld: libcrypto_aead_morus1280256v2.a(encrypt.o): in function `morus_tag_verification':
try.c: .../supercop-data/renoir/amd64/try/c/clang_-march=native_-Os_-fwrapv_-Qunused-arguments_-fPIC_-fPIE_-gdwarf-4_-Wall/timingleaks/crypto_aead/morus1280256v2/ref/work/encrypt.c:107: undefined reference to `morus_stateupdate'
try.c: /usr/bin/ld: libcrypto_aead_morus1280256v2.a(encrypt.o): in function `morus_enc_aut_partialblock':
try.c: .../supercop-data/renoir/amd64/try/c/clang_-march=native_-Os_-fwrapv_-Qunused-arguments_-fPIC_-fPIE_-gdwarf-4_-Wall/timingleaks/crypto_aead/morus1280256v2/ref/work/encrypt.c:165: undefined reference to `morus_stateupdate'
try.c: /usr/bin/ld: libcrypto_aead_morus1280256v2.a(encrypt.o): in function `morus_dec_aut_partialblock':
try.c: .../supercop-data/renoir/amd64/try/c/clang_-march=native_-Os_-fwrapv_-Qunused-arguments_-fPIC_-fPIE_-gdwarf-4_-Wall/timingleaks/crypto_aead/morus1280256v2/ref/work/encrypt.c:189: undefined reference to `morus_stateupdate'
try.c: /usr/bin/ld: libcrypto_aead_morus1280256v2.a(encrypt.o):.../supercop-data/renoir/amd64/try/c/clang_-march=native_-Os_-fwrapv_-Qunused-arguments_-fPIC_-fPIE_-gdwarf-4_-Wall/timingleaks/crypto_aead/morus1280256v2/ref/work/encrypt.c:130: more undefined references to `morus_stateupdate' follow
try.c: clang: error: linker command failed with exit code 1 (use -v to see invocation)

Number of similar (implementation,compiler) pairs: 1, namely:
ImplementationCompiler
T:refclang -march=native -Os -fwrapv -Qunused-arguments -fPIC -fPIE -gdwarf-4 -Wall (Debian_Clang_11.0.1)

Compiler output


encrypt.c: encrypt.c:251:10: warning: unused variable 'check' [-Wunused-variable]
encrypt.c:         uint8_t check = 0;
encrypt.c:                 ^
encrypt.c: 1 warning generated.
try.c: /usr/bin/ld: libcrypto_aead_morus1280256v2.a(encrypt.o): in function `morus_initialization':
try.c: .../supercop-data/renoir/amd64/try/c/clang_-mcpu=native_-O3_-fwrapv_-Qunused-arguments_-fPIC_-fPIE_-gdwarf-4_-Wall/timingleaks/crypto_aead/morus1280256v2/ref/work/encrypt.c:66: undefined reference to `morus_stateupdate'
try.c: /usr/bin/ld: .../supercop-data/renoir/amd64/try/c/clang_-mcpu=native_-O3_-fwrapv_-Qunused-arguments_-fPIC_-fPIE_-gdwarf-4_-Wall/timingleaks/crypto_aead/morus1280256v2/ref/work/encrypt.c:66: undefined reference to `morus_stateupdate'
try.c: /usr/bin/ld: .../supercop-data/renoir/amd64/try/c/clang_-mcpu=native_-O3_-fwrapv_-Qunused-arguments_-fPIC_-fPIE_-gdwarf-4_-Wall/timingleaks/crypto_aead/morus1280256v2/ref/work/encrypt.c:66: undefined reference to `morus_stateupdate'
try.c: /usr/bin/ld: .../supercop-data/renoir/amd64/try/c/clang_-mcpu=native_-O3_-fwrapv_-Qunused-arguments_-fPIC_-fPIE_-gdwarf-4_-Wall/timingleaks/crypto_aead/morus1280256v2/ref/work/encrypt.c:66: undefined reference to `morus_stateupdate'
try.c: /usr/bin/ld: .../supercop-data/renoir/amd64/try/c/clang_-mcpu=native_-O3_-fwrapv_-Qunused-arguments_-fPIC_-fPIE_-gdwarf-4_-Wall/timingleaks/crypto_aead/morus1280256v2/ref/work/encrypt.c:66: undefined reference to `morus_stateupdate'
try.c: /usr/bin/ld: libcrypto_aead_morus1280256v2.a(encrypt.o):.../supercop-data/renoir/amd64/try/c/clang_-mcpu=native_-O3_-fwrapv_-Qunused-arguments_-fPIC_-fPIE_-gdwarf-4_-Wall/timingleaks/crypto_aead/morus1280256v2/ref/work/encrypt.c:66: more undefined references to `morus_stateupdate' follow
try.c: clang: error: linker command failed with exit code 1 (use -v to see invocation)

Number of similar (implementation,compiler) pairs: 1, namely:
ImplementationCompiler
T:refclang -mcpu=native -O3 -fwrapv -Qunused-arguments -fPIC -fPIE -gdwarf-4 -Wall (Debian_Clang_11.0.1)

Compiler output


encrypt.c: encrypt.c: In function 'crypto_aead_morus1280256v2_ref_timingleaks_decrypt':
encrypt.c: encrypt.c:251:10: warning: unused variable 'check' [-Wunused-variable]
encrypt.c:   251 |  uint8_t check = 0;
encrypt.c:       |          ^~~~~
try.c: /usr/bin/ld: libcrypto_aead_morus1280256v2.a(encrypt.o): in function `morus_initialization':
try.c: .../supercop-data/renoir/amd64/try/c/gcc_-march=native_-mtune=native_-O2_-fwrapv_-fPIC_-fPIE_-gdwarf-4_-Wall/timingleaks/crypto_aead/morus1280256v2/ref/work/encrypt.c:66: undefined reference to `morus_stateupdate'
try.c: /usr/bin/ld: libcrypto_aead_morus1280256v2.a(encrypt.o): in function `morus_tag_generation':
try.c: .../supercop-data/renoir/amd64/try/c/gcc_-march=native_-mtune=native_-O2_-fwrapv_-fPIC_-fPIE_-gdwarf-4_-Wall/timingleaks/crypto_aead/morus1280256v2/ref/work/encrypt.c:85: undefined reference to `morus_stateupdate'
try.c: /usr/bin/ld: libcrypto_aead_morus1280256v2.a(encrypt.o): in function `morus_tag_verification':
try.c: .../supercop-data/renoir/amd64/try/c/gcc_-march=native_-mtune=native_-O2_-fwrapv_-fPIC_-fPIE_-gdwarf-4_-Wall/timingleaks/crypto_aead/morus1280256v2/ref/work/encrypt.c:107: undefined reference to `morus_stateupdate'
try.c: /usr/bin/ld: libcrypto_aead_morus1280256v2.a(encrypt.o): in function `morus_enc_aut_partialblock':
try.c: .../supercop-data/renoir/amd64/try/c/gcc_-march=native_-mtune=native_-O2_-fwrapv_-fPIC_-fPIE_-gdwarf-4_-Wall/timingleaks/crypto_aead/morus1280256v2/ref/work/encrypt.c:165: undefined reference to `morus_stateupdate'
try.c: /usr/bin/ld: libcrypto_aead_morus1280256v2.a(encrypt.o): in function `morus_dec_aut_partialblock':
try.c: .../supercop-data/renoir/amd64/try/c/gcc_-march=native_-mtune=native_-O2_-fwrapv_-fPIC_-fPIE_-gdwarf-4_-Wall/timingleaks/crypto_aead/morus1280256v2/ref/work/encrypt.c:189: undefined reference to `morus_stateupdate'
try.c: /usr/bin/ld: libcrypto_aead_morus1280256v2.a(encrypt.o):.../supercop-data/renoir/amd64/try/c/gcc_-march=native_-mtune=native_-O2_-fwrapv_-fPIC_-fPIE_-gdwarf-4_-Wall/timingleaks/crypto_aead/morus1280256v2/ref/work/encrypt.c:130: more undefined references to `morus_stateupdate' follow
try.c: collect2: error: ld returned 1 exit status

Number of similar (implementation,compiler) pairs: 1, namely:
ImplementationCompiler
T:refgcc -march=native -mtune=native -O2 -fwrapv -fPIC -fPIE -gdwarf-4 -Wall (10.2.1_20210110)

Compiler output


encrypt.c: encrypt.c: In function 'crypto_aead_morus1280256v2_ref_timingleaks_decrypt':
encrypt.c: encrypt.c:251:10: warning: unused variable 'check' [-Wunused-variable]
encrypt.c:   251 |  uint8_t check = 0;
encrypt.c:       |          ^~~~~

Number of similar (implementation,compiler) pairs: 1, namely:
ImplementationCompiler
T:refgcc -march=native -mtune=native -O3 -fwrapv -fPIC -fPIE -gdwarf-4 -Wall (10.2.1_20210110)

Compiler output


encrypt.c: encrypt.c: In function 'crypto_aead_morus1280256v2_ref_timingleaks_decrypt':
encrypt.c: encrypt.c:251:10: warning: unused variable 'check' [-Wunused-variable]
encrypt.c:   251 |  uint8_t check = 0;
encrypt.c:       |          ^~~~~
try.c: /usr/bin/ld: libcrypto_aead_morus1280256v2.a(encrypt.o): in function `morus_initialization':
try.c: .../supercop-data/renoir/amd64/try/c/gcc_-march=native_-mtune=native_-O_-fwrapv_-fPIC_-fPIE_-gdwarf-4_-Wall/timingleaks/crypto_aead/morus1280256v2/ref/work/encrypt.c:66: undefined reference to `morus_stateupdate'
try.c: /usr/bin/ld: libcrypto_aead_morus1280256v2.a(encrypt.o): in function `morus_tag_generation':
try.c: .../supercop-data/renoir/amd64/try/c/gcc_-march=native_-mtune=native_-O_-fwrapv_-fPIC_-fPIE_-gdwarf-4_-Wall/timingleaks/crypto_aead/morus1280256v2/ref/work/encrypt.c:85: undefined reference to `morus_stateupdate'
try.c: /usr/bin/ld: libcrypto_aead_morus1280256v2.a(encrypt.o): in function `morus_tag_verification':
try.c: .../supercop-data/renoir/amd64/try/c/gcc_-march=native_-mtune=native_-O_-fwrapv_-fPIC_-fPIE_-gdwarf-4_-Wall/timingleaks/crypto_aead/morus1280256v2/ref/work/encrypt.c:107: undefined reference to `morus_stateupdate'
try.c: /usr/bin/ld: libcrypto_aead_morus1280256v2.a(encrypt.o): in function `morus_enc_aut_partialblock':
try.c: .../supercop-data/renoir/amd64/try/c/gcc_-march=native_-mtune=native_-O_-fwrapv_-fPIC_-fPIE_-gdwarf-4_-Wall/timingleaks/crypto_aead/morus1280256v2/ref/work/encrypt.c:165: undefined reference to `morus_stateupdate'
try.c: /usr/bin/ld: libcrypto_aead_morus1280256v2.a(encrypt.o): in function `morus_dec_aut_partialblock':
try.c: .../supercop-data/renoir/amd64/try/c/gcc_-march=native_-mtune=native_-O_-fwrapv_-fPIC_-fPIE_-gdwarf-4_-Wall/timingleaks/crypto_aead/morus1280256v2/ref/work/encrypt.c:189: undefined reference to `morus_stateupdate'
try.c: /usr/bin/ld: libcrypto_aead_morus1280256v2.a(encrypt.o):.../supercop-data/renoir/amd64/try/c/gcc_-march=native_-mtune=native_-O_-fwrapv_-fPIC_-fPIE_-gdwarf-4_-Wall/timingleaks/crypto_aead/morus1280256v2/ref/work/encrypt.c:130: more undefined references to `morus_stateupdate' follow
try.c: collect2: error: ld returned 1 exit status

Number of similar (implementation,compiler) pairs: 1, namely:
ImplementationCompiler
T:refgcc -march=native -mtune=native -O -fwrapv -fPIC -fPIE -gdwarf-4 -Wall (10.2.1_20210110)

Compiler output


encrypt.c: encrypt.c: In function 'crypto_aead_morus1280256v2_ref_timingleaks_decrypt':
encrypt.c: encrypt.c:251:10: warning: unused variable 'check' [-Wunused-variable]
encrypt.c:   251 |  uint8_t check = 0;
encrypt.c:       |          ^~~~~
try.c: /usr/bin/ld: libcrypto_aead_morus1280256v2.a(encrypt.o): in function `morus_initialization':
try.c: .../supercop-data/renoir/amd64/try/c/gcc_-march=native_-mtune=native_-Os_-fwrapv_-fPIC_-fPIE_-gdwarf-4_-Wall/timingleaks/crypto_aead/morus1280256v2/ref/work/encrypt.c:66: undefined reference to `morus_stateupdate'
try.c: /usr/bin/ld: libcrypto_aead_morus1280256v2.a(encrypt.o): in function `morus_tag_generation':
try.c: .../supercop-data/renoir/amd64/try/c/gcc_-march=native_-mtune=native_-Os_-fwrapv_-fPIC_-fPIE_-gdwarf-4_-Wall/timingleaks/crypto_aead/morus1280256v2/ref/work/encrypt.c:85: undefined reference to `morus_stateupdate'
try.c: /usr/bin/ld: libcrypto_aead_morus1280256v2.a(encrypt.o): in function `morus_tag_verification':
try.c: .../supercop-data/renoir/amd64/try/c/gcc_-march=native_-mtune=native_-Os_-fwrapv_-fPIC_-fPIE_-gdwarf-4_-Wall/timingleaks/crypto_aead/morus1280256v2/ref/work/encrypt.c:107: undefined reference to `morus_stateupdate'
try.c: /usr/bin/ld: libcrypto_aead_morus1280256v2.a(encrypt.o): in function `morus_enc_aut_partialblock':
try.c: .../supercop-data/renoir/amd64/try/c/gcc_-march=native_-mtune=native_-Os_-fwrapv_-fPIC_-fPIE_-gdwarf-4_-Wall/timingleaks/crypto_aead/morus1280256v2/ref/work/encrypt.c:165: undefined reference to `morus_stateupdate'
try.c: /usr/bin/ld: libcrypto_aead_morus1280256v2.a(encrypt.o): in function `morus_dec_aut_partialblock':
try.c: .../supercop-data/renoir/amd64/try/c/gcc_-march=native_-mtune=native_-Os_-fwrapv_-fPIC_-fPIE_-gdwarf-4_-Wall/timingleaks/crypto_aead/morus1280256v2/ref/work/encrypt.c:189: undefined reference to `morus_stateupdate'
try.c: /usr/bin/ld: libcrypto_aead_morus1280256v2.a(encrypt.o): in function `crypto_aead_morus1280256v2_ref_timingleaks_encrypt':
try.c: .../supercop-data/renoir/amd64/try/c/gcc_-march=native_-mtune=native_-Os_-fwrapv_-fPIC_-fPIE_-gdwarf-4_-Wall/timingleaks/crypto_aead/morus1280256v2/ref/work/encrypt.c:213: undefined reference to `morus_enc_aut_step'
try.c: /usr/bin/ld: .../supercop-data/renoir/amd64/try/c/gcc_-march=native_-mtune=native_-Os_-fwrapv_-fPIC_-fPIE_-gdwarf-4_-Wall/timingleaks/crypto_aead/morus1280256v2/ref/work/encrypt.c:224: undefined reference to `morus_enc_aut_step'
try.c: /usr/bin/ld: libcrypto_aead_morus1280256v2.a(encrypt.o): in function `crypto_aead_morus1280256v2_ref_timingleaks_decrypt':
try.c: .../supercop-data/renoir/amd64/try/c/gcc_-march=native_-mtune=native_-Os_-fwrapv_-fPIC_-fPIE_-gdwarf-4_-Wall/timingleaks/crypto_aead/morus1280256v2/ref/work/encrypt.c:258: undefined reference to `morus_enc_aut_step'
try.c: /usr/bin/ld: .../supercop-data/renoir/amd64/try/c/gcc_-march=native_-mtune=native_-Os_-fwrapv_-fPIC_-fPIE_-gdwarf-4_-Wall/timingleaks/crypto_aead/morus1280256v2/ref/work/encrypt.c:270: undefined reference to `morus_dec_aut_step'
try.c: collect2: error: ld returned 1 exit status

Number of similar (implementation,compiler) pairs: 1, namely:
ImplementationCompiler
T:refgcc -march=native -mtune=native -Os -fwrapv -fPIC -fPIE -gdwarf-4 -Wall (10.2.1_20210110)

Compiler output


encrypt.c: encrypt.c:312:10: warning: unused variable 'check' [-Wunused-variable]
encrypt.c:         uint8_t check = 0;
encrypt.c:                 ^
encrypt.c: 1 warning generated.

Number of similar (implementation,compiler) pairs: 5, namely:
ImplementationCompiler
T:ref64clang -march=native -O2 -fwrapv -Qunused-arguments -fPIC -fPIE -gdwarf-4 -Wall (Debian_Clang_11.0.1)
T:ref64clang -march=native -O3 -fwrapv -Qunused-arguments -fPIC -fPIE -gdwarf-4 -Wall (Debian_Clang_11.0.1)
T:ref64clang -march=native -O -fwrapv -Qunused-arguments -fPIC -fPIE -gdwarf-4 -Wall (Debian_Clang_11.0.1)
T:ref64clang -march=native -Os -fwrapv -Qunused-arguments -fPIC -fPIE -gdwarf-4 -Wall (Debian_Clang_11.0.1)
T:ref64clang -mcpu=native -O3 -fwrapv -Qunused-arguments -fPIC -fPIE -gdwarf-4 -Wall (Debian_Clang_11.0.1)

Compiler output


encrypt.c: encrypt.c: In function 'crypto_aead_morus1280256v2_ref64_timingleaks_decrypt':
encrypt.c: encrypt.c:312:10: warning: unused variable 'check' [-Wunused-variable]
encrypt.c:   312 |  uint8_t check = 0;
encrypt.c:       |          ^~~~~

Number of similar (implementation,compiler) pairs: 4, namely:
ImplementationCompiler
T:ref64gcc -march=native -mtune=native -O2 -fwrapv -fPIC -fPIE -gdwarf-4 -Wall (10.2.1_20210110)
T:ref64gcc -march=native -mtune=native -O3 -fwrapv -fPIC -fPIE -gdwarf-4 -Wall (10.2.1_20210110)
T:ref64gcc -march=native -mtune=native -O -fwrapv -fPIC -fPIE -gdwarf-4 -Wall (10.2.1_20210110)
T:ref64gcc -march=native -mtune=native -Os -fwrapv -fPIC -fPIE -gdwarf-4 -Wall (10.2.1_20210110)

Compiler output


try.c: /usr/bin/ld: libcrypto_aead_morus1280256v2.a(encrypt.o): in function `crypto_aead_morus1280256v2_sse2_timingleaks_encrypt':
try.c: .../supercop-data/renoir/amd64/try/c/clang_-march=native_-O_-fwrapv_-Qunused-arguments_-fPIC_-fPIE_-gdwarf-4_-Wall/timingleaks/crypto_aead/morus1280256v2/sse2/work/encrypt.c:290: undefined reference to `morus_enc_aut_step'
try.c: /usr/bin/ld: .../supercop-data/renoir/amd64/try/c/clang_-march=native_-O_-fwrapv_-Qunused-arguments_-fPIC_-fPIE_-gdwarf-4_-Wall/timingleaks/crypto_aead/morus1280256v2/sse2/work/encrypt.c:301: undefined reference to `morus_enc_aut_step'
try.c: /usr/bin/ld: libcrypto_aead_morus1280256v2.a(encrypt.o): in function `crypto_aead_morus1280256v2_sse2_timingleaks_decrypt':
try.c: .../supercop-data/renoir/amd64/try/c/clang_-march=native_-O_-fwrapv_-Qunused-arguments_-fPIC_-fPIE_-gdwarf-4_-Wall/timingleaks/crypto_aead/morus1280256v2/sse2/work/encrypt.c:334: undefined reference to `morus_enc_aut_step'
try.c: /usr/bin/ld: .../supercop-data/renoir/amd64/try/c/clang_-march=native_-O_-fwrapv_-Qunused-arguments_-fPIC_-fPIE_-gdwarf-4_-Wall/timingleaks/crypto_aead/morus1280256v2/sse2/work/encrypt.c:346: undefined reference to `morus_dec_aut_step'
try.c: clang: error: linker command failed with exit code 1 (use -v to see invocation)

Number of similar (implementation,compiler) pairs: 1, namely:
ImplementationCompiler
T:sse2clang -march=native -O -fwrapv -Qunused-arguments -fPIC -fPIE -gdwarf-4 -Wall (Debian_Clang_11.0.1)

Compiler output


try.c: /usr/bin/ld: libcrypto_aead_morus1280256v2.a(encrypt.o): in function `crypto_aead_morus1280256v2_sse2_timingleaks_encrypt':
try.c: .../supercop-data/renoir/amd64/try/c/gcc_-march=native_-mtune=native_-Os_-fwrapv_-fPIC_-fPIE_-gdwarf-4_-Wall/timingleaks/crypto_aead/morus1280256v2/sse2/work/encrypt.c:290: undefined reference to `morus_enc_aut_step'
try.c: /usr/bin/ld: .../supercop-data/renoir/amd64/try/c/gcc_-march=native_-mtune=native_-Os_-fwrapv_-fPIC_-fPIE_-gdwarf-4_-Wall/timingleaks/crypto_aead/morus1280256v2/sse2/work/encrypt.c:301: undefined reference to `morus_enc_aut_step'
try.c: /usr/bin/ld: libcrypto_aead_morus1280256v2.a(encrypt.o): in function `crypto_aead_morus1280256v2_sse2_timingleaks_decrypt':
try.c: .../supercop-data/renoir/amd64/try/c/gcc_-march=native_-mtune=native_-Os_-fwrapv_-fPIC_-fPIE_-gdwarf-4_-Wall/timingleaks/crypto_aead/morus1280256v2/sse2/work/encrypt.c:334: undefined reference to `morus_enc_aut_step'
try.c: /usr/bin/ld: .../supercop-data/renoir/amd64/try/c/gcc_-march=native_-mtune=native_-Os_-fwrapv_-fPIC_-fPIE_-gdwarf-4_-Wall/timingleaks/crypto_aead/morus1280256v2/sse2/work/encrypt.c:346: undefined reference to `morus_dec_aut_step'
try.c: collect2: error: ld returned 1 exit status

Number of similar (implementation,compiler) pairs: 1, namely:
ImplementationCompiler
T:sse2gcc -march=native -mtune=native -Os -fwrapv -fPIC -fPIE -gdwarf-4 -Wall (10.2.1_20210110)