Implementation notes: amd64, r24000, crypto_kem/titaniumccastd

Computer: r24000
Architecture: amd64
CPU ID: GenuineIntel-000906ea-bfebfbff
SUPERCOP version: 20210604
Operation: crypto_kem
Primitive: titaniumccastd
TimeObject sizeTest sizeImplementationCompilerBenchmark dateSUPERCOP version
239363588123 0 0249070 828 1832T:avx2gcc_-march=native_-mtune=native_-O3_-fomit-frame-pointer_-fwrapv_-fPIC_-fPIE2021052120210423
243751386046 0 0244478 828 1832T:avx2gcc_-march=native_-mtune=native_-O2_-fomit-frame-pointer_-fwrapv_-fPIC_-fPIE2021052120210423
256441985841 0 0244102 828 1832T:avx2gcc_-march=native_-mtune=native_-O_-fomit-frame-pointer_-fwrapv_-fPIC_-fPIE2021052120210423
316512592556 0 0251671 828 1784T:optclang_-march=native_-O_-fomit-frame-pointer_-fwrapv_-Qunused-arguments_-fPIC_-fPIE2021052120210423
316550992556 0 0251671 828 1784T:optclang_-march=native_-O2_-fomit-frame-pointer_-fwrapv_-Qunused-arguments_-fPIC_-fPIE2021052120210423
3169374109244 0 0268279 828 1784T:optclang_-march=native_-O3_-fomit-frame-pointer_-fwrapv_-Qunused-arguments_-fPIC_-fPIE2021052120210423
331290867061 0 0226903 828 1784T:optclang_-mcpu=native_-O3_-fomit-frame-pointer_-fwrapv_-Qunused-arguments_-fPIC_-fPIE2021052120210423
338089152839 0 0210089 820 1784T:optclang_-march=native_-Os_-fomit-frame-pointer_-fwrapv_-Qunused-arguments_-fPIC_-fPIE2021052120210423
344736178426 0 0239238 828 1832T:optgcc_-march=native_-mtune=native_-O3_-fomit-frame-pointer_-fwrapv_-fPIC_-fPIE2021052120210423
356230150992 0 0209582 828 1832T:optgcc_-march=native_-mtune=native_-O2_-fomit-frame-pointer_-fwrapv_-fPIC_-fPIE2021052120210423
372911050889 0 0209318 828 1832T:optgcc_-march=native_-mtune=native_-O_-fomit-frame-pointer_-fwrapv_-fPIC_-fPIE2021052120210423
35927781384517 0 0244847 828 1784T:refclang_-march=native_-O3_-fomit-frame-pointer_-fwrapv_-Qunused-arguments_-fPIC_-fPIE2021052120210423
36462177949389 0 0209775 828 1784T:refclang_-march=native_-O_-fomit-frame-pointer_-fwrapv_-Qunused-arguments_-fPIC_-fPIE2021052120210423
36462861949389 0 0209775 828 1784T:refclang_-march=native_-O2_-fomit-frame-pointer_-fwrapv_-Qunused-arguments_-fPIC_-fPIE2021052120210423
36548501053275 0 0213055 828 1784T:refclang_-mcpu=native_-O3_-fomit-frame-pointer_-fwrapv_-Qunused-arguments_-fPIC_-fPIE2021052120210423
37552266950472 0 0211326 828 1832T:refgcc_-march=native_-mtune=native_-O3_-fomit-frame-pointer_-fwrapv_-fPIC_-fPIE2021052120210423
37674369634091 0 0191369 820 1784T:refclang_-march=native_-Os_-fomit-frame-pointer_-fwrapv_-Qunused-arguments_-fPIC_-fPIE2021052120210423
41445540233532 0 0191966 828 1832T:refgcc_-march=native_-mtune=native_-O2_-fomit-frame-pointer_-fwrapv_-fPIC_-fPIE2021052120210423
43770620533793 0 0192038 828 1832T:refgcc_-march=native_-mtune=native_-O_-fomit-frame-pointer_-fwrapv_-fPIC_-fPIE2021052120210423

Compiler output

Implementation: T:avx2
Security model: timingleaks
Compiler: clang -march=native -O2 -fomit-frame-pointer -fwrapv -Qunused-arguments -fPIC -fPIE
encrypt.c: In file included from encrypt.c:18:
encrypt.c: In file included from /usr/lib/llvm-10/lib/clang/10.0.0/include/x86intrin.h:13:
encrypt.c: /usr/lib/llvm-10/lib/clang/10.0.0/include/ia32intrin.h:210:16: error: expected identifier or '('
encrypt.c: unsigned int D;
encrypt.c: ^
encrypt.c: ./param.h:28:11: note: expanded from macro 'D'
encrypt.c: #define D 256
encrypt.c: ^
encrypt.c: In file included from encrypt.c:18:
encrypt.c: In file included from /usr/lib/llvm-10/lib/clang/10.0.0/include/x86intrin.h:13:
encrypt.c: /usr/lib/llvm-10/lib/clang/10.0.0/include/ia32intrin.h:211:20: error: cannot take the address of an rvalue of type 'int'
encrypt.c: __builtin_memcpy(&D, &__A, sizeof(__A));
encrypt.c: ^~
encrypt.c: /usr/lib/llvm-10/lib/clang/10.0.0/include/ia32intrin.h:227:22: error: expected identifier or '('
encrypt.c: unsigned long long D;
encrypt.c: ^
encrypt.c: ./param.h:28:11: note: expanded from macro 'D'
encrypt.c: #define D 256
encrypt.c: ^
encrypt.c: In file included from encrypt.c:18:
encrypt.c: In file included from /usr/lib/llvm-10/lib/clang/10.0.0/include/x86intrin.h:13:
encrypt.c: /usr/lib/llvm-10/lib/clang/10.0.0/include/ia32intrin.h:228:20: error: cannot take the address of an rvalue of type 'int'
encrypt.c: __builtin_memcpy(&D, &__A, sizeof(__A));
encrypt.c: ^~
encrypt.c: /usr/lib/llvm-10/lib/clang/10.0.0/include/ia32intrin.h:244:9: error: expected identifier or '('
encrypt.c: ...

Number of similar (compiler,implementation) pairs: 5, namely:
CompilerImplementations
clang -march=native -O2 -fomit-frame-pointer -fwrapv -Qunused-arguments -fPIC -fPIE T:avx2
clang -march=native -O3 -fomit-frame-pointer -fwrapv -Qunused-arguments -fPIC -fPIE T:avx2
clang -march=native -O -fomit-frame-pointer -fwrapv -Qunused-arguments -fPIC -fPIE T:avx2
clang -march=native -Os -fomit-frame-pointer -fwrapv -Qunused-arguments -fPIC -fPIE T:avx2
clang -mcpu=native -O3 -fomit-frame-pointer -fwrapv -Qunused-arguments -fPIC -fPIE T:avx2

Compiler output

Implementation: T:avx2
Security model: timingleaks
Compiler: gcc -march=native -mtune=native -Os -fomit-frame-pointer -fwrapv -fPIC -fPIE
try.c: /usr/bin/ld: libcrypto_kem_titaniumccastd.a(sampler.o): in function `sampler_zq':
try.c: sampler.c:(.text+0x...): undefined reference to `load_24'
try.c: /usr/bin/ld: sampler.c:(.text+0x...): undefined reference to `barrett_zq'
try.c: collect2: error: ld returned 1 exit status

Number of similar (compiler,implementation) pairs: 1, namely:
CompilerImplementations
gcc -march=native -mtune=native -Os -fomit-frame-pointer -fwrapv -fPIC -fPIE T:avx2

Compiler output

Implementation: T:opt
Security model: timingleaks
Compiler: gcc -march=native -mtune=native -Os -fomit-frame-pointer -fwrapv -fPIC -fPIE
try.c: /usr/bin/ld: libcrypto_kem_titaniumccastd.a(encrypt.o): in function `crypto_encrypt_keypair':
try.c: encrypt.c:(.text+0x...): undefined reference to `barrett_4q2'
try.c: /usr/bin/ld: encrypt.c:(.text+0x...): undefined reference to `barrett_4q'
try.c: /usr/bin/ld: libcrypto_kem_titaniumccastd.a(encrypt.o): in function `crypto_encrypt':
try.c: encrypt.c:(.text+0x...): undefined reference to `barrett_4q2'
try.c: /usr/bin/ld: encrypt.c:(.text+0x...): undefined reference to `barrett_4q2'
try.c: /usr/bin/ld: libcrypto_kem_titaniumccastd.a(encrypt.o): in function `crypto_encrypt_open':
try.c: encrypt.c:(.text+0x...): undefined reference to `barrett_4q2'
try.c: /usr/bin/ld: libcrypto_kem_titaniumccastd.a(fastrandombytes.o): in function `fastrandombytes':
try.c: fastrandombytes.c:(.text+0x...): undefined reference to `load_32'
try.c: /usr/bin/ld: fastrandombytes.c:(.text+0x...): undefined reference to `store_32'
try.c: /usr/bin/ld: libcrypto_kem_titaniumccastd.a(ntt.o): in function `ntt_2':
try.c: ntt.c:(.text+0x...): undefined reference to `barrett_4q'
try.c: /usr/bin/ld: ntt.c:(.text+0x...): undefined reference to `barrett_4q'
try.c: /usr/bin/ld: ntt.c:(.text+0x...): undefined reference to `barrett_4q'
try.c: /usr/bin/ld: ntt.c:(.text+0x...): undefined reference to `barrett_4q2'
try.c: /usr/bin/ld: ntt.c:(.text+0x...): undefined reference to `barrett_4q'
try.c: /usr/bin/ld: ntt.c:(.text+0x...): undefined reference to `barrett_4q'
try.c: /usr/bin/ld: ntt.c:(.text+0x...): undefined reference to `barrett_4q'
try.c: /usr/bin/ld: ntt.c:(.text+0x...): undefined reference to `barrett_4q2'
try.c: /usr/bin/ld: ntt.c:(.text+0x...): undefined reference to `barrett_4q'
try.c: /usr/bin/ld: ntt.c:(.text+0x...): undefined reference to `barrett_4q'
try.c: /usr/bin/ld: libcrypto_kem_titaniumccastd.a(ntt.o): in function `ntt_core':
try.c: ntt.c:(.text+0x...): undefined reference to `barrett_2q2'
try.c: /usr/bin/ld: libcrypto_kem_titaniumccastd.a(ntt.o): in function `intt_core':
try.c: ...

Number of similar (compiler,implementation) pairs: 1, namely:
CompilerImplementations
gcc -march=native -mtune=native -Os -fomit-frame-pointer -fwrapv -fPIC -fPIE T:opt

Compiler output

Implementation: T:ref
Security model: timingleaks
Compiler: gcc -march=native -mtune=native -Os -fomit-frame-pointer -fwrapv -fPIC -fPIE
try.c: /usr/bin/ld: libcrypto_kem_titaniumccastd.a(fastrandombytes.o): in function `fastrandombytes':
try.c: fastrandombytes.c:(.text+0x...): undefined reference to `load_32'
try.c: /usr/bin/ld: fastrandombytes.c:(.text+0x...): undefined reference to `store_32'
try.c: /usr/bin/ld: libcrypto_kem_titaniumccastd.a(sampler.o): in function `sampler_zq':
try.c: sampler.c:(.text+0x...): undefined reference to `load_24'
try.c: collect2: error: ld returned 1 exit status

Number of similar (compiler,implementation) pairs: 1, namely:
CompilerImplementations
gcc -march=native -mtune=native -Os -fomit-frame-pointer -fwrapv -fPIC -fPIE T:ref

Namespace violations

Implementation: T:avx2
Security model: timingleaks
Compiler: gcc -march=native -mtune=native -O2 -fomit-frame-pointer -fwrapv -fPIC -fPIE
encrypt.o crypto_encrypt T
encrypt.o crypto_encrypt_keypair T
encrypt.o crypto_encrypt_open T
fastrandombytes.o fastrandombytes T
fastrandombytes.o fastrandombytes_setseed T
fastrandombytes.o iv C
fastrandombytes.o key C
ntt.o intt_1536_1536_inv T
ntt.o intt_1792_256 T
ntt.o intt_1792_768 T
ntt.o intt_768_256 T
ntt.o ntt_1024_1536 T
ntt.o ntt_1024_1792 T
ntt.o ntt_1536_1792 T
ntt.o ntt_512_1536 T
ntt.o ntt_768_768_inv T
pack.o poly_decode T
pack.o poly_decode_c2 T
pack.o poly_encode T
pack.o poly_encode_c2 T
sampler.o sampler_binomial T
sampler.o sampler_zb T
sampler.o sampler_zq T

Number of similar (compiler,implementation) pairs: 11, namely:
CompilerImplementations
gcc -march=native -mtune=native -O2 -fomit-frame-pointer -fwrapv -fPIC -fPIE T:avx2
gcc -march=native -mtune=native -O3 -fomit-frame-pointer -fwrapv -fPIC -fPIE T:avx2
gcc -march=native -mtune=native -O -fomit-frame-pointer -fwrapv -fPIC -fPIE T:avx2
clang -march=native -O2 -fomit-frame-pointer -fwrapv -Qunused-arguments -fPIC -fPIE T:opt
clang -march=native -O3 -fomit-frame-pointer -fwrapv -Qunused-arguments -fPIC -fPIE T:opt
clang -march=native -O -fomit-frame-pointer -fwrapv -Qunused-arguments -fPIC -fPIE T:opt
clang -march=native -Os -fomit-frame-pointer -fwrapv -Qunused-arguments -fPIC -fPIE T:opt
clang -mcpu=native -O3 -fomit-frame-pointer -fwrapv -Qunused-arguments -fPIC -fPIE T:opt
gcc -march=native -mtune=native -O2 -fomit-frame-pointer -fwrapv -fPIC -fPIE T:opt
gcc -march=native -mtune=native -O3 -fomit-frame-pointer -fwrapv -fPIC -fPIE T:opt
gcc -march=native -mtune=native -O -fomit-frame-pointer -fwrapv -fPIC -fPIE T:opt

Namespace violations

Implementation: T:ref
Security model: timingleaks
Compiler: clang -march=native -O2 -fomit-frame-pointer -fwrapv -Qunused-arguments -fPIC -fPIE
encrypt.o crypto_encrypt T
encrypt.o crypto_encrypt_keypair T
encrypt.o crypto_encrypt_open T
fastrandombytes.o fastrandombytes T
fastrandombytes.o fastrandombytes_setseed T
fastrandombytes.o iv C
fastrandombytes.o key C
ntt.o intt_1536_1536_inv T
ntt.o intt_1792_1792 T
ntt.o intt_768_768 T
ntt.o ntt_1536_1536 T
ntt.o ntt_768_768_inv T
pack.o poly_decode T
pack.o poly_decode_c2 T
pack.o poly_encode T
pack.o poly_encode_c2 T
product.o mp T
product.o product T
sampler.o sampler_binomial T
sampler.o sampler_zb T
sampler.o sampler_zq T

Number of similar (compiler,implementation) pairs: 8, namely:
CompilerImplementations
clang -march=native -O2 -fomit-frame-pointer -fwrapv -Qunused-arguments -fPIC -fPIE T:ref
clang -march=native -O3 -fomit-frame-pointer -fwrapv -Qunused-arguments -fPIC -fPIE T:ref
clang -march=native -O -fomit-frame-pointer -fwrapv -Qunused-arguments -fPIC -fPIE T:ref
clang -march=native -Os -fomit-frame-pointer -fwrapv -Qunused-arguments -fPIC -fPIE T:ref
clang -mcpu=native -O3 -fomit-frame-pointer -fwrapv -Qunused-arguments -fPIC -fPIE T:ref
gcc -march=native -mtune=native -O2 -fomit-frame-pointer -fwrapv -fPIC -fPIE T:ref
gcc -march=native -mtune=native -O3 -fomit-frame-pointer -fwrapv -fPIC -fPIE T:ref
gcc -march=native -mtune=native -O -fomit-frame-pointer -fwrapv -fPIC -fPIE T:ref