Implementation notes: amd64, r24000, crypto_kem/titaniumccamed

Computer: r24000
Architecture: amd64
CPU ID: GenuineIntel-000906ea-bfebfbff
SUPERCOP version: 20210604
Operation: crypto_kem
Primitive: titaniumccamed
TimeObject sizeTest sizeImplementationCompilerBenchmark dateSUPERCOP version
301355885927 0 0246806 828 1832T:avx2gcc_-march=native_-mtune=native_-O3_-fomit-frame-pointer_-fwrapv_-fPIC_-fPIE2021052120210423
311485686024 0 0244454 828 1832T:avx2gcc_-march=native_-mtune=native_-O2_-fomit-frame-pointer_-fwrapv_-fPIC_-fPIE2021052120210423
326874085961 0 0244174 828 1832T:avx2gcc_-march=native_-mtune=native_-O_-fomit-frame-pointer_-fwrapv_-fPIC_-fPIE2021052120210423
4009348104298 0 0263415 828 1784T:optclang_-march=native_-O3_-fomit-frame-pointer_-fwrapv_-Qunused-arguments_-fPIC_-fPIE2021052120210423
407730184362 0 0243543 828 1784T:optclang_-march=native_-O2_-fomit-frame-pointer_-fwrapv_-Qunused-arguments_-fPIC_-fPIE2021052120210423
408045584362 0 0243543 828 1784T:optclang_-march=native_-O_-fomit-frame-pointer_-fwrapv_-Qunused-arguments_-fPIC_-fPIE2021052120210423
429598746665 0 0203857 820 1784T:optclang_-march=native_-Os_-fomit-frame-pointer_-fwrapv_-Qunused-arguments_-fPIC_-fPIE2021052120210423
429669064835 0 0224671 828 1784T:optclang_-mcpu=native_-O3_-fomit-frame-pointer_-fwrapv_-Qunused-arguments_-fPIC_-fPIE2021052120210423
440938873491 0 0234318 828 1832T:optgcc_-march=native_-mtune=native_-O3_-fomit-frame-pointer_-fwrapv_-fPIC_-fPIE2021052120210423
450771447730 0 0206310 828 1832T:optgcc_-march=native_-mtune=native_-O2_-fomit-frame-pointer_-fwrapv_-fPIC_-fPIE2021052120210423
489004447852 0 0206238 828 1832T:optgcc_-march=native_-mtune=native_-O_-fomit-frame-pointer_-fwrapv_-fPIC_-fPIE2021052120210423
41845369587140 0 0247407 828 1784T:refclang_-march=native_-O3_-fomit-frame-pointer_-fwrapv_-Qunused-arguments_-fPIC_-fPIE2021052120210423
42511651551692 0 0212079 828 1784T:refclang_-march=native_-O_-fomit-frame-pointer_-fwrapv_-Qunused-arguments_-fPIC_-fPIE2021052120210423
42511739651692 0 0212079 828 1784T:refclang_-march=native_-O2_-fomit-frame-pointer_-fwrapv_-Qunused-arguments_-fPIC_-fPIE2021052120210423
42673677856171 0 0215999 828 1784T:refclang_-mcpu=native_-O3_-fomit-frame-pointer_-fwrapv_-Qunused-arguments_-fPIC_-fPIE2021052120210423
43651848354784 0 0215638 828 1832T:refgcc_-march=native_-mtune=native_-O3_-fomit-frame-pointer_-fwrapv_-fPIC_-fPIE2021052120210423
43876479137314 0 0194577 820 1784T:refclang_-march=native_-Os_-fomit-frame-pointer_-fwrapv_-Qunused-arguments_-fPIC_-fPIE2021052120210423
44069167436764 0 0195182 828 1832T:refgcc_-march=native_-mtune=native_-O2_-fomit-frame-pointer_-fwrapv_-fPIC_-fPIE2021052120210423
50662230037119 0 0195390 828 1832T:refgcc_-march=native_-mtune=native_-O_-fomit-frame-pointer_-fwrapv_-fPIC_-fPIE2021052120210423

Compiler output

Implementation: T:avx2
Security model: timingleaks
Compiler: clang -march=native -O2 -fomit-frame-pointer -fwrapv -Qunused-arguments -fPIC -fPIE
encrypt.c: In file included from encrypt.c:18:
encrypt.c: In file included from /usr/lib/llvm-10/lib/clang/10.0.0/include/x86intrin.h:13:
encrypt.c: /usr/lib/llvm-10/lib/clang/10.0.0/include/ia32intrin.h:210:16: error: expected identifier or '('
encrypt.c: unsigned int D;
encrypt.c: ^
encrypt.c: ./param.h:28:11: note: expanded from macro 'D'
encrypt.c: #define D 256
encrypt.c: ^
encrypt.c: In file included from encrypt.c:18:
encrypt.c: In file included from /usr/lib/llvm-10/lib/clang/10.0.0/include/x86intrin.h:13:
encrypt.c: /usr/lib/llvm-10/lib/clang/10.0.0/include/ia32intrin.h:211:20: error: cannot take the address of an rvalue of type 'int'
encrypt.c: __builtin_memcpy(&D, &__A, sizeof(__A));
encrypt.c: ^~
encrypt.c: /usr/lib/llvm-10/lib/clang/10.0.0/include/ia32intrin.h:227:22: error: expected identifier or '('
encrypt.c: unsigned long long D;
encrypt.c: ^
encrypt.c: ./param.h:28:11: note: expanded from macro 'D'
encrypt.c: #define D 256
encrypt.c: ^
encrypt.c: In file included from encrypt.c:18:
encrypt.c: In file included from /usr/lib/llvm-10/lib/clang/10.0.0/include/x86intrin.h:13:
encrypt.c: /usr/lib/llvm-10/lib/clang/10.0.0/include/ia32intrin.h:228:20: error: cannot take the address of an rvalue of type 'int'
encrypt.c: __builtin_memcpy(&D, &__A, sizeof(__A));
encrypt.c: ^~
encrypt.c: /usr/lib/llvm-10/lib/clang/10.0.0/include/ia32intrin.h:244:9: error: expected identifier or '('
encrypt.c: ...

Number of similar (compiler,implementation) pairs: 5, namely:
CompilerImplementations
clang -march=native -O2 -fomit-frame-pointer -fwrapv -Qunused-arguments -fPIC -fPIE T:avx2
clang -march=native -O3 -fomit-frame-pointer -fwrapv -Qunused-arguments -fPIC -fPIE T:avx2
clang -march=native -O -fomit-frame-pointer -fwrapv -Qunused-arguments -fPIC -fPIE T:avx2
clang -march=native -Os -fomit-frame-pointer -fwrapv -Qunused-arguments -fPIC -fPIE T:avx2
clang -mcpu=native -O3 -fomit-frame-pointer -fwrapv -Qunused-arguments -fPIC -fPIE T:avx2

Compiler output

Implementation: T:avx2
Security model: timingleaks
Compiler: gcc -march=native -mtune=native -Os -fomit-frame-pointer -fwrapv -fPIC -fPIE
try.c: /usr/bin/ld: libcrypto_kem_titaniumccamed.a(sampler.o): in function `sampler_zq':
try.c: sampler.c:(.text+0x...): undefined reference to `load_24'
try.c: /usr/bin/ld: sampler.c:(.text+0x...): undefined reference to `barrett_zq'
try.c: collect2: error: ld returned 1 exit status

Number of similar (compiler,implementation) pairs: 1, namely:
CompilerImplementations
gcc -march=native -mtune=native -Os -fomit-frame-pointer -fwrapv -fPIC -fPIE T:avx2

Compiler output

Implementation: T:opt
Security model: timingleaks
Compiler: gcc -march=native -mtune=native -Os -fomit-frame-pointer -fwrapv -fPIC -fPIE
try.c: /usr/bin/ld: libcrypto_kem_titaniumccamed.a(encrypt.o): in function `crypto_encrypt_keypair':
try.c: encrypt.c:(.text+0x...): undefined reference to `barrett_4q2'
try.c: /usr/bin/ld: encrypt.c:(.text+0x...): undefined reference to `barrett_4q'
try.c: /usr/bin/ld: libcrypto_kem_titaniumccamed.a(encrypt.o): in function `crypto_encrypt':
try.c: encrypt.c:(.text+0x...): undefined reference to `barrett_4q2'
try.c: /usr/bin/ld: encrypt.c:(.text+0x...): undefined reference to `barrett_4q2'
try.c: /usr/bin/ld: libcrypto_kem_titaniumccamed.a(encrypt.o): in function `crypto_encrypt_open':
try.c: encrypt.c:(.text+0x...): undefined reference to `barrett_4q2'
try.c: /usr/bin/ld: libcrypto_kem_titaniumccamed.a(fastrandombytes.o): in function `fastrandombytes':
try.c: fastrandombytes.c:(.text+0x...): undefined reference to `load_32'
try.c: /usr/bin/ld: fastrandombytes.c:(.text+0x...): undefined reference to `store_32'
try.c: /usr/bin/ld: libcrypto_kem_titaniumccamed.a(ntt.o): in function `ntt_butterfly_1280_2048':
try.c: ntt.c:(.text+0x...): undefined reference to `barrett_16q'
try.c: /usr/bin/ld: libcrypto_kem_titaniumccamed.a(ntt.o): in function `ntt_butterfly_2048_768':
try.c: ntt.c:(.text+0x...): undefined reference to `barrett_16q'
try.c: /usr/bin/ld: libcrypto_kem_titaniumccamed.a(ntt.o): in function `ntt_butterfly_512_1792':
try.c: ntt.c:(.text+0x...): undefined reference to `barrett_4q'
try.c: /usr/bin/ld: libcrypto_kem_titaniumccamed.a(ntt.o): in function `ntt_butterfly_1280_1792':
try.c: ntt.c:(.text+0x...): undefined reference to `barrett_16q'
try.c: /usr/bin/ld: libcrypto_kem_titaniumccamed.a(ntt.o): in function `ntt_butterfly_1792_1792_inv':
try.c: ntt.c:(.text+0x...): undefined reference to `barrett_16q'
try.c: /usr/bin/ld: libcrypto_kem_titaniumccamed.a(ntt.o): in function `ntt_butterfly_768_768_inv':
try.c: ntt.c:(.text+0x...): undefined reference to `barrett_8q'
try.c: /usr/bin/ld: libcrypto_kem_titaniumccamed.a(ntt.o): in function `ntt_butterfly_512_768':
try.c: ntt.c:(.text+0x...): undefined reference to `barrett_4q'
try.c: ...

Number of similar (compiler,implementation) pairs: 1, namely:
CompilerImplementations
gcc -march=native -mtune=native -Os -fomit-frame-pointer -fwrapv -fPIC -fPIE T:opt

Compiler output

Implementation: T:ref
Security model: timingleaks
Compiler: gcc -march=native -mtune=native -Os -fomit-frame-pointer -fwrapv -fPIC -fPIE
try.c: /usr/bin/ld: libcrypto_kem_titaniumccamed.a(fastrandombytes.o): in function `fastrandombytes':
try.c: fastrandombytes.c:(.text+0x...): undefined reference to `load_32'
try.c: /usr/bin/ld: fastrandombytes.c:(.text+0x...): undefined reference to `store_32'
try.c: /usr/bin/ld: libcrypto_kem_titaniumccamed.a(sampler.o): in function `sampler_zq':
try.c: sampler.c:(.text+0x...): undefined reference to `load_24'
try.c: collect2: error: ld returned 1 exit status

Number of similar (compiler,implementation) pairs: 1, namely:
CompilerImplementations
gcc -march=native -mtune=native -Os -fomit-frame-pointer -fwrapv -fPIC -fPIE T:ref

Namespace violations

Implementation: T:avx2
Security model: timingleaks
Compiler: gcc -march=native -mtune=native -O2 -fomit-frame-pointer -fwrapv -fPIC -fPIE
encrypt.o crypto_encrypt T
encrypt.o crypto_encrypt_keypair T
encrypt.o crypto_encrypt_open T
fastrandombytes.o fastrandombytes T
fastrandombytes.o fastrandombytes_setseed T
fastrandombytes.o iv C
fastrandombytes.o key C
ntt.o intt_1792_1792_inv T
ntt.o intt_2048_256 T
ntt.o intt_2048_768 T
ntt.o intt_768_256 T
ntt.o ntt_1280_1792 T
ntt.o ntt_1280_2048 T
ntt.o ntt_1792_2048 T
ntt.o ntt_512_1792 T
ntt.o ntt_512_768 T
ntt.o ntt_768_768_inv T
pack.o poly_decode T
pack.o poly_decode_c2 T
pack.o poly_encode T
pack.o poly_encode_c2 T
sampler.o sampler_binomial T
sampler.o sampler_zb T
sampler.o sampler_zq T

Number of similar (compiler,implementation) pairs: 11, namely:
CompilerImplementations
gcc -march=native -mtune=native -O2 -fomit-frame-pointer -fwrapv -fPIC -fPIE T:avx2
gcc -march=native -mtune=native -O3 -fomit-frame-pointer -fwrapv -fPIC -fPIE T:avx2
gcc -march=native -mtune=native -O -fomit-frame-pointer -fwrapv -fPIC -fPIE T:avx2
clang -march=native -O2 -fomit-frame-pointer -fwrapv -Qunused-arguments -fPIC -fPIE T:opt
clang -march=native -O3 -fomit-frame-pointer -fwrapv -Qunused-arguments -fPIC -fPIE T:opt
clang -march=native -O -fomit-frame-pointer -fwrapv -Qunused-arguments -fPIC -fPIE T:opt
clang -march=native -Os -fomit-frame-pointer -fwrapv -Qunused-arguments -fPIC -fPIE T:opt
clang -mcpu=native -O3 -fomit-frame-pointer -fwrapv -Qunused-arguments -fPIC -fPIE T:opt
gcc -march=native -mtune=native -O2 -fomit-frame-pointer -fwrapv -fPIC -fPIE T:opt
gcc -march=native -mtune=native -O3 -fomit-frame-pointer -fwrapv -fPIC -fPIE T:opt
gcc -march=native -mtune=native -O -fomit-frame-pointer -fwrapv -fPIC -fPIE T:opt

Namespace violations

Implementation: T:ref
Security model: timingleaks
Compiler: clang -march=native -O2 -fomit-frame-pointer -fwrapv -Qunused-arguments -fPIC -fPIE
encrypt.o crypto_encrypt T
encrypt.o crypto_encrypt_keypair T
encrypt.o crypto_encrypt_open T
fastrandombytes.o fastrandombytes T
fastrandombytes.o fastrandombytes_setseed T
fastrandombytes.o iv C
fastrandombytes.o key C
ntt.o intt_1792_1792_inv T
ntt.o intt_2048_2048 T
ntt.o intt_768_768 T
ntt.o ntt_1792_1792 T
ntt.o ntt_768_768_inv T
pack.o poly_decode T
pack.o poly_decode_c2 T
pack.o poly_encode T
pack.o poly_encode_c2 T
product.o mp T
product.o product T
sampler.o sampler_binomial T
sampler.o sampler_zb T
sampler.o sampler_zq T

Number of similar (compiler,implementation) pairs: 8, namely:
CompilerImplementations
clang -march=native -O2 -fomit-frame-pointer -fwrapv -Qunused-arguments -fPIC -fPIE T:ref
clang -march=native -O3 -fomit-frame-pointer -fwrapv -Qunused-arguments -fPIC -fPIE T:ref
clang -march=native -O -fomit-frame-pointer -fwrapv -Qunused-arguments -fPIC -fPIE T:ref
clang -march=native -Os -fomit-frame-pointer -fwrapv -Qunused-arguments -fPIC -fPIE T:ref
clang -mcpu=native -O3 -fomit-frame-pointer -fwrapv -Qunused-arguments -fPIC -fPIE T:ref
gcc -march=native -mtune=native -O2 -fomit-frame-pointer -fwrapv -fPIC -fPIE T:ref
gcc -march=native -mtune=native -O3 -fomit-frame-pointer -fwrapv -fPIC -fPIE T:ref
gcc -march=native -mtune=native -O -fomit-frame-pointer -fwrapv -fPIC -fPIE T:ref