Implementation notes: amd64, panther, crypto_hash/sha512

Computer: panther
Microarchitecture: amd64; Tiger Lake (806c1)
Architecture: amd64
CPU ID: GenuineIntel-000806c1-00-bfebfbff
SUPERCOP version: 20240625
Operation: crypto_hash
Primitive: sha512
TimeObject sizeTest sizeImplementationCompilerBenchmark dateSUPERCOP version
9298999 0 017520 780 952blocksplusavxgcc_-march=native_-mtune=native_-O2_-fwrapv_-fPIC_-fPIE_-gdwarf-4_-Wall2024062620240625
9299660 0 016427 820 888refclang_-march=native_-Os_-fwrapv_-Qunused-arguments_-fPIC_-fPIE_-gdwarf-4_-Wall2024062620240625
93011247 0 019872 780 952refgcc_-march=native_-mtune=native_-O3_-fwrapv_-fPIC_-fPIE_-gdwarf-4_-Wall2024062620240625
9302470 0 016427 820 888blocksplusavxclang_-march=native_-O_-fwrapv_-Qunused-arguments_-fPIC_-fPIE_-gdwarf-4_-Wall2024062620240625
9317470 0 019389 828 920blocksplusavxclang_-march=native_-O3_-fwrapv_-Qunused-arguments_-fPIC_-fPIE_-gdwarf-4_-Wall2024062620240625
9326500 0 016479 772 952blocksplusavxgcc_-march=native_-mtune=native_-O_-fwrapv_-fPIC_-fPIE_-gdwarf-4_-Wall2024062620240625
9329999 0 019624 780 952blocksplusavxgcc_-march=native_-mtune=native_-O3_-fwrapv_-fPIC_-fPIE_-gdwarf-4_-Wall2024062620240625
9330467 0 016267 820 888blocksplusavxclang_-march=native_-Os_-fwrapv_-Qunused-arguments_-fPIC_-fPIE_-gdwarf-4_-Wall2024062620240625
9334799 0 019069 828 888refclang_-mcpu=native_-O3_-fwrapv_-Qunused-arguments_-fPIC_-fPIE_-gdwarf-4_-Wall2024062620240625
933570 0 013616 836 920opensslclang_-march=native_-O3_-fwrapv_-Qunused-arguments_-fPIC_-fPIE_-gdwarf-4_-Wall2024062620240625
9335677 0 019597 828 920refclang_-march=native_-O3_-fwrapv_-Qunused-arguments_-fPIC_-fPIE_-gdwarf-4_-Wall2024062620240625
9339470 0 019373 828 920blocksplusavxclang_-march=native_-O2_-fwrapv_-Qunused-arguments_-fPIC_-fPIE_-gdwarf-4_-Wall2024062620240625
934070 0 012960 836 888opensslclang_-mcpu=native_-O3_-fwrapv_-Qunused-arguments_-fPIC_-fPIE_-gdwarf-4_-Wall2024062620240625
9340677 0 019581 828 920refclang_-march=native_-O2_-fwrapv_-Qunused-arguments_-fPIC_-fPIE_-gdwarf-4_-Wall2024062620240625
9345667 0 016635 820 888refclang_-march=native_-O_-fwrapv_-Qunused-arguments_-fPIC_-fPIE_-gdwarf-4_-Wall2024062620240625
934870 0 013600 836 920opensslclang_-march=native_-O2_-fwrapv_-Qunused-arguments_-fPIC_-fPIE_-gdwarf-4_-Wall2024062620240625
935570 0 010462 828 888opensslclang_-march=native_-Os_-fwrapv_-Qunused-arguments_-fPIC_-fPIE_-gdwarf-4_-Wall2024062620240625
935576 0 013368 804 920opensslgcc_-march=native_-mtune=native_-O3_-fwrapv_-fPIC_-fPIE_-gdwarf-4_-Wall2024062620240625
935570 0 09731 780 920opensslgcc_-march=native_-mtune=native_-Os_-fwrapv_-fPIC_-fPIE_-gdwarf-4_-Wall2024062620240625
936976 0 011232 804 920opensslgcc_-march=native_-mtune=native_-O2_-fwrapv_-fPIC_-fPIE_-gdwarf-4_-Wall2024062620240625
937079 0 010695 796 920opensslgcc_-march=native_-mtune=native_-O_-fwrapv_-fPIC_-fPIE_-gdwarf-4_-Wall2024062620240625
937570 0 010654 828 888opensslclang_-march=native_-O_-fwrapv_-Qunused-arguments_-fPIC_-fPIE_-gdwarf-4_-Wall2024062620240625
9391450 0 015475 756 920blocksplusavxgcc_-march=native_-mtune=native_-Os_-fwrapv_-fPIC_-fPIE_-gdwarf-4_-Wall2024062620240625
94171232 0 017752 780 952refgcc_-march=native_-mtune=native_-O2_-fwrapv_-fPIC_-fPIE_-gdwarf-4_-Wall2024062620240625
9543620 0 015651 756 920refgcc_-march=native_-mtune=native_-Os_-fwrapv_-fPIC_-fPIE_-gdwarf-4_-Wall2024062620240625
9687620 0 016607 772 952refgcc_-march=native_-mtune=native_-O_-fwrapv_-fPIC_-fPIE_-gdwarf-4_-Wall2024062620240625
118214921 992 01406077 144524 10296cryptoppclang++_-march=native_-O3_-fwrapv_-Qunused-arguments_-fPIC_-fPIE_-gdwarf-4_-Wall2024062620240625
118304752 768 01403102 144516 10264cryptoppclang++_-march=native_-Os_-fwrapv_-Qunused-arguments_-fPIC_-fPIE_-gdwarf-4_-Wall2024062620240625
118575116 928 01696466 144732 10360cryptoppg++_-march=native_-mtune=native_-O2_-fwrapv_-fPIC_-fPIE_-gdwarf-4_-Wall2024062620240625
118584976 704 01697708 144500 10360cryptoppg++_-march=native_-mtune=native_-O3_-fwrapv_-fPIC_-fPIE_-gdwarf-4_-Wall2024062620240625
118634975 992 01406113 144524 10296cryptoppclang++_-march=native_-O2_-fwrapv_-Qunused-arguments_-fPIC_-fPIE_-gdwarf-4_-Wall2024062620240625
118944852 928 01695660 144732 10360cryptoppg++_-march=native_-mtune=native_-O_-fwrapv_-fPIC_-fPIE_-gdwarf-4_-Wall2024062620240625
119443760 992 01693682 144732 10328cryptoppg++_-march=native_-mtune=native_-Os_-fwrapv_-fPIC_-fPIE_-gdwarf-4_-Wall2024062620240625
121018578 1576 01410311 145108 10264cryptoppclang++_-march=native_-O_-fwrapv_-Qunused-arguments_-fPIC_-fPIE_-gdwarf-4_-Wall2024062620240625
121258390 0 021600 780 952sphlib-smallgcc_-march=native_-mtune=native_-O3_-fwrapv_-fPIC_-fPIE_-gdwarf-4_-Wall2024062620240625
121428390 0 021600 780 952sphlibgcc_-march=native_-mtune=native_-O3_-fwrapv_-fPIC_-fPIE_-gdwarf-4_-Wall2024062620240625
138045306 0 015887 772 952sphlib-smallgcc_-march=native_-mtune=native_-O_-fwrapv_-fPIC_-fPIE_-gdwarf-4_-Wall2024062620240625
140575306 0 015887 772 952sphlibgcc_-march=native_-mtune=native_-O_-fwrapv_-fPIC_-fPIE_-gdwarf-4_-Wall2024062620240625
141614488 0 014107 756 920sphlibgcc_-march=native_-mtune=native_-Os_-fwrapv_-fPIC_-fPIE_-gdwarf-4_-Wall2024062620240625
141784488 0 014107 756 920sphlib-smallgcc_-march=native_-mtune=native_-Os_-fwrapv_-fPIC_-fPIE_-gdwarf-4_-Wall2024062620240625
147616085 0 017208 780 952sphlibgcc_-march=native_-mtune=native_-O2_-fwrapv_-fPIC_-fPIE_-gdwarf-4_-Wall2024062620240625
147686085 0 017208 780 952sphlib-smallgcc_-march=native_-mtune=native_-O2_-fwrapv_-fPIC_-fPIE_-gdwarf-4_-Wall2024062620240625
148855729 0 019197 828 920sphlibclang_-march=native_-O2_-fwrapv_-Qunused-arguments_-fPIC_-fPIE_-gdwarf-4_-Wall2024062620240625
148935729 0 019197 828 920sphlib-smallclang_-march=native_-O2_-fwrapv_-Qunused-arguments_-fPIC_-fPIE_-gdwarf-4_-Wall2024062620240625
149535729 0 019213 828 920sphlibclang_-march=native_-O3_-fwrapv_-Qunused-arguments_-fPIC_-fPIE_-gdwarf-4_-Wall2024062620240625
149555729 0 019213 828 920sphlib-smallclang_-march=native_-O3_-fwrapv_-Qunused-arguments_-fPIC_-fPIE_-gdwarf-4_-Wall2024062620240625
150474718 0 015067 820 888sphlibclang_-march=native_-Os_-fwrapv_-Qunused-arguments_-fPIC_-fPIE_-gdwarf-4_-Wall2024062620240625
150914718 0 015099 820 888sphlib-smallclang_-march=native_-Os_-fwrapv_-Qunused-arguments_-fPIC_-fPIE_-gdwarf-4_-Wall2024062620240625
151011877 0 012107 820 888compactclang_-march=native_-Os_-fwrapv_-Qunused-arguments_-fPIC_-fPIE_-gdwarf-4_-Wall2024062620240625
152634981 0 015571 820 888sphlibclang_-march=native_-O_-fwrapv_-Qunused-arguments_-fPIC_-fPIE_-gdwarf-4_-Wall2024062620240625
152954981 0 015571 820 888sphlib-smallclang_-march=native_-O_-fwrapv_-Qunused-arguments_-fPIC_-fPIE_-gdwarf-4_-Wall2024062620240625
158593537 0 016957 828 920compactclang_-march=native_-O2_-fwrapv_-Qunused-arguments_-fPIC_-fPIE_-gdwarf-4_-Wall2024062620240625
163685417 0 018568 780 952compactgcc_-march=native_-mtune=native_-O3_-fwrapv_-fPIC_-fPIE_-gdwarf-4_-Wall2024062620240625
166463469 0 016909 828 920compactclang_-march=native_-O3_-fwrapv_-Qunused-arguments_-fPIC_-fPIE_-gdwarf-4_-Wall2024062620240625
171942342 0 015125 828 888compactclang_-mcpu=native_-O3_-fwrapv_-Qunused-arguments_-fPIC_-fPIE_-gdwarf-4_-Wall2024062620240625
173936208 0 019037 828 888sphlibclang_-mcpu=native_-O3_-fwrapv_-Qunused-arguments_-fPIC_-fPIE_-gdwarf-4_-Wall2024062620240625
174372323 0 013392 780 952compactgcc_-march=native_-mtune=native_-O2_-fwrapv_-fPIC_-fPIE_-gdwarf-4_-Wall2024062620240625
174676208 0 019037 828 888sphlib-smallclang_-mcpu=native_-O3_-fwrapv_-Qunused-arguments_-fPIC_-fPIE_-gdwarf-4_-Wall2024062620240625
176351631 0 011203 756 920compactgcc_-march=native_-mtune=native_-Os_-fwrapv_-fPIC_-fPIE_-gdwarf-4_-Wall2024062620240625
179441729 0 012255 772 952compactgcc_-march=native_-mtune=native_-O_-fwrapv_-fPIC_-fPIE_-gdwarf-4_-Wall2024062620240625
188081777 0 012275 820 888compactclang_-march=native_-O_-fwrapv_-Qunused-arguments_-fPIC_-fPIE_-gdwarf-4_-Wall2024062620240625

Compiler output


hash.c: hash.c:33:8: error: always_inline function '_mm256_loadu_si256' requires target feature 'avx', but would be inlined into function 'crypto_hash_sha512_blocksplusavx_constbranchindex' that is compiled without support for 'avx'
hash.c:   X0 = load256(iv);
hash.c:        ^
hash.c: hash.c:22:21: note: expanded from macro 'load256'
hash.c: #define load256(x) (_mm256_loadu_si256((void *) (x)))
hash.c:                     ^
hash.c: hash.c:33:8: error: AVX vector return of type '__m256i' (vector of 4 'long long' values) without 'avx' enabled changes the ABI
hash.c: hash.c:22:21: note: expanded from macro 'load256'
hash.c: #define load256(x) (_mm256_loadu_si256((void *) (x)))
hash.c:                     ^
hash.c: hash.c:34:8: error: always_inline function '_mm256_loadu_si256' requires target feature 'avx', but would be inlined into function 'crypto_hash_sha512_blocksplusavx_constbranchindex' that is compiled without support for 'avx'
hash.c:   X1 = load256(iv + 32);
hash.c:        ^
hash.c: hash.c:22:21: note: expanded from macro 'load256'
hash.c: #define load256(x) (_mm256_loadu_si256((void *) (x)))
hash.c:                     ^
hash.c: hash.c:34:8: error: AVX vector return of type '__m256i' (vector of 4 'long long' values) without 'avx' enabled changes the ABI
hash.c: hash.c:22:21: note: expanded from macro 'load256'
hash.c: #define load256(x) (_mm256_loadu_si256((void *) (x)))
hash.c:                     ^
hash.c: hash.c:36:3: error: always_inline function '_mm256_storeu_si256' requires target feature 'avx', but would be inlined into function 'crypto_hash_sha512_blocksplusavx_constbranchindex' that is compiled without support for 'avx'
hash.c:   store256(h,X0);
hash.c:   ^
hash.c: hash.c:23:24: note: expanded from macro 'store256'
hash.c: #define store256(x,y) (_mm256_storeu_si256((void *) (x),y))
hash.c: ...

Number of similar (implementation,compiler) pairs: 1, namely:
ImplementationCompiler
blocksplusavxclang -mcpu=native -O3 -fwrapv -Qunused-arguments -fPIC -fPIE -gdwarf-4 -Wall (Debian_Clang_11.0.1)

Compiler output


try.c: error: linking with `cc` failed: exit code: 1
try.c:   |
try.c:   = note: "cc" "-Wl,--as-needed" "-Wl,-z,noexecstack" "-m64" "-Wl,--eh-frame-hdr" "-L" "/usr/lib/rustlib/x86_64-unknown-linux-gnu/lib" ".../supercop-data/panther/amd64/try/c/clang_-march=native_-O2_-fwrapv_-Qunused-arguments_-fPIC_-fPIE_-gdwarf-4_-Wall/constbranchindex/crypto_hash/sha512/rust_crypto/work/target/release/deps/try-9887c9168535d8bb.try.7fu8k6xf-cgu.0.rcgu.o" ".../supercop-data/panther/amd64/try/c/clang_-march=native_-O2_-fwrapv_-Qunused-arguments_-fPIC_-fPIE_-gdwarf-4_-Wall/constbranchindex/crypto_hash/sha512/rust_crypto/work/target/release/deps/try-9887c9168535d8bb.try.7fu8k6xf-cgu.1.rcgu.o" ".../supercop-data/panther/amd64/try/c/clang_-march=native_-O2_-fwrapv_-Qunused-arguments_-fPIC_-fPIE_-gdwarf-4_-Wall/constbranchindex/crypto_hash/sha512/rust_crypto/work/target/release/deps/try-9887c9168535d8bb.try.7fu8k6xf-cgu.2.rcgu.o" ".../supercop-data/panther/amd64/try/c/clang_-march=native_-O2_-fwrapv_-Qunused-arguments_-fPIC_-fPIE_-gdwarf-4_-Wall/constbranchindex/crypto_hash/sha512/rust_crypto/work/target/release/deps/try-9887c9168535d8bb.try.7fu8k6xf-cgu.3.rcgu.o" ".../supercop-data/panther/amd64/try/c/clang_-march=native_-O2_-fwrapv_-Qunused-arguments_-fPIC_-fPIE_-gdwarf-4_-Wall/constbranchindex/crypto_hash/sha512/rust_crypto/work/target/release/deps/try-9887c9168535d8bb.try.7fu8k6xf-cgu.4.rcgu.o" "-o" ".../supercop-data/panther/amd64/try/c/clang_-march=native_-O2_-fwrapv_-Qunused-arguments_-fPIC_-fPIE_-gdwarf-4_-Wall/constbranchindex/crypto_hash/sha512/rust_crypto/work/target/release/deps/try-9887c9168535d8bb" ".../supercop-data/panther/amd64/try/c/clang_-march=native_-O2_-fwrapv_-Qunused-arguments_-fPIC_-fPIE_-gdwarf-4_-Wall/constbranchindex/crypto_hash/sha512/rust_crypto/work/target/release/deps/try-9887c9168535d8bb.43eldm92am99c3dw.rcgu.o" "-Wl,--gc-sections" "-pie" "-Wl,-zrelro" "-Wl,-znow" "-Wl,-O1" "-nodefaultlibs" "-L" ".../supercop-data/panther/amd64/try/c/clang_-march=native_-O2_-fwrapv_-Qunused-arguments_-fPIC_-fPIE_-gdwarf-4_-Wall/constbranchindex/crypto_hash/sha512/rust_crypto/work/target/release/deps" "-L" ".../supercop-data/panther/amd64/lib" "-L" ".../supercop-data/panther/amd64/try/c/clang_-march=native_-O2_-fwrapv_-Qunused-arguments_-fPIC_-fPIE_-gdwarf-4_-Wall/constbranchindex/crypto_hash/sha512/rust_crypto/work/target/release/build/crypto_hash_sha512-8610fd54643f5720/out" "-L" ".../supercop-data/panther/amd64/try/c/clang_-march=native_-O2_-fwrapv_-Qunused-arguments_-fPIC_-fPIE_-gdwarf-4_-Wall/constbranchindex/crypto_hash/sha512/rust_crypto/work/target/release/build/rust-crypto-afe9b4ff19c80bbc/out" "-L" "/usr/lib/rustlib/x86_64-unknown-linux-gnu/lib" "-ltry-anything" "-ltry" "-lsupercop" "-lkernelrandombytes" "-lcpucycles" "-lcrypto" "-lntl" "-lnsl" "-lm" "-Wl,-Bstatic" ".../supercop-data/panther/amd64/try/c/clang_-march=native_-O2_-fwrapv_-Qunused-arguments_-fPIC_-fPIE_-gdwarf-4_-Wall/constbranchindex/crypto_hash/sha512/rust_crypto/work/target/release/deps/libcrypto_hash_sha512-8954649d64f571b5.rlib" ".../supercop-data/panther/amd64/try/c/clang_-march=native_-O2_-fwrapv_-Qunused-arguments_-fPIC_-fPIE_-gdwarf-4_-Wall/constbranchindex/crypto_hash/sha512/rust_crypto/work/target/release/deps/libcrypto-83ceebf3c7290f98.rlib" ".../supercop-data/panther/amd64/try/c/clang_-march=native_-O2_-fwrapv_-Qunused-arguments_-fPIC_-fPIE_-gdwarf-4_-Wall/constbranchindex/crypto_hash/sha512/rust_crypto/work/target/release/deps/libtime-b473882f9f54487c.rlib" ".../supercop-data/panther/amd64/try/c/clang_-march=native_-O2_-fwrapv_-Qunused-arguments_-fPIC_-fPIE_-gdwarf-4_-Wall/constbranchindex/crypto_hash/sha512/rust_crypto/work/target/release/deps/librustc_serialize-72942cfdca4fb518.rlib" ".../supercop-data/panther/amd64/try/c/clang_-march=native_-O2_-fwrapv_-Qunused-arguments_-fPIC_-fPIE_-gdwarf-4_-Wall/constbranchindex/crypto_hash/sha512/rust_crypto/work/target/release/deps/librand-2cdf248a3f2ca473.rlib" ".../supercop-data/panther/amd64/try/c/clang_-march=native_-O2_-fwrapv_-Qunused-arguments_-fPIC_-fPIE_-gdwarf-4_-Wall/constbranchindex/crypto_hash/sha512/rust_crypto/work/target/release/deps/librand-7df229a95dbcb448.rlib" ".../supercop-data/panther/amd64/try/c/clang_-march=native_-O2_-fwrapv_-Qunused-arguments_-fPIC_-fPIE_-gdwarf-4_-Wall/constbranchindex/crypto_hash/sha512/rust_crypto/work/target/release/deps/liblibc-141c671f2ddc755d.rlib" "-Wl,--start-group" "/usr/lib/rustlib/x86_64-unknown-linux-gnu/lib/libstd-6bf3f16f340782ca.rlib" "/usr/lib/rustlib/x86_64-unknown-linux-gnu/lib/libpanic_unwind-13f3099d50c21bc6.rlib" "/usr/lib/rustlib/x86_64-unknown-linux-gnu/lib/libminiz_oxide-a2ba33c985785afe.rlib" "/usr/lib/rustlib/x86_64-unknown-linux-gnu/lib/libadler-3f6e9f8f4afbea6d.rlib" "/usr/lib/rustlib/x86_64-unknown-linux-gnu/lib/libobject-af517d7f13e7c960.rlib" "/usr/lib/rustlib/x86_64-unknown-linux-gnu/lib/libaddr2line-12740563628e601f.rlib" "/usr/lib/rustlib/x86_64-unknown-linux-gnu/lib/libgimli-0ac82a1e1820dd21.rlib" "/usr/lib/rustlib/x86_64-unknown-linux-gnu/lib/librustc_demangle-3ac2d0878c297d42.rlib" "/usr/lib/rustlib/x86_64-unknown-linux-gnu/lib/libhashbrown-c6632ca171f954dd.rlib" "/usr/lib/rustlib/x86_64-unknown-linux-gnu/lib/librustc_std_workspace_alloc-b5bfd0198c7b740d.rlib" "/usr/lib/rustlib/x86_64-unknown-linux-gnu/lib/libunwind-bd645b20c6c7b56d.rlib" "/usr/lib/rustlib/x86_64-unknown-linux-gnu/lib/libcfg_if-b9e1e523c0c29a77.rlib" "/usr/lib/rustlib/x86_64-unknown-linux-gnu/lib/liblibc-dfbef8c525de0186.rlib" "/usr/lib/rustlib/x86_64-unknown-linux-gnu/lib/liballoc-1ebf406bd4ea5769.rlib" "/usr/lib/rustlib/x86_64-unknown-linux-gnu/lib/librustc_std_workspace_core-5e0675f526ef5c6b.rlib" "/usr/lib/rustlib/x86_64-unknown-linux-gnu/lib/libcore-3375e4f89d420e7a.rlib" "-Wl,--end-group" "/usr/lib/rustlib/x86_64-unknown-linux-gnu/lib/libcompiler_builtins-f74b197469e67088.rlib" "-Wl,-Bdynamic" "-lgcc_s" "-lc" "-lm" "-lrt" "-lpthread" "-lutil" "-ldl" "-lutil"
try.c:   = note: /usr/bin/ld: cannot find -lcpucycles
try.c:           collect2: error: ld returned 1 exit status
try.c:
try.c:
try.c: error: aborting due to previous error
try.c:
try.c: error: could not compile `crypto_hash_sha512`.
try.c:
try.c: To learn more, run the command again with --verbose.

Number of similar (implementation,compiler) pairs: 1, namely:
ImplementationCompiler
rust_cryptoclang -march=native -O2 -fwrapv -Qunused-arguments -fPIC -fPIE -gdwarf-4 -Wall (Debian_Clang_11.0.1)

Compiler output


try.c: error: linking with `cc` failed: exit code: 1
try.c:   |
try.c:   = note: "cc" "-Wl,--as-needed" "-Wl,-z,noexecstack" "-m64" "-Wl,--eh-frame-hdr" "-L" "/usr/lib/rustlib/x86_64-unknown-linux-gnu/lib" ".../supercop-data/panther/amd64/try/c/clang_-march=native_-O3_-fwrapv_-Qunused-arguments_-fPIC_-fPIE_-gdwarf-4_-Wall/constbranchindex/crypto_hash/sha512/rust_crypto/work/target/release/deps/try-9887c9168535d8bb.try.7fu8k6xf-cgu.0.rcgu.o" ".../supercop-data/panther/amd64/try/c/clang_-march=native_-O3_-fwrapv_-Qunused-arguments_-fPIC_-fPIE_-gdwarf-4_-Wall/constbranchindex/crypto_hash/sha512/rust_crypto/work/target/release/deps/try-9887c9168535d8bb.try.7fu8k6xf-cgu.1.rcgu.o" ".../supercop-data/panther/amd64/try/c/clang_-march=native_-O3_-fwrapv_-Qunused-arguments_-fPIC_-fPIE_-gdwarf-4_-Wall/constbranchindex/crypto_hash/sha512/rust_crypto/work/target/release/deps/try-9887c9168535d8bb.try.7fu8k6xf-cgu.2.rcgu.o" ".../supercop-data/panther/amd64/try/c/clang_-march=native_-O3_-fwrapv_-Qunused-arguments_-fPIC_-fPIE_-gdwarf-4_-Wall/constbranchindex/crypto_hash/sha512/rust_crypto/work/target/release/deps/try-9887c9168535d8bb.try.7fu8k6xf-cgu.3.rcgu.o" ".../supercop-data/panther/amd64/try/c/clang_-march=native_-O3_-fwrapv_-Qunused-arguments_-fPIC_-fPIE_-gdwarf-4_-Wall/constbranchindex/crypto_hash/sha512/rust_crypto/work/target/release/deps/try-9887c9168535d8bb.try.7fu8k6xf-cgu.4.rcgu.o" "-o" ".../supercop-data/panther/amd64/try/c/clang_-march=native_-O3_-fwrapv_-Qunused-arguments_-fPIC_-fPIE_-gdwarf-4_-Wall/constbranchindex/crypto_hash/sha512/rust_crypto/work/target/release/deps/try-9887c9168535d8bb" ".../supercop-data/panther/amd64/try/c/clang_-march=native_-O3_-fwrapv_-Qunused-arguments_-fPIC_-fPIE_-gdwarf-4_-Wall/constbranchindex/crypto_hash/sha512/rust_crypto/work/target/release/deps/try-9887c9168535d8bb.43eldm92am99c3dw.rcgu.o" "-Wl,--gc-sections" "-pie" "-Wl,-zrelro" "-Wl,-znow" "-Wl,-O1" "-nodefaultlibs" "-L" ".../supercop-data/panther/amd64/try/c/clang_-march=native_-O3_-fwrapv_-Qunused-arguments_-fPIC_-fPIE_-gdwarf-4_-Wall/constbranchindex/crypto_hash/sha512/rust_crypto/work/target/release/deps" "-L" ".../supercop-data/panther/amd64/lib" "-L" ".../supercop-data/panther/amd64/try/c/clang_-march=native_-O3_-fwrapv_-Qunused-arguments_-fPIC_-fPIE_-gdwarf-4_-Wall/constbranchindex/crypto_hash/sha512/rust_crypto/work/target/release/build/crypto_hash_sha512-8610fd54643f5720/out" "-L" ".../supercop-data/panther/amd64/try/c/clang_-march=native_-O3_-fwrapv_-Qunused-arguments_-fPIC_-fPIE_-gdwarf-4_-Wall/constbranchindex/crypto_hash/sha512/rust_crypto/work/target/release/build/rust-crypto-afe9b4ff19c80bbc/out" "-L" "/usr/lib/rustlib/x86_64-unknown-linux-gnu/lib" "-ltry-anything" "-ltry" "-lsupercop" "-lkernelrandombytes" "-lcpucycles" "-lcrypto" "-lntl" "-lnsl" "-lm" "-Wl,-Bstatic" ".../supercop-data/panther/amd64/try/c/clang_-march=native_-O3_-fwrapv_-Qunused-arguments_-fPIC_-fPIE_-gdwarf-4_-Wall/constbranchindex/crypto_hash/sha512/rust_crypto/work/target/release/deps/libcrypto_hash_sha512-8954649d64f571b5.rlib" ".../supercop-data/panther/amd64/try/c/clang_-march=native_-O3_-fwrapv_-Qunused-arguments_-fPIC_-fPIE_-gdwarf-4_-Wall/constbranchindex/crypto_hash/sha512/rust_crypto/work/target/release/deps/libcrypto-83ceebf3c7290f98.rlib" ".../supercop-data/panther/amd64/try/c/clang_-march=native_-O3_-fwrapv_-Qunused-arguments_-fPIC_-fPIE_-gdwarf-4_-Wall/constbranchindex/crypto_hash/sha512/rust_crypto/work/target/release/deps/libtime-b473882f9f54487c.rlib" ".../supercop-data/panther/amd64/try/c/clang_-march=native_-O3_-fwrapv_-Qunused-arguments_-fPIC_-fPIE_-gdwarf-4_-Wall/constbranchindex/crypto_hash/sha512/rust_crypto/work/target/release/deps/librustc_serialize-72942cfdca4fb518.rlib" ".../supercop-data/panther/amd64/try/c/clang_-march=native_-O3_-fwrapv_-Qunused-arguments_-fPIC_-fPIE_-gdwarf-4_-Wall/constbranchindex/crypto_hash/sha512/rust_crypto/work/target/release/deps/librand-2cdf248a3f2ca473.rlib" ".../supercop-data/panther/amd64/try/c/clang_-march=native_-O3_-fwrapv_-Qunused-arguments_-fPIC_-fPIE_-gdwarf-4_-Wall/constbranchindex/crypto_hash/sha512/rust_crypto/work/target/release/deps/librand-7df229a95dbcb448.rlib" ".../supercop-data/panther/amd64/try/c/clang_-march=native_-O3_-fwrapv_-Qunused-arguments_-fPIC_-fPIE_-gdwarf-4_-Wall/constbranchindex/crypto_hash/sha512/rust_crypto/work/target/release/deps/liblibc-141c671f2ddc755d.rlib" "-Wl,--start-group" "/usr/lib/rustlib/x86_64-unknown-linux-gnu/lib/libstd-6bf3f16f340782ca.rlib" "/usr/lib/rustlib/x86_64-unknown-linux-gnu/lib/libpanic_unwind-13f3099d50c21bc6.rlib" "/usr/lib/rustlib/x86_64-unknown-linux-gnu/lib/libminiz_oxide-a2ba33c985785afe.rlib" "/usr/lib/rustlib/x86_64-unknown-linux-gnu/lib/libadler-3f6e9f8f4afbea6d.rlib" "/usr/lib/rustlib/x86_64-unknown-linux-gnu/lib/libobject-af517d7f13e7c960.rlib" "/usr/lib/rustlib/x86_64-unknown-linux-gnu/lib/libaddr2line-12740563628e601f.rlib" "/usr/lib/rustlib/x86_64-unknown-linux-gnu/lib/libgimli-0ac82a1e1820dd21.rlib" "/usr/lib/rustlib/x86_64-unknown-linux-gnu/lib/librustc_demangle-3ac2d0878c297d42.rlib" "/usr/lib/rustlib/x86_64-unknown-linux-gnu/lib/libhashbrown-c6632ca171f954dd.rlib" "/usr/lib/rustlib/x86_64-unknown-linux-gnu/lib/librustc_std_workspace_alloc-b5bfd0198c7b740d.rlib" "/usr/lib/rustlib/x86_64-unknown-linux-gnu/lib/libunwind-bd645b20c6c7b56d.rlib" "/usr/lib/rustlib/x86_64-unknown-linux-gnu/lib/libcfg_if-b9e1e523c0c29a77.rlib" "/usr/lib/rustlib/x86_64-unknown-linux-gnu/lib/liblibc-dfbef8c525de0186.rlib" "/usr/lib/rustlib/x86_64-unknown-linux-gnu/lib/liballoc-1ebf406bd4ea5769.rlib" "/usr/lib/rustlib/x86_64-unknown-linux-gnu/lib/librustc_std_workspace_core-5e0675f526ef5c6b.rlib" "/usr/lib/rustlib/x86_64-unknown-linux-gnu/lib/libcore-3375e4f89d420e7a.rlib" "-Wl,--end-group" "/usr/lib/rustlib/x86_64-unknown-linux-gnu/lib/libcompiler_builtins-f74b197469e67088.rlib" "-Wl,-Bdynamic" "-lgcc_s" "-lc" "-lm" "-lrt" "-lpthread" "-lutil" "-ldl" "-lutil"
try.c:   = note: /usr/bin/ld: cannot find -lcpucycles
try.c:           collect2: error: ld returned 1 exit status
try.c:
try.c:
try.c: error: aborting due to previous error
try.c:
try.c: error: could not compile `crypto_hash_sha512`.
try.c:
try.c: To learn more, run the command again with --verbose.

Number of similar (implementation,compiler) pairs: 1, namely:
ImplementationCompiler
rust_cryptoclang -march=native -O3 -fwrapv -Qunused-arguments -fPIC -fPIE -gdwarf-4 -Wall (Debian_Clang_11.0.1)

Compiler output


try.c: error: linking with `cc` failed: exit code: 1
try.c:   |
try.c:   = note: "cc" "-Wl,--as-needed" "-Wl,-z,noexecstack" "-m64" "-Wl,--eh-frame-hdr" "-L" "/usr/lib/rustlib/x86_64-unknown-linux-gnu/lib" ".../supercop-data/panther/amd64/try/c/clang_-march=native_-O_-fwrapv_-Qunused-arguments_-fPIC_-fPIE_-gdwarf-4_-Wall/constbranchindex/crypto_hash/sha512/rust_crypto/work/target/release/deps/try_small-32c0afd311bd2237.try_small.abwnd5no-cgu.0.rcgu.o" ".../supercop-data/panther/amd64/try/c/clang_-march=native_-O_-fwrapv_-Qunused-arguments_-fPIC_-fPIE_-gdwarf-4_-Wall/constbranchindex/crypto_hash/sha512/rust_crypto/work/target/release/deps/try_small-32c0afd311bd2237.try_small.abwnd5no-cgu.1.rcgu.o" ".../supercop-data/panther/amd64/try/c/clang_-march=native_-O_-fwrapv_-Qunused-arguments_-fPIC_-fPIE_-gdwarf-4_-Wall/constbranchindex/crypto_hash/sha512/rust_crypto/work/target/release/deps/try_small-32c0afd311bd2237.try_small.abwnd5no-cgu.2.rcgu.o" ".../supercop-data/panther/amd64/try/c/clang_-march=native_-O_-fwrapv_-Qunused-arguments_-fPIC_-fPIE_-gdwarf-4_-Wall/constbranchindex/crypto_hash/sha512/rust_crypto/work/target/release/deps/try_small-32c0afd311bd2237.try_small.abwnd5no-cgu.3.rcgu.o" ".../supercop-data/panther/amd64/try/c/clang_-march=native_-O_-fwrapv_-Qunused-arguments_-fPIC_-fPIE_-gdwarf-4_-Wall/constbranchindex/crypto_hash/sha512/rust_crypto/work/target/release/deps/try_small-32c0afd311bd2237.try_small.abwnd5no-cgu.4.rcgu.o" "-o" ".../supercop-data/panther/amd64/try/c/clang_-march=native_-O_-fwrapv_-Qunused-arguments_-fPIC_-fPIE_-gdwarf-4_-Wall/constbranchindex/crypto_hash/sha512/rust_crypto/work/target/release/deps/try_small-32c0afd311bd2237" ".../supercop-data/panther/amd64/try/c/clang_-march=native_-O_-fwrapv_-Qunused-arguments_-fPIC_-fPIE_-gdwarf-4_-Wall/constbranchindex/crypto_hash/sha512/rust_crypto/work/target/release/deps/try_small-32c0afd311bd2237.2p3c333r80tuotid.rcgu.o" "-Wl,--gc-sections" "-pie" "-Wl,-zrelro" "-Wl,-znow" "-Wl,-O1" "-nodefaultlibs" "-L" ".../supercop-data/panther/amd64/try/c/clang_-march=native_-O_-fwrapv_-Qunused-arguments_-fPIC_-fPIE_-gdwarf-4_-Wall/constbranchindex/crypto_hash/sha512/rust_crypto/work/target/release/deps" "-L" ".../supercop-data/panther/amd64/lib" "-L" ".../supercop-data/panther/amd64/try/c/clang_-march=native_-O_-fwrapv_-Qunused-arguments_-fPIC_-fPIE_-gdwarf-4_-Wall/constbranchindex/crypto_hash/sha512/rust_crypto/work/target/release/build/crypto_hash_sha512-8610fd54643f5720/out" "-L" ".../supercop-data/panther/amd64/try/c/clang_-march=native_-O_-fwrapv_-Qunused-arguments_-fPIC_-fPIE_-gdwarf-4_-Wall/constbranchindex/crypto_hash/sha512/rust_crypto/work/target/release/build/rust-crypto-afe9b4ff19c80bbc/out" "-L" "/usr/lib/rustlib/x86_64-unknown-linux-gnu/lib" "-ltry-anything" "-ltry-small" "-lsupercop" "-lkernelrandombytes" "-lcpucycles" "-lcrypto" "-lntl" "-lnsl" "-lm" "-Wl,-Bstatic" ".../supercop-data/panther/amd64/try/c/clang_-march=native_-O_-fwrapv_-Qunused-arguments_-fPIC_-fPIE_-gdwarf-4_-Wall/constbranchindex/crypto_hash/sha512/rust_crypto/work/target/release/deps/libcrypto_hash_sha512-8954649d64f571b5.rlib" ".../supercop-data/panther/amd64/try/c/clang_-march=native_-O_-fwrapv_-Qunused-arguments_-fPIC_-fPIE_-gdwarf-4_-Wall/constbranchindex/crypto_hash/sha512/rust_crypto/work/target/release/deps/libcrypto-83ceebf3c7290f98.rlib" ".../supercop-data/panther/amd64/try/c/clang_-march=native_-O_-fwrapv_-Qunused-arguments_-fPIC_-fPIE_-gdwarf-4_-Wall/constbranchindex/crypto_hash/sha512/rust_crypto/work/target/release/deps/libtime-b473882f9f54487c.rlib" ".../supercop-data/panther/amd64/try/c/clang_-march=native_-O_-fwrapv_-Qunused-arguments_-fPIC_-fPIE_-gdwarf-4_-Wall/constbranchindex/crypto_hash/sha512/rust_crypto/work/target/release/deps/librustc_serialize-72942cfdca4fb518.rlib" ".../supercop-data/panther/amd64/try/c/clang_-march=native_-O_-fwrapv_-Qunused-arguments_-fPIC_-fPIE_-gdwarf-4_-Wall/constbranchindex/crypto_hash/sha512/rust_crypto/work/target/release/deps/librand-2cdf248a3f2ca473.rlib" ".../supercop-data/panther/amd64/try/c/clang_-march=native_-O_-fwrapv_-Qunused-arguments_-fPIC_-fPIE_-gdwarf-4_-Wall/constbranchindex/crypto_hash/sha512/rust_crypto/work/target/release/deps/librand-7df229a95dbcb448.rlib" ".../supercop-data/panther/amd64/try/c/clang_-march=native_-O_-fwrapv_-Qunused-arguments_-fPIC_-fPIE_-gdwarf-4_-Wall/constbranchindex/crypto_hash/sha512/rust_crypto/work/target/release/deps/liblibc-141c671f2ddc755d.rlib" "-Wl,--start-group" "/usr/lib/rustlib/x86_64-unknown-linux-gnu/lib/libstd-6bf3f16f340782ca.rlib" "/usr/lib/rustlib/x86_64-unknown-linux-gnu/lib/libpanic_unwind-13f3099d50c21bc6.rlib" "/usr/lib/rustlib/x86_64-unknown-linux-gnu/lib/libminiz_oxide-a2ba33c985785afe.rlib" "/usr/lib/rustlib/x86_64-unknown-linux-gnu/lib/libadler-3f6e9f8f4afbea6d.rlib" "/usr/lib/rustlib/x86_64-unknown-linux-gnu/lib/libobject-af517d7f13e7c960.rlib" "/usr/lib/rustlib/x86_64-unknown-linux-gnu/lib/libaddr2line-12740563628e601f.rlib" "/usr/lib/rustlib/x86_64-unknown-linux-gnu/lib/libgimli-0ac82a1e1820dd21.rlib" "/usr/lib/rustlib/x86_64-unknown-linux-gnu/lib/librustc_demangle-3ac2d0878c297d42.rlib" "/usr/lib/rustlib/x86_64-unknown-linux-gnu/lib/libhashbrown-c6632ca171f954dd.rlib" "/usr/lib/rustlib/x86_64-unknown-linux-gnu/lib/librustc_std_workspace_alloc-b5bfd0198c7b740d.rlib" "/usr/lib/rustlib/x86_64-unknown-linux-gnu/lib/libunwind-bd645b20c6c7b56d.rlib" "/usr/lib/rustlib/x86_64-unknown-linux-gnu/lib/libcfg_if-b9e1e523c0c29a77.rlib" "/usr/lib/rustlib/x86_64-unknown-linux-gnu/lib/liblibc-dfbef8c525de0186.rlib" "/usr/lib/rustlib/x86_64-unknown-linux-gnu/lib/liballoc-1ebf406bd4ea5769.rlib" "/usr/lib/rustlib/x86_64-unknown-linux-gnu/lib/librustc_std_workspace_core-5e0675f526ef5c6b.rlib" "/usr/lib/rustlib/x86_64-unknown-linux-gnu/lib/libcore-3375e4f89d420e7a.rlib" "-Wl,--end-group" "/usr/lib/rustlib/x86_64-unknown-linux-gnu/lib/libcompiler_builtins-f74b197469e67088.rlib" "-Wl,-Bdynamic" "-lgcc_s" "-lc" "-lm" "-lrt" "-lpthread" "-lutil" "-ldl" "-lutil"
try.c:   = note: /usr/bin/ld: cannot find -lcpucycles
try.c:           collect2: error: ld returned 1 exit status
try.c:
try.c:
try.c: error: aborting due to previous error
try.c:
try.c: error: could not compile `crypto_hash_sha512`.
try.c:
try.c: To learn more, run the command again with --verbose.

Number of similar (implementation,compiler) pairs: 1, namely:
ImplementationCompiler
rust_cryptoclang -march=native -O -fwrapv -Qunused-arguments -fPIC -fPIE -gdwarf-4 -Wall (Debian_Clang_11.0.1)

Compiler output


try.c: error: linking with `cc` failed: exit code: 1
try.c:   |
try.c:   = note: "cc" "-Wl,--as-needed" "-Wl,-z,noexecstack" "-m64" "-Wl,--eh-frame-hdr" "-L" "/usr/lib/rustlib/x86_64-unknown-linux-gnu/lib" ".../supercop-data/panther/amd64/try/c/clang_-march=native_-Os_-fwrapv_-Qunused-arguments_-fPIC_-fPIE_-gdwarf-4_-Wall/constbranchindex/crypto_hash/sha512/rust_crypto/work/target/release/deps/try_small-32c0afd311bd2237.try_small.abwnd5no-cgu.0.rcgu.o" ".../supercop-data/panther/amd64/try/c/clang_-march=native_-Os_-fwrapv_-Qunused-arguments_-fPIC_-fPIE_-gdwarf-4_-Wall/constbranchindex/crypto_hash/sha512/rust_crypto/work/target/release/deps/try_small-32c0afd311bd2237.try_small.abwnd5no-cgu.1.rcgu.o" ".../supercop-data/panther/amd64/try/c/clang_-march=native_-Os_-fwrapv_-Qunused-arguments_-fPIC_-fPIE_-gdwarf-4_-Wall/constbranchindex/crypto_hash/sha512/rust_crypto/work/target/release/deps/try_small-32c0afd311bd2237.try_small.abwnd5no-cgu.2.rcgu.o" ".../supercop-data/panther/amd64/try/c/clang_-march=native_-Os_-fwrapv_-Qunused-arguments_-fPIC_-fPIE_-gdwarf-4_-Wall/constbranchindex/crypto_hash/sha512/rust_crypto/work/target/release/deps/try_small-32c0afd311bd2237.try_small.abwnd5no-cgu.3.rcgu.o" ".../supercop-data/panther/amd64/try/c/clang_-march=native_-Os_-fwrapv_-Qunused-arguments_-fPIC_-fPIE_-gdwarf-4_-Wall/constbranchindex/crypto_hash/sha512/rust_crypto/work/target/release/deps/try_small-32c0afd311bd2237.try_small.abwnd5no-cgu.4.rcgu.o" "-o" ".../supercop-data/panther/amd64/try/c/clang_-march=native_-Os_-fwrapv_-Qunused-arguments_-fPIC_-fPIE_-gdwarf-4_-Wall/constbranchindex/crypto_hash/sha512/rust_crypto/work/target/release/deps/try_small-32c0afd311bd2237" ".../supercop-data/panther/amd64/try/c/clang_-march=native_-Os_-fwrapv_-Qunused-arguments_-fPIC_-fPIE_-gdwarf-4_-Wall/constbranchindex/crypto_hash/sha512/rust_crypto/work/target/release/deps/try_small-32c0afd311bd2237.2p3c333r80tuotid.rcgu.o" "-Wl,--gc-sections" "-pie" "-Wl,-zrelro" "-Wl,-znow" "-Wl,-O1" "-nodefaultlibs" "-L" ".../supercop-data/panther/amd64/try/c/clang_-march=native_-Os_-fwrapv_-Qunused-arguments_-fPIC_-fPIE_-gdwarf-4_-Wall/constbranchindex/crypto_hash/sha512/rust_crypto/work/target/release/deps" "-L" ".../supercop-data/panther/amd64/lib" "-L" ".../supercop-data/panther/amd64/try/c/clang_-march=native_-Os_-fwrapv_-Qunused-arguments_-fPIC_-fPIE_-gdwarf-4_-Wall/constbranchindex/crypto_hash/sha512/rust_crypto/work/target/release/build/crypto_hash_sha512-8610fd54643f5720/out" "-L" ".../supercop-data/panther/amd64/try/c/clang_-march=native_-Os_-fwrapv_-Qunused-arguments_-fPIC_-fPIE_-gdwarf-4_-Wall/constbranchindex/crypto_hash/sha512/rust_crypto/work/target/release/build/rust-crypto-afe9b4ff19c80bbc/out" "-L" "/usr/lib/rustlib/x86_64-unknown-linux-gnu/lib" "-ltry-anything" "-ltry-small" "-lsupercop" "-lkernelrandombytes" "-lcpucycles" "-lcrypto" "-lntl" "-lnsl" "-lm" "-Wl,-Bstatic" ".../supercop-data/panther/amd64/try/c/clang_-march=native_-Os_-fwrapv_-Qunused-arguments_-fPIC_-fPIE_-gdwarf-4_-Wall/constbranchindex/crypto_hash/sha512/rust_crypto/work/target/release/deps/libcrypto_hash_sha512-8954649d64f571b5.rlib" ".../supercop-data/panther/amd64/try/c/clang_-march=native_-Os_-fwrapv_-Qunused-arguments_-fPIC_-fPIE_-gdwarf-4_-Wall/constbranchindex/crypto_hash/sha512/rust_crypto/work/target/release/deps/libcrypto-83ceebf3c7290f98.rlib" ".../supercop-data/panther/amd64/try/c/clang_-march=native_-Os_-fwrapv_-Qunused-arguments_-fPIC_-fPIE_-gdwarf-4_-Wall/constbranchindex/crypto_hash/sha512/rust_crypto/work/target/release/deps/libtime-b473882f9f54487c.rlib" ".../supercop-data/panther/amd64/try/c/clang_-march=native_-Os_-fwrapv_-Qunused-arguments_-fPIC_-fPIE_-gdwarf-4_-Wall/constbranchindex/crypto_hash/sha512/rust_crypto/work/target/release/deps/librustc_serialize-72942cfdca4fb518.rlib" ".../supercop-data/panther/amd64/try/c/clang_-march=native_-Os_-fwrapv_-Qunused-arguments_-fPIC_-fPIE_-gdwarf-4_-Wall/constbranchindex/crypto_hash/sha512/rust_crypto/work/target/release/deps/librand-2cdf248a3f2ca473.rlib" ".../supercop-data/panther/amd64/try/c/clang_-march=native_-Os_-fwrapv_-Qunused-arguments_-fPIC_-fPIE_-gdwarf-4_-Wall/constbranchindex/crypto_hash/sha512/rust_crypto/work/target/release/deps/librand-7df229a95dbcb448.rlib" ".../supercop-data/panther/amd64/try/c/clang_-march=native_-Os_-fwrapv_-Qunused-arguments_-fPIC_-fPIE_-gdwarf-4_-Wall/constbranchindex/crypto_hash/sha512/rust_crypto/work/target/release/deps/liblibc-141c671f2ddc755d.rlib" "-Wl,--start-group" "/usr/lib/rustlib/x86_64-unknown-linux-gnu/lib/libstd-6bf3f16f340782ca.rlib" "/usr/lib/rustlib/x86_64-unknown-linux-gnu/lib/libpanic_unwind-13f3099d50c21bc6.rlib" "/usr/lib/rustlib/x86_64-unknown-linux-gnu/lib/libminiz_oxide-a2ba33c985785afe.rlib" "/usr/lib/rustlib/x86_64-unknown-linux-gnu/lib/libadler-3f6e9f8f4afbea6d.rlib" "/usr/lib/rustlib/x86_64-unknown-linux-gnu/lib/libobject-af517d7f13e7c960.rlib" "/usr/lib/rustlib/x86_64-unknown-linux-gnu/lib/libaddr2line-12740563628e601f.rlib" "/usr/lib/rustlib/x86_64-unknown-linux-gnu/lib/libgimli-0ac82a1e1820dd21.rlib" "/usr/lib/rustlib/x86_64-unknown-linux-gnu/lib/librustc_demangle-3ac2d0878c297d42.rlib" "/usr/lib/rustlib/x86_64-unknown-linux-gnu/lib/libhashbrown-c6632ca171f954dd.rlib" "/usr/lib/rustlib/x86_64-unknown-linux-gnu/lib/librustc_std_workspace_alloc-b5bfd0198c7b740d.rlib" "/usr/lib/rustlib/x86_64-unknown-linux-gnu/lib/libunwind-bd645b20c6c7b56d.rlib" "/usr/lib/rustlib/x86_64-unknown-linux-gnu/lib/libcfg_if-b9e1e523c0c29a77.rlib" "/usr/lib/rustlib/x86_64-unknown-linux-gnu/lib/liblibc-dfbef8c525de0186.rlib" "/usr/lib/rustlib/x86_64-unknown-linux-gnu/lib/liballoc-1ebf406bd4ea5769.rlib" "/usr/lib/rustlib/x86_64-unknown-linux-gnu/lib/librustc_std_workspace_core-5e0675f526ef5c6b.rlib" "/usr/lib/rustlib/x86_64-unknown-linux-gnu/lib/libcore-3375e4f89d420e7a.rlib" "-Wl,--end-group" "/usr/lib/rustlib/x86_64-unknown-linux-gnu/lib/libcompiler_builtins-f74b197469e67088.rlib" "-Wl,-Bdynamic" "-lgcc_s" "-lc" "-lm" "-lrt" "-lpthread" "-lutil" "-ldl" "-lutil"
try.c:   = note: /usr/bin/ld: cannot find -lcpucycles
try.c:           collect2: error: ld returned 1 exit status
try.c:
try.c:
try.c: error: aborting due to previous error
try.c:
try.c: error: could not compile `crypto_hash_sha512`.
try.c:
try.c: To learn more, run the command again with --verbose.

Number of similar (implementation,compiler) pairs: 1, namely:
ImplementationCompiler
rust_cryptoclang -march=native -Os -fwrapv -Qunused-arguments -fPIC -fPIE -gdwarf-4 -Wall (Debian_Clang_11.0.1)

Compiler output


try.c: error: linking with `cc` failed: exit code: 1
try.c:   |
try.c:   = note: "cc" "-Wl,--as-needed" "-Wl,-z,noexecstack" "-m64" "-Wl,--eh-frame-hdr" "-L" "/usr/lib/rustlib/x86_64-unknown-linux-gnu/lib" ".../supercop-data/panther/amd64/try/c/clang_-mcpu=native_-O3_-fwrapv_-Qunused-arguments_-fPIC_-fPIE_-gdwarf-4_-Wall/constbranchindex/crypto_hash/sha512/rust_crypto/work/target/release/deps/try-9887c9168535d8bb.try.7fu8k6xf-cgu.0.rcgu.o" ".../supercop-data/panther/amd64/try/c/clang_-mcpu=native_-O3_-fwrapv_-Qunused-arguments_-fPIC_-fPIE_-gdwarf-4_-Wall/constbranchindex/crypto_hash/sha512/rust_crypto/work/target/release/deps/try-9887c9168535d8bb.try.7fu8k6xf-cgu.1.rcgu.o" ".../supercop-data/panther/amd64/try/c/clang_-mcpu=native_-O3_-fwrapv_-Qunused-arguments_-fPIC_-fPIE_-gdwarf-4_-Wall/constbranchindex/crypto_hash/sha512/rust_crypto/work/target/release/deps/try-9887c9168535d8bb.try.7fu8k6xf-cgu.2.rcgu.o" ".../supercop-data/panther/amd64/try/c/clang_-mcpu=native_-O3_-fwrapv_-Qunused-arguments_-fPIC_-fPIE_-gdwarf-4_-Wall/constbranchindex/crypto_hash/sha512/rust_crypto/work/target/release/deps/try-9887c9168535d8bb.try.7fu8k6xf-cgu.3.rcgu.o" ".../supercop-data/panther/amd64/try/c/clang_-mcpu=native_-O3_-fwrapv_-Qunused-arguments_-fPIC_-fPIE_-gdwarf-4_-Wall/constbranchindex/crypto_hash/sha512/rust_crypto/work/target/release/deps/try-9887c9168535d8bb.try.7fu8k6xf-cgu.4.rcgu.o" "-o" ".../supercop-data/panther/amd64/try/c/clang_-mcpu=native_-O3_-fwrapv_-Qunused-arguments_-fPIC_-fPIE_-gdwarf-4_-Wall/constbranchindex/crypto_hash/sha512/rust_crypto/work/target/release/deps/try-9887c9168535d8bb" ".../supercop-data/panther/amd64/try/c/clang_-mcpu=native_-O3_-fwrapv_-Qunused-arguments_-fPIC_-fPIE_-gdwarf-4_-Wall/constbranchindex/crypto_hash/sha512/rust_crypto/work/target/release/deps/try-9887c9168535d8bb.43eldm92am99c3dw.rcgu.o" "-Wl,--gc-sections" "-pie" "-Wl,-zrelro" "-Wl,-znow" "-Wl,-O1" "-nodefaultlibs" "-L" ".../supercop-data/panther/amd64/try/c/clang_-mcpu=native_-O3_-fwrapv_-Qunused-arguments_-fPIC_-fPIE_-gdwarf-4_-Wall/constbranchindex/crypto_hash/sha512/rust_crypto/work/target/release/deps" "-L" ".../supercop-data/panther/amd64/lib" "-L" ".../supercop-data/panther/amd64/try/c/clang_-mcpu=native_-O3_-fwrapv_-Qunused-arguments_-fPIC_-fPIE_-gdwarf-4_-Wall/constbranchindex/crypto_hash/sha512/rust_crypto/work/target/release/build/crypto_hash_sha512-8610fd54643f5720/out" "-L" ".../supercop-data/panther/amd64/try/c/clang_-mcpu=native_-O3_-fwrapv_-Qunused-arguments_-fPIC_-fPIE_-gdwarf-4_-Wall/constbranchindex/crypto_hash/sha512/rust_crypto/work/target/release/build/rust-crypto-afe9b4ff19c80bbc/out" "-L" "/usr/lib/rustlib/x86_64-unknown-linux-gnu/lib" "-ltry-anything" "-ltry" "-lsupercop" "-lkernelrandombytes" "-lcpucycles" "-lcrypto" "-lntl" "-lnsl" "-lm" "-Wl,-Bstatic" ".../supercop-data/panther/amd64/try/c/clang_-mcpu=native_-O3_-fwrapv_-Qunused-arguments_-fPIC_-fPIE_-gdwarf-4_-Wall/constbranchindex/crypto_hash/sha512/rust_crypto/work/target/release/deps/libcrypto_hash_sha512-8954649d64f571b5.rlib" ".../supercop-data/panther/amd64/try/c/clang_-mcpu=native_-O3_-fwrapv_-Qunused-arguments_-fPIC_-fPIE_-gdwarf-4_-Wall/constbranchindex/crypto_hash/sha512/rust_crypto/work/target/release/deps/libcrypto-83ceebf3c7290f98.rlib" ".../supercop-data/panther/amd64/try/c/clang_-mcpu=native_-O3_-fwrapv_-Qunused-arguments_-fPIC_-fPIE_-gdwarf-4_-Wall/constbranchindex/crypto_hash/sha512/rust_crypto/work/target/release/deps/libtime-b473882f9f54487c.rlib" ".../supercop-data/panther/amd64/try/c/clang_-mcpu=native_-O3_-fwrapv_-Qunused-arguments_-fPIC_-fPIE_-gdwarf-4_-Wall/constbranchindex/crypto_hash/sha512/rust_crypto/work/target/release/deps/librustc_serialize-72942cfdca4fb518.rlib" ".../supercop-data/panther/amd64/try/c/clang_-mcpu=native_-O3_-fwrapv_-Qunused-arguments_-fPIC_-fPIE_-gdwarf-4_-Wall/constbranchindex/crypto_hash/sha512/rust_crypto/work/target/release/deps/librand-2cdf248a3f2ca473.rlib" ".../supercop-data/panther/amd64/try/c/clang_-mcpu=native_-O3_-fwrapv_-Qunused-arguments_-fPIC_-fPIE_-gdwarf-4_-Wall/constbranchindex/crypto_hash/sha512/rust_crypto/work/target/release/deps/librand-7df229a95dbcb448.rlib" ".../supercop-data/panther/amd64/try/c/clang_-mcpu=native_-O3_-fwrapv_-Qunused-arguments_-fPIC_-fPIE_-gdwarf-4_-Wall/constbranchindex/crypto_hash/sha512/rust_crypto/work/target/release/deps/liblibc-141c671f2ddc755d.rlib" "-Wl,--start-group" "/usr/lib/rustlib/x86_64-unknown-linux-gnu/lib/libstd-6bf3f16f340782ca.rlib" "/usr/lib/rustlib/x86_64-unknown-linux-gnu/lib/libpanic_unwind-13f3099d50c21bc6.rlib" "/usr/lib/rustlib/x86_64-unknown-linux-gnu/lib/libminiz_oxide-a2ba33c985785afe.rlib" "/usr/lib/rustlib/x86_64-unknown-linux-gnu/lib/libadler-3f6e9f8f4afbea6d.rlib" "/usr/lib/rustlib/x86_64-unknown-linux-gnu/lib/libobject-af517d7f13e7c960.rlib" "/usr/lib/rustlib/x86_64-unknown-linux-gnu/lib/libaddr2line-12740563628e601f.rlib" "/usr/lib/rustlib/x86_64-unknown-linux-gnu/lib/libgimli-0ac82a1e1820dd21.rlib" "/usr/lib/rustlib/x86_64-unknown-linux-gnu/lib/librustc_demangle-3ac2d0878c297d42.rlib" "/usr/lib/rustlib/x86_64-unknown-linux-gnu/lib/libhashbrown-c6632ca171f954dd.rlib" "/usr/lib/rustlib/x86_64-unknown-linux-gnu/lib/librustc_std_workspace_alloc-b5bfd0198c7b740d.rlib" "/usr/lib/rustlib/x86_64-unknown-linux-gnu/lib/libunwind-bd645b20c6c7b56d.rlib" "/usr/lib/rustlib/x86_64-unknown-linux-gnu/lib/libcfg_if-b9e1e523c0c29a77.rlib" "/usr/lib/rustlib/x86_64-unknown-linux-gnu/lib/liblibc-dfbef8c525de0186.rlib" "/usr/lib/rustlib/x86_64-unknown-linux-gnu/lib/liballoc-1ebf406bd4ea5769.rlib" "/usr/lib/rustlib/x86_64-unknown-linux-gnu/lib/librustc_std_workspace_core-5e0675f526ef5c6b.rlib" "/usr/lib/rustlib/x86_64-unknown-linux-gnu/lib/libcore-3375e4f89d420e7a.rlib" "-Wl,--end-group" "/usr/lib/rustlib/x86_64-unknown-linux-gnu/lib/libcompiler_builtins-f74b197469e67088.rlib" "-Wl,-Bdynamic" "-lgcc_s" "-lc" "-lm" "-lrt" "-lpthread" "-lutil" "-ldl" "-lutil"
try.c:   = note: /usr/bin/ld: cannot find -lcpucycles
try.c:           collect2: error: ld returned 1 exit status
try.c:
try.c:
try.c: error: aborting due to previous error
try.c:
try.c: error: could not compile `crypto_hash_sha512`.
try.c:
try.c: To learn more, run the command again with --verbose.

Number of similar (implementation,compiler) pairs: 1, namely:
ImplementationCompiler
rust_cryptoclang -mcpu=native -O3 -fwrapv -Qunused-arguments -fPIC -fPIE -gdwarf-4 -Wall (Debian_Clang_11.0.1)

Compiler output


try.c: error: linking with `cc` failed: exit code: 1
try.c:   |
try.c:   = note: "cc" "-Wl,--as-needed" "-Wl,-z,noexecstack" "-m64" "-Wl,--eh-frame-hdr" "-L" "/usr/lib/rustlib/x86_64-unknown-linux-gnu/lib" ".../supercop-data/panther/amd64/try/c/gcc_-march=native_-mtune=native_-O2_-fwrapv_-fPIC_-fPIE_-gdwarf-4_-Wall/constbranchindex/crypto_hash/sha512/rust_crypto/work/target/release/deps/measure-f5a13548b969ffe4.measure.dytvjtxy-cgu.0.rcgu.o" ".../supercop-data/panther/amd64/try/c/gcc_-march=native_-mtune=native_-O2_-fwrapv_-fPIC_-fPIE_-gdwarf-4_-Wall/constbranchindex/crypto_hash/sha512/rust_crypto/work/target/release/deps/measure-f5a13548b969ffe4.measure.dytvjtxy-cgu.1.rcgu.o" ".../supercop-data/panther/amd64/try/c/gcc_-march=native_-mtune=native_-O2_-fwrapv_-fPIC_-fPIE_-gdwarf-4_-Wall/constbranchindex/crypto_hash/sha512/rust_crypto/work/target/release/deps/measure-f5a13548b969ffe4.measure.dytvjtxy-cgu.2.rcgu.o" ".../supercop-data/panther/amd64/try/c/gcc_-march=native_-mtune=native_-O2_-fwrapv_-fPIC_-fPIE_-gdwarf-4_-Wall/constbranchindex/crypto_hash/sha512/rust_crypto/work/target/release/deps/measure-f5a13548b969ffe4.measure.dytvjtxy-cgu.3.rcgu.o" ".../supercop-data/panther/amd64/try/c/gcc_-march=native_-mtune=native_-O2_-fwrapv_-fPIC_-fPIE_-gdwarf-4_-Wall/constbranchindex/crypto_hash/sha512/rust_crypto/work/target/release/deps/measure-f5a13548b969ffe4.measure.dytvjtxy-cgu.4.rcgu.o" "-o" ".../supercop-data/panther/amd64/try/c/gcc_-march=native_-mtune=native_-O2_-fwrapv_-fPIC_-fPIE_-gdwarf-4_-Wall/constbranchindex/crypto_hash/sha512/rust_crypto/work/target/release/deps/measure-f5a13548b969ffe4" ".../supercop-data/panther/amd64/try/c/gcc_-march=native_-mtune=native_-O2_-fwrapv_-fPIC_-fPIE_-gdwarf-4_-Wall/constbranchindex/crypto_hash/sha512/rust_crypto/work/target/release/deps/measure-f5a13548b969ffe4.3laqu3xw4ouaqdul.rcgu.o" "-Wl,--gc-sections" "-pie" "-Wl,-zrelro" "-Wl,-znow" "-Wl,-O1" "-nodefaultlibs" "-L" ".../supercop-data/panther/amd64/try/c/gcc_-march=native_-mtune=native_-O2_-fwrapv_-fPIC_-fPIE_-gdwarf-4_-Wall/constbranchindex/crypto_hash/sha512/rust_crypto/work/target/release/deps" "-L" ".../supercop-data/panther/amd64/lib" "-L" ".../supercop-data/panther/amd64/try/c/gcc_-march=native_-mtune=native_-O2_-fwrapv_-fPIC_-fPIE_-gdwarf-4_-Wall/constbranchindex/crypto_hash/sha512/rust_crypto/work/target/release/build/crypto_hash_sha512-8610fd54643f5720/out" "-L" ".../supercop-data/panther/amd64/try/c/gcc_-march=native_-mtune=native_-O2_-fwrapv_-fPIC_-fPIE_-gdwarf-4_-Wall/constbranchindex/crypto_hash/sha512/rust_crypto/work/target/release/build/rust-crypto-afe9b4ff19c80bbc/out" "-L" "/usr/lib/rustlib/x86_64-unknown-linux-gnu/lib" "-lmeasure-anything" "-lmeasure" "-lsupercop" "-lkernelrandombytes" "-lcpucycles" "-lcrypto" "-lntl" "-lnsl" "-lm" "-Wl,-Bstatic" ".../supercop-data/panther/amd64/try/c/gcc_-march=native_-mtune=native_-O2_-fwrapv_-fPIC_-fPIE_-gdwarf-4_-Wall/constbranchindex/crypto_hash/sha512/rust_crypto/work/target/release/deps/libcrypto_hash_sha512-8954649d64f571b5.rlib" ".../supercop-data/panther/amd64/try/c/gcc_-march=native_-mtune=native_-O2_-fwrapv_-fPIC_-fPIE_-gdwarf-4_-Wall/constbranchindex/crypto_hash/sha512/rust_crypto/work/target/release/deps/libcrypto-83ceebf3c7290f98.rlib" ".../supercop-data/panther/amd64/try/c/gcc_-march=native_-mtune=native_-O2_-fwrapv_-fPIC_-fPIE_-gdwarf-4_-Wall/constbranchindex/crypto_hash/sha512/rust_crypto/work/target/release/deps/libtime-b473882f9f54487c.rlib" ".../supercop-data/panther/amd64/try/c/gcc_-march=native_-mtune=native_-O2_-fwrapv_-fPIC_-fPIE_-gdwarf-4_-Wall/constbranchindex/crypto_hash/sha512/rust_crypto/work/target/release/deps/librustc_serialize-72942cfdca4fb518.rlib" ".../supercop-data/panther/amd64/try/c/gcc_-march=native_-mtune=native_-O2_-fwrapv_-fPIC_-fPIE_-gdwarf-4_-Wall/constbranchindex/crypto_hash/sha512/rust_crypto/work/target/release/deps/librand-2cdf248a3f2ca473.rlib" ".../supercop-data/panther/amd64/try/c/gcc_-march=native_-mtune=native_-O2_-fwrapv_-fPIC_-fPIE_-gdwarf-4_-Wall/constbranchindex/crypto_hash/sha512/rust_crypto/work/target/release/deps/librand-7df229a95dbcb448.rlib" ".../supercop-data/panther/amd64/try/c/gcc_-march=native_-mtune=native_-O2_-fwrapv_-fPIC_-fPIE_-gdwarf-4_-Wall/constbranchindex/crypto_hash/sha512/rust_crypto/work/target/release/deps/liblibc-141c671f2ddc755d.rlib" "-Wl,--start-group" "/usr/lib/rustlib/x86_64-unknown-linux-gnu/lib/libstd-6bf3f16f340782ca.rlib" "/usr/lib/rustlib/x86_64-unknown-linux-gnu/lib/libpanic_unwind-13f3099d50c21bc6.rlib" "/usr/lib/rustlib/x86_64-unknown-linux-gnu/lib/libminiz_oxide-a2ba33c985785afe.rlib" "/usr/lib/rustlib/x86_64-unknown-linux-gnu/lib/libadler-3f6e9f8f4afbea6d.rlib" "/usr/lib/rustlib/x86_64-unknown-linux-gnu/lib/libobject-af517d7f13e7c960.rlib" "/usr/lib/rustlib/x86_64-unknown-linux-gnu/lib/libaddr2line-12740563628e601f.rlib" "/usr/lib/rustlib/x86_64-unknown-linux-gnu/lib/libgimli-0ac82a1e1820dd21.rlib" "/usr/lib/rustlib/x86_64-unknown-linux-gnu/lib/librustc_demangle-3ac2d0878c297d42.rlib" "/usr/lib/rustlib/x86_64-unknown-linux-gnu/lib/libhashbrown-c6632ca171f954dd.rlib" "/usr/lib/rustlib/x86_64-unknown-linux-gnu/lib/librustc_std_workspace_alloc-b5bfd0198c7b740d.rlib" "/usr/lib/rustlib/x86_64-unknown-linux-gnu/lib/libunwind-bd645b20c6c7b56d.rlib" "/usr/lib/rustlib/x86_64-unknown-linux-gnu/lib/libcfg_if-b9e1e523c0c29a77.rlib" "/usr/lib/rustlib/x86_64-unknown-linux-gnu/lib/liblibc-dfbef8c525de0186.rlib" "/usr/lib/rustlib/x86_64-unknown-linux-gnu/lib/liballoc-1ebf406bd4ea5769.rlib" "/usr/lib/rustlib/x86_64-unknown-linux-gnu/lib/librustc_std_workspace_core-5e0675f526ef5c6b.rlib" "/usr/lib/rustlib/x86_64-unknown-linux-gnu/lib/libcore-3375e4f89d420e7a.rlib" "-Wl,--end-group" "/usr/lib/rustlib/x86_64-unknown-linux-gnu/lib/libcompiler_builtins-f74b197469e67088.rlib" "-Wl,-Bdynamic" "-lgcc_s" "-lc" "-lm" "-lrt" "-lpthread" "-lutil" "-ldl" "-lutil"
try.c:   = note: /usr/bin/ld: cannot find -lcpucycles
try.c:           collect2: error: ld returned 1 exit status
try.c:
try.c:
try.c: error: aborting due to previous error
try.c:
try.c: error: could not compile `crypto_hash_sha512`.
try.c:
try.c: To learn more, run the command again with --verbose.

Number of similar (implementation,compiler) pairs: 1, namely:
ImplementationCompiler
rust_cryptogcc -march=native -mtune=native -O2 -fwrapv -fPIC -fPIE -gdwarf-4 -Wall (10.2.1_20210110)

Compiler output


try.c: error: linking with `cc` failed: exit code: 1
try.c:   |
try.c:   = note: "cc" "-Wl,--as-needed" "-Wl,-z,noexecstack" "-m64" "-Wl,--eh-frame-hdr" "-L" "/usr/lib/rustlib/x86_64-unknown-linux-gnu/lib" ".../supercop-data/panther/amd64/try/c/gcc_-march=native_-mtune=native_-O3_-fwrapv_-fPIC_-fPIE_-gdwarf-4_-Wall/constbranchindex/crypto_hash/sha512/rust_crypto/work/target/release/deps/try_small-32c0afd311bd2237.try_small.abwnd5no-cgu.0.rcgu.o" ".../supercop-data/panther/amd64/try/c/gcc_-march=native_-mtune=native_-O3_-fwrapv_-fPIC_-fPIE_-gdwarf-4_-Wall/constbranchindex/crypto_hash/sha512/rust_crypto/work/target/release/deps/try_small-32c0afd311bd2237.try_small.abwnd5no-cgu.1.rcgu.o" ".../supercop-data/panther/amd64/try/c/gcc_-march=native_-mtune=native_-O3_-fwrapv_-fPIC_-fPIE_-gdwarf-4_-Wall/constbranchindex/crypto_hash/sha512/rust_crypto/work/target/release/deps/try_small-32c0afd311bd2237.try_small.abwnd5no-cgu.2.rcgu.o" ".../supercop-data/panther/amd64/try/c/gcc_-march=native_-mtune=native_-O3_-fwrapv_-fPIC_-fPIE_-gdwarf-4_-Wall/constbranchindex/crypto_hash/sha512/rust_crypto/work/target/release/deps/try_small-32c0afd311bd2237.try_small.abwnd5no-cgu.3.rcgu.o" ".../supercop-data/panther/amd64/try/c/gcc_-march=native_-mtune=native_-O3_-fwrapv_-fPIC_-fPIE_-gdwarf-4_-Wall/constbranchindex/crypto_hash/sha512/rust_crypto/work/target/release/deps/try_small-32c0afd311bd2237.try_small.abwnd5no-cgu.4.rcgu.o" "-o" ".../supercop-data/panther/amd64/try/c/gcc_-march=native_-mtune=native_-O3_-fwrapv_-fPIC_-fPIE_-gdwarf-4_-Wall/constbranchindex/crypto_hash/sha512/rust_crypto/work/target/release/deps/try_small-32c0afd311bd2237" ".../supercop-data/panther/amd64/try/c/gcc_-march=native_-mtune=native_-O3_-fwrapv_-fPIC_-fPIE_-gdwarf-4_-Wall/constbranchindex/crypto_hash/sha512/rust_crypto/work/target/release/deps/try_small-32c0afd311bd2237.2p3c333r80tuotid.rcgu.o" "-Wl,--gc-sections" "-pie" "-Wl,-zrelro" "-Wl,-znow" "-Wl,-O1" "-nodefaultlibs" "-L" ".../supercop-data/panther/amd64/try/c/gcc_-march=native_-mtune=native_-O3_-fwrapv_-fPIC_-fPIE_-gdwarf-4_-Wall/constbranchindex/crypto_hash/sha512/rust_crypto/work/target/release/deps" "-L" ".../supercop-data/panther/amd64/lib" "-L" ".../supercop-data/panther/amd64/try/c/gcc_-march=native_-mtune=native_-O3_-fwrapv_-fPIC_-fPIE_-gdwarf-4_-Wall/constbranchindex/crypto_hash/sha512/rust_crypto/work/target/release/build/crypto_hash_sha512-8610fd54643f5720/out" "-L" ".../supercop-data/panther/amd64/try/c/gcc_-march=native_-mtune=native_-O3_-fwrapv_-fPIC_-fPIE_-gdwarf-4_-Wall/constbranchindex/crypto_hash/sha512/rust_crypto/work/target/release/build/rust-crypto-afe9b4ff19c80bbc/out" "-L" "/usr/lib/rustlib/x86_64-unknown-linux-gnu/lib" "-ltry-anything" "-ltry-small" "-lsupercop" "-lkernelrandombytes" "-lcpucycles" "-lcrypto" "-lntl" "-lnsl" "-lm" "-Wl,-Bstatic" ".../supercop-data/panther/amd64/try/c/gcc_-march=native_-mtune=native_-O3_-fwrapv_-fPIC_-fPIE_-gdwarf-4_-Wall/constbranchindex/crypto_hash/sha512/rust_crypto/work/target/release/deps/libcrypto_hash_sha512-8954649d64f571b5.rlib" ".../supercop-data/panther/amd64/try/c/gcc_-march=native_-mtune=native_-O3_-fwrapv_-fPIC_-fPIE_-gdwarf-4_-Wall/constbranchindex/crypto_hash/sha512/rust_crypto/work/target/release/deps/libcrypto-83ceebf3c7290f98.rlib" ".../supercop-data/panther/amd64/try/c/gcc_-march=native_-mtune=native_-O3_-fwrapv_-fPIC_-fPIE_-gdwarf-4_-Wall/constbranchindex/crypto_hash/sha512/rust_crypto/work/target/release/deps/libtime-b473882f9f54487c.rlib" ".../supercop-data/panther/amd64/try/c/gcc_-march=native_-mtune=native_-O3_-fwrapv_-fPIC_-fPIE_-gdwarf-4_-Wall/constbranchindex/crypto_hash/sha512/rust_crypto/work/target/release/deps/librustc_serialize-72942cfdca4fb518.rlib" ".../supercop-data/panther/amd64/try/c/gcc_-march=native_-mtune=native_-O3_-fwrapv_-fPIC_-fPIE_-gdwarf-4_-Wall/constbranchindex/crypto_hash/sha512/rust_crypto/work/target/release/deps/librand-2cdf248a3f2ca473.rlib" ".../supercop-data/panther/amd64/try/c/gcc_-march=native_-mtune=native_-O3_-fwrapv_-fPIC_-fPIE_-gdwarf-4_-Wall/constbranchindex/crypto_hash/sha512/rust_crypto/work/target/release/deps/librand-7df229a95dbcb448.rlib" ".../supercop-data/panther/amd64/try/c/gcc_-march=native_-mtune=native_-O3_-fwrapv_-fPIC_-fPIE_-gdwarf-4_-Wall/constbranchindex/crypto_hash/sha512/rust_crypto/work/target/release/deps/liblibc-141c671f2ddc755d.rlib" "-Wl,--start-group" "/usr/lib/rustlib/x86_64-unknown-linux-gnu/lib/libstd-6bf3f16f340782ca.rlib" "/usr/lib/rustlib/x86_64-unknown-linux-gnu/lib/libpanic_unwind-13f3099d50c21bc6.rlib" "/usr/lib/rustlib/x86_64-unknown-linux-gnu/lib/libminiz_oxide-a2ba33c985785afe.rlib" "/usr/lib/rustlib/x86_64-unknown-linux-gnu/lib/libadler-3f6e9f8f4afbea6d.rlib" "/usr/lib/rustlib/x86_64-unknown-linux-gnu/lib/libobject-af517d7f13e7c960.rlib" "/usr/lib/rustlib/x86_64-unknown-linux-gnu/lib/libaddr2line-12740563628e601f.rlib" "/usr/lib/rustlib/x86_64-unknown-linux-gnu/lib/libgimli-0ac82a1e1820dd21.rlib" "/usr/lib/rustlib/x86_64-unknown-linux-gnu/lib/librustc_demangle-3ac2d0878c297d42.rlib" "/usr/lib/rustlib/x86_64-unknown-linux-gnu/lib/libhashbrown-c6632ca171f954dd.rlib" "/usr/lib/rustlib/x86_64-unknown-linux-gnu/lib/librustc_std_workspace_alloc-b5bfd0198c7b740d.rlib" "/usr/lib/rustlib/x86_64-unknown-linux-gnu/lib/libunwind-bd645b20c6c7b56d.rlib" "/usr/lib/rustlib/x86_64-unknown-linux-gnu/lib/libcfg_if-b9e1e523c0c29a77.rlib" "/usr/lib/rustlib/x86_64-unknown-linux-gnu/lib/liblibc-dfbef8c525de0186.rlib" "/usr/lib/rustlib/x86_64-unknown-linux-gnu/lib/liballoc-1ebf406bd4ea5769.rlib" "/usr/lib/rustlib/x86_64-unknown-linux-gnu/lib/librustc_std_workspace_core-5e0675f526ef5c6b.rlib" "/usr/lib/rustlib/x86_64-unknown-linux-gnu/lib/libcore-3375e4f89d420e7a.rlib" "-Wl,--end-group" "/usr/lib/rustlib/x86_64-unknown-linux-gnu/lib/libcompiler_builtins-f74b197469e67088.rlib" "-Wl,-Bdynamic" "-lgcc_s" "-lc" "-lm" "-lrt" "-lpthread" "-lutil" "-ldl" "-lutil"
try.c:   = note: /usr/bin/ld: cannot find -lcpucycles
try.c:           collect2: error: ld returned 1 exit status
try.c:
try.c:
try.c: error: aborting due to previous error
try.c:
try.c: error: could not compile `crypto_hash_sha512`.
try.c:
try.c: To learn more, run the command again with --verbose.

Number of similar (implementation,compiler) pairs: 1, namely:
ImplementationCompiler
rust_cryptogcc -march=native -mtune=native -O3 -fwrapv -fPIC -fPIE -gdwarf-4 -Wall (10.2.1_20210110)

Compiler output


try.c: error: linking with `cc` failed: exit code: 1
try.c:   |
try.c:   = note: "cc" "-Wl,--as-needed" "-Wl,-z,noexecstack" "-m64" "-Wl,--eh-frame-hdr" "-L" "/usr/lib/rustlib/x86_64-unknown-linux-gnu/lib" ".../supercop-data/panther/amd64/try/c/gcc_-march=native_-mtune=native_-O_-fwrapv_-fPIC_-fPIE_-gdwarf-4_-Wall/constbranchindex/crypto_hash/sha512/rust_crypto/work/target/release/deps/try_small-32c0afd311bd2237.try_small.abwnd5no-cgu.0.rcgu.o" ".../supercop-data/panther/amd64/try/c/gcc_-march=native_-mtune=native_-O_-fwrapv_-fPIC_-fPIE_-gdwarf-4_-Wall/constbranchindex/crypto_hash/sha512/rust_crypto/work/target/release/deps/try_small-32c0afd311bd2237.try_small.abwnd5no-cgu.1.rcgu.o" ".../supercop-data/panther/amd64/try/c/gcc_-march=native_-mtune=native_-O_-fwrapv_-fPIC_-fPIE_-gdwarf-4_-Wall/constbranchindex/crypto_hash/sha512/rust_crypto/work/target/release/deps/try_small-32c0afd311bd2237.try_small.abwnd5no-cgu.2.rcgu.o" ".../supercop-data/panther/amd64/try/c/gcc_-march=native_-mtune=native_-O_-fwrapv_-fPIC_-fPIE_-gdwarf-4_-Wall/constbranchindex/crypto_hash/sha512/rust_crypto/work/target/release/deps/try_small-32c0afd311bd2237.try_small.abwnd5no-cgu.3.rcgu.o" ".../supercop-data/panther/amd64/try/c/gcc_-march=native_-mtune=native_-O_-fwrapv_-fPIC_-fPIE_-gdwarf-4_-Wall/constbranchindex/crypto_hash/sha512/rust_crypto/work/target/release/deps/try_small-32c0afd311bd2237.try_small.abwnd5no-cgu.4.rcgu.o" "-o" ".../supercop-data/panther/amd64/try/c/gcc_-march=native_-mtune=native_-O_-fwrapv_-fPIC_-fPIE_-gdwarf-4_-Wall/constbranchindex/crypto_hash/sha512/rust_crypto/work/target/release/deps/try_small-32c0afd311bd2237" ".../supercop-data/panther/amd64/try/c/gcc_-march=native_-mtune=native_-O_-fwrapv_-fPIC_-fPIE_-gdwarf-4_-Wall/constbranchindex/crypto_hash/sha512/rust_crypto/work/target/release/deps/try_small-32c0afd311bd2237.2p3c333r80tuotid.rcgu.o" "-Wl,--gc-sections" "-pie" "-Wl,-zrelro" "-Wl,-znow" "-Wl,-O1" "-nodefaultlibs" "-L" ".../supercop-data/panther/amd64/try/c/gcc_-march=native_-mtune=native_-O_-fwrapv_-fPIC_-fPIE_-gdwarf-4_-Wall/constbranchindex/crypto_hash/sha512/rust_crypto/work/target/release/deps" "-L" ".../supercop-data/panther/amd64/lib" "-L" ".../supercop-data/panther/amd64/try/c/gcc_-march=native_-mtune=native_-O_-fwrapv_-fPIC_-fPIE_-gdwarf-4_-Wall/constbranchindex/crypto_hash/sha512/rust_crypto/work/target/release/build/crypto_hash_sha512-8610fd54643f5720/out" "-L" ".../supercop-data/panther/amd64/try/c/gcc_-march=native_-mtune=native_-O_-fwrapv_-fPIC_-fPIE_-gdwarf-4_-Wall/constbranchindex/crypto_hash/sha512/rust_crypto/work/target/release/build/rust-crypto-afe9b4ff19c80bbc/out" "-L" "/usr/lib/rustlib/x86_64-unknown-linux-gnu/lib" "-ltry-anything" "-ltry-small" "-lsupercop" "-lkernelrandombytes" "-lcpucycles" "-lcrypto" "-lntl" "-lnsl" "-lm" "-Wl,-Bstatic" ".../supercop-data/panther/amd64/try/c/gcc_-march=native_-mtune=native_-O_-fwrapv_-fPIC_-fPIE_-gdwarf-4_-Wall/constbranchindex/crypto_hash/sha512/rust_crypto/work/target/release/deps/libcrypto_hash_sha512-8954649d64f571b5.rlib" ".../supercop-data/panther/amd64/try/c/gcc_-march=native_-mtune=native_-O_-fwrapv_-fPIC_-fPIE_-gdwarf-4_-Wall/constbranchindex/crypto_hash/sha512/rust_crypto/work/target/release/deps/libcrypto-83ceebf3c7290f98.rlib" ".../supercop-data/panther/amd64/try/c/gcc_-march=native_-mtune=native_-O_-fwrapv_-fPIC_-fPIE_-gdwarf-4_-Wall/constbranchindex/crypto_hash/sha512/rust_crypto/work/target/release/deps/libtime-b473882f9f54487c.rlib" ".../supercop-data/panther/amd64/try/c/gcc_-march=native_-mtune=native_-O_-fwrapv_-fPIC_-fPIE_-gdwarf-4_-Wall/constbranchindex/crypto_hash/sha512/rust_crypto/work/target/release/deps/librustc_serialize-72942cfdca4fb518.rlib" ".../supercop-data/panther/amd64/try/c/gcc_-march=native_-mtune=native_-O_-fwrapv_-fPIC_-fPIE_-gdwarf-4_-Wall/constbranchindex/crypto_hash/sha512/rust_crypto/work/target/release/deps/librand-2cdf248a3f2ca473.rlib" ".../supercop-data/panther/amd64/try/c/gcc_-march=native_-mtune=native_-O_-fwrapv_-fPIC_-fPIE_-gdwarf-4_-Wall/constbranchindex/crypto_hash/sha512/rust_crypto/work/target/release/deps/librand-7df229a95dbcb448.rlib" ".../supercop-data/panther/amd64/try/c/gcc_-march=native_-mtune=native_-O_-fwrapv_-fPIC_-fPIE_-gdwarf-4_-Wall/constbranchindex/crypto_hash/sha512/rust_crypto/work/target/release/deps/liblibc-141c671f2ddc755d.rlib" "-Wl,--start-group" "/usr/lib/rustlib/x86_64-unknown-linux-gnu/lib/libstd-6bf3f16f340782ca.rlib" "/usr/lib/rustlib/x86_64-unknown-linux-gnu/lib/libpanic_unwind-13f3099d50c21bc6.rlib" "/usr/lib/rustlib/x86_64-unknown-linux-gnu/lib/libminiz_oxide-a2ba33c985785afe.rlib" "/usr/lib/rustlib/x86_64-unknown-linux-gnu/lib/libadler-3f6e9f8f4afbea6d.rlib" "/usr/lib/rustlib/x86_64-unknown-linux-gnu/lib/libobject-af517d7f13e7c960.rlib" "/usr/lib/rustlib/x86_64-unknown-linux-gnu/lib/libaddr2line-12740563628e601f.rlib" "/usr/lib/rustlib/x86_64-unknown-linux-gnu/lib/libgimli-0ac82a1e1820dd21.rlib" "/usr/lib/rustlib/x86_64-unknown-linux-gnu/lib/librustc_demangle-3ac2d0878c297d42.rlib" "/usr/lib/rustlib/x86_64-unknown-linux-gnu/lib/libhashbrown-c6632ca171f954dd.rlib" "/usr/lib/rustlib/x86_64-unknown-linux-gnu/lib/librustc_std_workspace_alloc-b5bfd0198c7b740d.rlib" "/usr/lib/rustlib/x86_64-unknown-linux-gnu/lib/libunwind-bd645b20c6c7b56d.rlib" "/usr/lib/rustlib/x86_64-unknown-linux-gnu/lib/libcfg_if-b9e1e523c0c29a77.rlib" "/usr/lib/rustlib/x86_64-unknown-linux-gnu/lib/liblibc-dfbef8c525de0186.rlib" "/usr/lib/rustlib/x86_64-unknown-linux-gnu/lib/liballoc-1ebf406bd4ea5769.rlib" "/usr/lib/rustlib/x86_64-unknown-linux-gnu/lib/librustc_std_workspace_core-5e0675f526ef5c6b.rlib" "/usr/lib/rustlib/x86_64-unknown-linux-gnu/lib/libcore-3375e4f89d420e7a.rlib" "-Wl,--end-group" "/usr/lib/rustlib/x86_64-unknown-linux-gnu/lib/libcompiler_builtins-f74b197469e67088.rlib" "-Wl,-Bdynamic" "-lgcc_s" "-lc" "-lm" "-lrt" "-lpthread" "-lutil" "-ldl" "-lutil"
try.c:   = note: /usr/bin/ld: cannot find -lcpucycles
try.c:           collect2: error: ld returned 1 exit status
try.c:
try.c:
try.c: error: aborting due to previous error
try.c:
try.c: error: could not compile `crypto_hash_sha512`.
try.c:
try.c: To learn more, run the command again with --verbose.

Number of similar (implementation,compiler) pairs: 1, namely:
ImplementationCompiler
rust_cryptogcc -march=native -mtune=native -O -fwrapv -fPIC -fPIE -gdwarf-4 -Wall (10.2.1_20210110)

Compiler output


try.c: error: linking with `cc` failed: exit code: 1
try.c:   |
try.c:   = note: "cc" "-Wl,--as-needed" "-Wl,-z,noexecstack" "-m64" "-Wl,--eh-frame-hdr" "-L" "/usr/lib/rustlib/x86_64-unknown-linux-gnu/lib" ".../supercop-data/panther/amd64/try/c/gcc_-march=native_-mtune=native_-Os_-fwrapv_-fPIC_-fPIE_-gdwarf-4_-Wall/constbranchindex/crypto_hash/sha512/rust_crypto/work/target/release/deps/measure-f5a13548b969ffe4.measure.dytvjtxy-cgu.0.rcgu.o" ".../supercop-data/panther/amd64/try/c/gcc_-march=native_-mtune=native_-Os_-fwrapv_-fPIC_-fPIE_-gdwarf-4_-Wall/constbranchindex/crypto_hash/sha512/rust_crypto/work/target/release/deps/measure-f5a13548b969ffe4.measure.dytvjtxy-cgu.1.rcgu.o" ".../supercop-data/panther/amd64/try/c/gcc_-march=native_-mtune=native_-Os_-fwrapv_-fPIC_-fPIE_-gdwarf-4_-Wall/constbranchindex/crypto_hash/sha512/rust_crypto/work/target/release/deps/measure-f5a13548b969ffe4.measure.dytvjtxy-cgu.2.rcgu.o" ".../supercop-data/panther/amd64/try/c/gcc_-march=native_-mtune=native_-Os_-fwrapv_-fPIC_-fPIE_-gdwarf-4_-Wall/constbranchindex/crypto_hash/sha512/rust_crypto/work/target/release/deps/measure-f5a13548b969ffe4.measure.dytvjtxy-cgu.3.rcgu.o" ".../supercop-data/panther/amd64/try/c/gcc_-march=native_-mtune=native_-Os_-fwrapv_-fPIC_-fPIE_-gdwarf-4_-Wall/constbranchindex/crypto_hash/sha512/rust_crypto/work/target/release/deps/measure-f5a13548b969ffe4.measure.dytvjtxy-cgu.4.rcgu.o" "-o" ".../supercop-data/panther/amd64/try/c/gcc_-march=native_-mtune=native_-Os_-fwrapv_-fPIC_-fPIE_-gdwarf-4_-Wall/constbranchindex/crypto_hash/sha512/rust_crypto/work/target/release/deps/measure-f5a13548b969ffe4" ".../supercop-data/panther/amd64/try/c/gcc_-march=native_-mtune=native_-Os_-fwrapv_-fPIC_-fPIE_-gdwarf-4_-Wall/constbranchindex/crypto_hash/sha512/rust_crypto/work/target/release/deps/measure-f5a13548b969ffe4.3laqu3xw4ouaqdul.rcgu.o" "-Wl,--gc-sections" "-pie" "-Wl,-zrelro" "-Wl,-znow" "-Wl,-O1" "-nodefaultlibs" "-L" ".../supercop-data/panther/amd64/try/c/gcc_-march=native_-mtune=native_-Os_-fwrapv_-fPIC_-fPIE_-gdwarf-4_-Wall/constbranchindex/crypto_hash/sha512/rust_crypto/work/target/release/deps" "-L" ".../supercop-data/panther/amd64/lib" "-L" ".../supercop-data/panther/amd64/try/c/gcc_-march=native_-mtune=native_-Os_-fwrapv_-fPIC_-fPIE_-gdwarf-4_-Wall/constbranchindex/crypto_hash/sha512/rust_crypto/work/target/release/build/crypto_hash_sha512-8610fd54643f5720/out" "-L" ".../supercop-data/panther/amd64/try/c/gcc_-march=native_-mtune=native_-Os_-fwrapv_-fPIC_-fPIE_-gdwarf-4_-Wall/constbranchindex/crypto_hash/sha512/rust_crypto/work/target/release/build/rust-crypto-afe9b4ff19c80bbc/out" "-L" "/usr/lib/rustlib/x86_64-unknown-linux-gnu/lib" "-lmeasure-anything" "-lmeasure" "-lsupercop" "-lkernelrandombytes" "-lcpucycles" "-lcrypto" "-lntl" "-lnsl" "-lm" "-Wl,-Bstatic" ".../supercop-data/panther/amd64/try/c/gcc_-march=native_-mtune=native_-Os_-fwrapv_-fPIC_-fPIE_-gdwarf-4_-Wall/constbranchindex/crypto_hash/sha512/rust_crypto/work/target/release/deps/libcrypto_hash_sha512-8954649d64f571b5.rlib" ".../supercop-data/panther/amd64/try/c/gcc_-march=native_-mtune=native_-Os_-fwrapv_-fPIC_-fPIE_-gdwarf-4_-Wall/constbranchindex/crypto_hash/sha512/rust_crypto/work/target/release/deps/libcrypto-83ceebf3c7290f98.rlib" ".../supercop-data/panther/amd64/try/c/gcc_-march=native_-mtune=native_-Os_-fwrapv_-fPIC_-fPIE_-gdwarf-4_-Wall/constbranchindex/crypto_hash/sha512/rust_crypto/work/target/release/deps/libtime-b473882f9f54487c.rlib" ".../supercop-data/panther/amd64/try/c/gcc_-march=native_-mtune=native_-Os_-fwrapv_-fPIC_-fPIE_-gdwarf-4_-Wall/constbranchindex/crypto_hash/sha512/rust_crypto/work/target/release/deps/librustc_serialize-72942cfdca4fb518.rlib" ".../supercop-data/panther/amd64/try/c/gcc_-march=native_-mtune=native_-Os_-fwrapv_-fPIC_-fPIE_-gdwarf-4_-Wall/constbranchindex/crypto_hash/sha512/rust_crypto/work/target/release/deps/librand-2cdf248a3f2ca473.rlib" ".../supercop-data/panther/amd64/try/c/gcc_-march=native_-mtune=native_-Os_-fwrapv_-fPIC_-fPIE_-gdwarf-4_-Wall/constbranchindex/crypto_hash/sha512/rust_crypto/work/target/release/deps/librand-7df229a95dbcb448.rlib" ".../supercop-data/panther/amd64/try/c/gcc_-march=native_-mtune=native_-Os_-fwrapv_-fPIC_-fPIE_-gdwarf-4_-Wall/constbranchindex/crypto_hash/sha512/rust_crypto/work/target/release/deps/liblibc-141c671f2ddc755d.rlib" "-Wl,--start-group" "/usr/lib/rustlib/x86_64-unknown-linux-gnu/lib/libstd-6bf3f16f340782ca.rlib" "/usr/lib/rustlib/x86_64-unknown-linux-gnu/lib/libpanic_unwind-13f3099d50c21bc6.rlib" "/usr/lib/rustlib/x86_64-unknown-linux-gnu/lib/libminiz_oxide-a2ba33c985785afe.rlib" "/usr/lib/rustlib/x86_64-unknown-linux-gnu/lib/libadler-3f6e9f8f4afbea6d.rlib" "/usr/lib/rustlib/x86_64-unknown-linux-gnu/lib/libobject-af517d7f13e7c960.rlib" "/usr/lib/rustlib/x86_64-unknown-linux-gnu/lib/libaddr2line-12740563628e601f.rlib" "/usr/lib/rustlib/x86_64-unknown-linux-gnu/lib/libgimli-0ac82a1e1820dd21.rlib" "/usr/lib/rustlib/x86_64-unknown-linux-gnu/lib/librustc_demangle-3ac2d0878c297d42.rlib" "/usr/lib/rustlib/x86_64-unknown-linux-gnu/lib/libhashbrown-c6632ca171f954dd.rlib" "/usr/lib/rustlib/x86_64-unknown-linux-gnu/lib/librustc_std_workspace_alloc-b5bfd0198c7b740d.rlib" "/usr/lib/rustlib/x86_64-unknown-linux-gnu/lib/libunwind-bd645b20c6c7b56d.rlib" "/usr/lib/rustlib/x86_64-unknown-linux-gnu/lib/libcfg_if-b9e1e523c0c29a77.rlib" "/usr/lib/rustlib/x86_64-unknown-linux-gnu/lib/liblibc-dfbef8c525de0186.rlib" "/usr/lib/rustlib/x86_64-unknown-linux-gnu/lib/liballoc-1ebf406bd4ea5769.rlib" "/usr/lib/rustlib/x86_64-unknown-linux-gnu/lib/librustc_std_workspace_core-5e0675f526ef5c6b.rlib" "/usr/lib/rustlib/x86_64-unknown-linux-gnu/lib/libcore-3375e4f89d420e7a.rlib" "-Wl,--end-group" "/usr/lib/rustlib/x86_64-unknown-linux-gnu/lib/libcompiler_builtins-f74b197469e67088.rlib" "-Wl,-Bdynamic" "-lgcc_s" "-lc" "-lm" "-lrt" "-lpthread" "-lutil" "-ldl" "-lutil"
try.c:   = note: /usr/bin/ld: cannot find -lcpucycles
try.c:           collect2: error: ld returned 1 exit status
try.c:
try.c:
try.c: error: aborting due to previous error
try.c:
try.c: error: could not compile `crypto_hash_sha512`.
try.c:
try.c: To learn more, run the command again with --verbose.

Number of similar (implementation,compiler) pairs: 1, namely:
ImplementationCompiler
rust_cryptogcc -march=native -mtune=native -Os -fwrapv -fPIC -fPIE -gdwarf-4 -Wall (10.2.1_20210110)

Compiler output


try.c: error: linking with `cc` failed: exit code: 1
try.c:   |
try.c:   = note: "cc" "-Wl,--as-needed" "-Wl,-z,noexecstack" "-m64" "-Wl,--eh-frame-hdr" "-L" "/usr/lib/rustlib/x86_64-unknown-linux-gnu/lib" ".../supercop-data/panther/amd64/try/c/clang_-march=native_-O2_-fwrapv_-Qunused-arguments_-fPIC_-fPIE_-gdwarf-4_-Wall/constbranchindex/crypto_hash/sha512/rust_sha2/work/target/release/deps/measure-62e65a11161a4206.measure.9ynvwos1-cgu.0.rcgu.o" ".../supercop-data/panther/amd64/try/c/clang_-march=native_-O2_-fwrapv_-Qunused-arguments_-fPIC_-fPIE_-gdwarf-4_-Wall/constbranchindex/crypto_hash/sha512/rust_sha2/work/target/release/deps/measure-62e65a11161a4206.measure.9ynvwos1-cgu.1.rcgu.o" ".../supercop-data/panther/amd64/try/c/clang_-march=native_-O2_-fwrapv_-Qunused-arguments_-fPIC_-fPIE_-gdwarf-4_-Wall/constbranchindex/crypto_hash/sha512/rust_sha2/work/target/release/deps/measure-62e65a11161a4206.measure.9ynvwos1-cgu.2.rcgu.o" ".../supercop-data/panther/amd64/try/c/clang_-march=native_-O2_-fwrapv_-Qunused-arguments_-fPIC_-fPIE_-gdwarf-4_-Wall/constbranchindex/crypto_hash/sha512/rust_sha2/work/target/release/deps/measure-62e65a11161a4206.measure.9ynvwos1-cgu.3.rcgu.o" ".../supercop-data/panther/amd64/try/c/clang_-march=native_-O2_-fwrapv_-Qunused-arguments_-fPIC_-fPIE_-gdwarf-4_-Wall/constbranchindex/crypto_hash/sha512/rust_sha2/work/target/release/deps/measure-62e65a11161a4206.measure.9ynvwos1-cgu.4.rcgu.o" "-o" ".../supercop-data/panther/amd64/try/c/clang_-march=native_-O2_-fwrapv_-Qunused-arguments_-fPIC_-fPIE_-gdwarf-4_-Wall/constbranchindex/crypto_hash/sha512/rust_sha2/work/target/release/deps/measure-62e65a11161a4206" ".../supercop-data/panther/amd64/try/c/clang_-march=native_-O2_-fwrapv_-Qunused-arguments_-fPIC_-fPIE_-gdwarf-4_-Wall/constbranchindex/crypto_hash/sha512/rust_sha2/work/target/release/deps/measure-62e65a11161a4206.33ylmmgb9f5xq2mk.rcgu.o" "-Wl,--gc-sections" "-pie" "-Wl,-zrelro" "-Wl,-znow" "-Wl,-O1" "-nodefaultlibs" "-L" ".../supercop-data/panther/amd64/try/c/clang_-march=native_-O2_-fwrapv_-Qunused-arguments_-fPIC_-fPIE_-gdwarf-4_-Wall/constbranchindex/crypto_hash/sha512/rust_sha2/work/target/release/deps" "-L" ".../supercop-data/panther/amd64/lib" "-L" ".../supercop-data/panther/amd64/try/c/clang_-march=native_-O2_-fwrapv_-Qunused-arguments_-fPIC_-fPIE_-gdwarf-4_-Wall/constbranchindex/crypto_hash/sha512/rust_sha2/work/target/release/build/crypto_hash_sha512-8610fd54643f5720/out" "-L" "/usr/lib/rustlib/x86_64-unknown-linux-gnu/lib" "-lmeasure-anything" "-lmeasure" "-lsupercop" "-lkernelrandombytes" "-lcpucycles" "-lcrypto" "-lntl" "-lnsl" "-lm" "-Wl,-Bstatic" ".../supercop-data/panther/amd64/try/c/clang_-march=native_-O2_-fwrapv_-Qunused-arguments_-fPIC_-fPIE_-gdwarf-4_-Wall/constbranchindex/crypto_hash/sha512/rust_sha2/work/target/release/deps/libcrypto_hash_sha512-e4fe8efba091fb47.rlib" ".../supercop-data/panther/amd64/try/c/clang_-march=native_-O2_-fwrapv_-Qunused-arguments_-fPIC_-fPIE_-gdwarf-4_-Wall/constbranchindex/crypto_hash/sha512/rust_sha2/work/target/release/deps/libsha2-fee2faec0cc98b9d.rlib" ".../supercop-data/panther/amd64/try/c/clang_-march=native_-O2_-fwrapv_-Qunused-arguments_-fPIC_-fPIE_-gdwarf-4_-Wall/constbranchindex/crypto_hash/sha512/rust_sha2/work/target/release/deps/libcpuid_bool-a511188b3e8fb9e7.rlib" ".../supercop-data/panther/amd64/try/c/clang_-march=native_-O2_-fwrapv_-Qunused-arguments_-fPIC_-fPIE_-gdwarf-4_-Wall/constbranchindex/crypto_hash/sha512/rust_sha2/work/target/release/deps/libcfg_if-11669ae4b1851f60.rlib" ".../supercop-data/panther/amd64/try/c/clang_-march=native_-O2_-fwrapv_-Qunused-arguments_-fPIC_-fPIE_-gdwarf-4_-Wall/constbranchindex/crypto_hash/sha512/rust_sha2/work/target/release/deps/libopaque_debug-ff52af415c56e1a8.rlib" ".../supercop-data/panther/amd64/try/c/clang_-march=native_-O2_-fwrapv_-Qunused-arguments_-fPIC_-fPIE_-gdwarf-4_-Wall/constbranchindex/crypto_hash/sha512/rust_sha2/work/target/release/deps/libdigest-137540d47480a0cd.rlib" ".../supercop-data/panther/amd64/try/c/clang_-march=native_-O2_-fwrapv_-Qunused-arguments_-fPIC_-fPIE_-gdwarf-4_-Wall/constbranchindex/crypto_hash/sha512/rust_sha2/work/target/release/deps/libblock_buffer-d8051f65e68b5aa7.rlib" ".../supercop-data/panther/amd64/try/c/clang_-march=native_-O2_-fwrapv_-Qunused-arguments_-fPIC_-fPIE_-gdwarf-4_-Wall/constbranchindex/crypto_hash/sha512/rust_sha2/work/target/release/deps/libgeneric_array-6bd8cd5d26e69f54.rlib" ".../supercop-data/panther/amd64/try/c/clang_-march=native_-O2_-fwrapv_-Qunused-arguments_-fPIC_-fPIE_-gdwarf-4_-Wall/constbranchindex/crypto_hash/sha512/rust_sha2/work/target/release/deps/libtypenum-ac0d7f64b1a84d19.rlib" "-Wl,--start-group" "/usr/lib/rustlib/x86_64-unknown-linux-gnu/lib/libstd-6bf3f16f340782ca.rlib" "/usr/lib/rustlib/x86_64-unknown-linux-gnu/lib/libpanic_unwind-13f3099d50c21bc6.rlib" "/usr/lib/rustlib/x86_64-unknown-linux-gnu/lib/libminiz_oxide-a2ba33c985785afe.rlib" "/usr/lib/rustlib/x86_64-unknown-linux-gnu/lib/libadler-3f6e9f8f4afbea6d.rlib" "/usr/lib/rustlib/x86_64-unknown-linux-gnu/lib/libobject-af517d7f13e7c960.rlib" "/usr/lib/rustlib/x86_64-unknown-linux-gnu/lib/libaddr2line-12740563628e601f.rlib" "/usr/lib/rustlib/x86_64-unknown-linux-gnu/lib/libgimli-0ac82a1e1820dd21.rlib" "/usr/lib/rustlib/x86_64-unknown-linux-gnu/lib/librustc_demangle-3ac2d0878c297d42.rlib" "/usr/lib/rustlib/x86_64-unknown-linux-gnu/lib/libhashbrown-c6632ca171f954dd.rlib" "/usr/lib/rustlib/x86_64-unknown-linux-gnu/lib/librustc_std_workspace_alloc-b5bfd0198c7b740d.rlib" "/usr/lib/rustlib/x86_64-unknown-linux-gnu/lib/libunwind-bd645b20c6c7b56d.rlib" "/usr/lib/rustlib/x86_64-unknown-linux-gnu/lib/libcfg_if-b9e1e523c0c29a77.rlib" "/usr/lib/rustlib/x86_64-unknown-linux-gnu/lib/liblibc-dfbef8c525de0186.rlib" "/usr/lib/rustlib/x86_64-unknown-linux-gnu/lib/liballoc-1ebf406bd4ea5769.rlib" "/usr/lib/rustlib/x86_64-unknown-linux-gnu/lib/librustc_std_workspace_core-5e0675f526ef5c6b.rlib" "/usr/lib/rustlib/x86_64-unknown-linux-gnu/lib/libcore-3375e4f89d420e7a.rlib" "-Wl,--end-group" "/usr/lib/rustlib/x86_64-unknown-linux-gnu/lib/libcompiler_builtins-f74b197469e67088.rlib" "-Wl,-Bdynamic" "-lgcc_s" "-lc" "-lm" "-lrt" "-lpthread" "-lutil" "-ldl" "-lutil"
try.c:   = note: /usr/bin/ld: cannot find -lcpucycles
try.c:           collect2: error: ld returned 1 exit status
try.c:
try.c:
try.c: error: aborting due to previous error
try.c:
try.c: error: could not compile `crypto_hash_sha512`.
try.c:
try.c: To learn more, run the command again with --verbose.

Number of similar (implementation,compiler) pairs: 1, namely:
ImplementationCompiler
rust_sha2clang -march=native -O2 -fwrapv -Qunused-arguments -fPIC -fPIE -gdwarf-4 -Wall (Debian_Clang_11.0.1)

Compiler output


try.c: error: linking with `cc` failed: exit code: 1
try.c:   |
try.c:   = note: "cc" "-Wl,--as-needed" "-Wl,-z,noexecstack" "-m64" "-Wl,--eh-frame-hdr" "-L" "/usr/lib/rustlib/x86_64-unknown-linux-gnu/lib" ".../supercop-data/panther/amd64/try/c/clang_-march=native_-O3_-fwrapv_-Qunused-arguments_-fPIC_-fPIE_-gdwarf-4_-Wall/constbranchindex/crypto_hash/sha512/rust_sha2/work/target/release/deps/try_small-a8983f9801c8ab31.try_small.1opzrqsz-cgu.0.rcgu.o" ".../supercop-data/panther/amd64/try/c/clang_-march=native_-O3_-fwrapv_-Qunused-arguments_-fPIC_-fPIE_-gdwarf-4_-Wall/constbranchindex/crypto_hash/sha512/rust_sha2/work/target/release/deps/try_small-a8983f9801c8ab31.try_small.1opzrqsz-cgu.1.rcgu.o" ".../supercop-data/panther/amd64/try/c/clang_-march=native_-O3_-fwrapv_-Qunused-arguments_-fPIC_-fPIE_-gdwarf-4_-Wall/constbranchindex/crypto_hash/sha512/rust_sha2/work/target/release/deps/try_small-a8983f9801c8ab31.try_small.1opzrqsz-cgu.2.rcgu.o" ".../supercop-data/panther/amd64/try/c/clang_-march=native_-O3_-fwrapv_-Qunused-arguments_-fPIC_-fPIE_-gdwarf-4_-Wall/constbranchindex/crypto_hash/sha512/rust_sha2/work/target/release/deps/try_small-a8983f9801c8ab31.try_small.1opzrqsz-cgu.3.rcgu.o" ".../supercop-data/panther/amd64/try/c/clang_-march=native_-O3_-fwrapv_-Qunused-arguments_-fPIC_-fPIE_-gdwarf-4_-Wall/constbranchindex/crypto_hash/sha512/rust_sha2/work/target/release/deps/try_small-a8983f9801c8ab31.try_small.1opzrqsz-cgu.4.rcgu.o" "-o" ".../supercop-data/panther/amd64/try/c/clang_-march=native_-O3_-fwrapv_-Qunused-arguments_-fPIC_-fPIE_-gdwarf-4_-Wall/constbranchindex/crypto_hash/sha512/rust_sha2/work/target/release/deps/try_small-a8983f9801c8ab31" ".../supercop-data/panther/amd64/try/c/clang_-march=native_-O3_-fwrapv_-Qunused-arguments_-fPIC_-fPIE_-gdwarf-4_-Wall/constbranchindex/crypto_hash/sha512/rust_sha2/work/target/release/deps/try_small-a8983f9801c8ab31.21l1w8xgeq9dohzd.rcgu.o" "-Wl,--gc-sections" "-pie" "-Wl,-zrelro" "-Wl,-znow" "-Wl,-O1" "-nodefaultlibs" "-L" ".../supercop-data/panther/amd64/try/c/clang_-march=native_-O3_-fwrapv_-Qunused-arguments_-fPIC_-fPIE_-gdwarf-4_-Wall/constbranchindex/crypto_hash/sha512/rust_sha2/work/target/release/deps" "-L" ".../supercop-data/panther/amd64/lib" "-L" ".../supercop-data/panther/amd64/try/c/clang_-march=native_-O3_-fwrapv_-Qunused-arguments_-fPIC_-fPIE_-gdwarf-4_-Wall/constbranchindex/crypto_hash/sha512/rust_sha2/work/target/release/build/crypto_hash_sha512-8610fd54643f5720/out" "-L" "/usr/lib/rustlib/x86_64-unknown-linux-gnu/lib" "-ltry-anything" "-ltry-small" "-lsupercop" "-lkernelrandombytes" "-lcpucycles" "-lcrypto" "-lntl" "-lnsl" "-lm" "-Wl,-Bstatic" ".../supercop-data/panther/amd64/try/c/clang_-march=native_-O3_-fwrapv_-Qunused-arguments_-fPIC_-fPIE_-gdwarf-4_-Wall/constbranchindex/crypto_hash/sha512/rust_sha2/work/target/release/deps/libcrypto_hash_sha512-e4fe8efba091fb47.rlib" ".../supercop-data/panther/amd64/try/c/clang_-march=native_-O3_-fwrapv_-Qunused-arguments_-fPIC_-fPIE_-gdwarf-4_-Wall/constbranchindex/crypto_hash/sha512/rust_sha2/work/target/release/deps/libsha2-fee2faec0cc98b9d.rlib" ".../supercop-data/panther/amd64/try/c/clang_-march=native_-O3_-fwrapv_-Qunused-arguments_-fPIC_-fPIE_-gdwarf-4_-Wall/constbranchindex/crypto_hash/sha512/rust_sha2/work/target/release/deps/libcpuid_bool-a511188b3e8fb9e7.rlib" ".../supercop-data/panther/amd64/try/c/clang_-march=native_-O3_-fwrapv_-Qunused-arguments_-fPIC_-fPIE_-gdwarf-4_-Wall/constbranchindex/crypto_hash/sha512/rust_sha2/work/target/release/deps/libcfg_if-11669ae4b1851f60.rlib" ".../supercop-data/panther/amd64/try/c/clang_-march=native_-O3_-fwrapv_-Qunused-arguments_-fPIC_-fPIE_-gdwarf-4_-Wall/constbranchindex/crypto_hash/sha512/rust_sha2/work/target/release/deps/libopaque_debug-ff52af415c56e1a8.rlib" ".../supercop-data/panther/amd64/try/c/clang_-march=native_-O3_-fwrapv_-Qunused-arguments_-fPIC_-fPIE_-gdwarf-4_-Wall/constbranchindex/crypto_hash/sha512/rust_sha2/work/target/release/deps/libdigest-137540d47480a0cd.rlib" ".../supercop-data/panther/amd64/try/c/clang_-march=native_-O3_-fwrapv_-Qunused-arguments_-fPIC_-fPIE_-gdwarf-4_-Wall/constbranchindex/crypto_hash/sha512/rust_sha2/work/target/release/deps/libblock_buffer-d8051f65e68b5aa7.rlib" ".../supercop-data/panther/amd64/try/c/clang_-march=native_-O3_-fwrapv_-Qunused-arguments_-fPIC_-fPIE_-gdwarf-4_-Wall/constbranchindex/crypto_hash/sha512/rust_sha2/work/target/release/deps/libgeneric_array-6bd8cd5d26e69f54.rlib" ".../supercop-data/panther/amd64/try/c/clang_-march=native_-O3_-fwrapv_-Qunused-arguments_-fPIC_-fPIE_-gdwarf-4_-Wall/constbranchindex/crypto_hash/sha512/rust_sha2/work/target/release/deps/libtypenum-ac0d7f64b1a84d19.rlib" "-Wl,--start-group" "/usr/lib/rustlib/x86_64-unknown-linux-gnu/lib/libstd-6bf3f16f340782ca.rlib" "/usr/lib/rustlib/x86_64-unknown-linux-gnu/lib/libpanic_unwind-13f3099d50c21bc6.rlib" "/usr/lib/rustlib/x86_64-unknown-linux-gnu/lib/libminiz_oxide-a2ba33c985785afe.rlib" "/usr/lib/rustlib/x86_64-unknown-linux-gnu/lib/libadler-3f6e9f8f4afbea6d.rlib" "/usr/lib/rustlib/x86_64-unknown-linux-gnu/lib/libobject-af517d7f13e7c960.rlib" "/usr/lib/rustlib/x86_64-unknown-linux-gnu/lib/libaddr2line-12740563628e601f.rlib" "/usr/lib/rustlib/x86_64-unknown-linux-gnu/lib/libgimli-0ac82a1e1820dd21.rlib" "/usr/lib/rustlib/x86_64-unknown-linux-gnu/lib/librustc_demangle-3ac2d0878c297d42.rlib" "/usr/lib/rustlib/x86_64-unknown-linux-gnu/lib/libhashbrown-c6632ca171f954dd.rlib" "/usr/lib/rustlib/x86_64-unknown-linux-gnu/lib/librustc_std_workspace_alloc-b5bfd0198c7b740d.rlib" "/usr/lib/rustlib/x86_64-unknown-linux-gnu/lib/libunwind-bd645b20c6c7b56d.rlib" "/usr/lib/rustlib/x86_64-unknown-linux-gnu/lib/libcfg_if-b9e1e523c0c29a77.rlib" "/usr/lib/rustlib/x86_64-unknown-linux-gnu/lib/liblibc-dfbef8c525de0186.rlib" "/usr/lib/rustlib/x86_64-unknown-linux-gnu/lib/liballoc-1ebf406bd4ea5769.rlib" "/usr/lib/rustlib/x86_64-unknown-linux-gnu/lib/librustc_std_workspace_core-5e0675f526ef5c6b.rlib" "/usr/lib/rustlib/x86_64-unknown-linux-gnu/lib/libcore-3375e4f89d420e7a.rlib" "-Wl,--end-group" "/usr/lib/rustlib/x86_64-unknown-linux-gnu/lib/libcompiler_builtins-f74b197469e67088.rlib" "-Wl,-Bdynamic" "-lgcc_s" "-lc" "-lm" "-lrt" "-lpthread" "-lutil" "-ldl" "-lutil"
try.c:   = note: /usr/bin/ld: cannot find -lcpucycles
try.c:           collect2: error: ld returned 1 exit status
try.c:
try.c:
try.c: error: aborting due to previous error
try.c:
try.c: error: could not compile `crypto_hash_sha512`.
try.c:
try.c: To learn more, run the command again with --verbose.

Number of similar (implementation,compiler) pairs: 1, namely:
ImplementationCompiler
rust_sha2clang -march=native -O3 -fwrapv -Qunused-arguments -fPIC -fPIE -gdwarf-4 -Wall (Debian_Clang_11.0.1)

Compiler output


try.c: error: linking with `cc` failed: exit code: 1
try.c:   |
try.c:   = note: "cc" "-Wl,--as-needed" "-Wl,-z,noexecstack" "-m64" "-Wl,--eh-frame-hdr" "-L" "/usr/lib/rustlib/x86_64-unknown-linux-gnu/lib" ".../supercop-data/panther/amd64/try/c/clang_-march=native_-O_-fwrapv_-Qunused-arguments_-fPIC_-fPIE_-gdwarf-4_-Wall/constbranchindex/crypto_hash/sha512/rust_sha2/work/target/release/deps/measure-62e65a11161a4206.measure.9ynvwos1-cgu.0.rcgu.o" ".../supercop-data/panther/amd64/try/c/clang_-march=native_-O_-fwrapv_-Qunused-arguments_-fPIC_-fPIE_-gdwarf-4_-Wall/constbranchindex/crypto_hash/sha512/rust_sha2/work/target/release/deps/measure-62e65a11161a4206.measure.9ynvwos1-cgu.1.rcgu.o" ".../supercop-data/panther/amd64/try/c/clang_-march=native_-O_-fwrapv_-Qunused-arguments_-fPIC_-fPIE_-gdwarf-4_-Wall/constbranchindex/crypto_hash/sha512/rust_sha2/work/target/release/deps/measure-62e65a11161a4206.measure.9ynvwos1-cgu.2.rcgu.o" ".../supercop-data/panther/amd64/try/c/clang_-march=native_-O_-fwrapv_-Qunused-arguments_-fPIC_-fPIE_-gdwarf-4_-Wall/constbranchindex/crypto_hash/sha512/rust_sha2/work/target/release/deps/measure-62e65a11161a4206.measure.9ynvwos1-cgu.3.rcgu.o" ".../supercop-data/panther/amd64/try/c/clang_-march=native_-O_-fwrapv_-Qunused-arguments_-fPIC_-fPIE_-gdwarf-4_-Wall/constbranchindex/crypto_hash/sha512/rust_sha2/work/target/release/deps/measure-62e65a11161a4206.measure.9ynvwos1-cgu.4.rcgu.o" "-o" ".../supercop-data/panther/amd64/try/c/clang_-march=native_-O_-fwrapv_-Qunused-arguments_-fPIC_-fPIE_-gdwarf-4_-Wall/constbranchindex/crypto_hash/sha512/rust_sha2/work/target/release/deps/measure-62e65a11161a4206" ".../supercop-data/panther/amd64/try/c/clang_-march=native_-O_-fwrapv_-Qunused-arguments_-fPIC_-fPIE_-gdwarf-4_-Wall/constbranchindex/crypto_hash/sha512/rust_sha2/work/target/release/deps/measure-62e65a11161a4206.33ylmmgb9f5xq2mk.rcgu.o" "-Wl,--gc-sections" "-pie" "-Wl,-zrelro" "-Wl,-znow" "-Wl,-O1" "-nodefaultlibs" "-L" ".../supercop-data/panther/amd64/try/c/clang_-march=native_-O_-fwrapv_-Qunused-arguments_-fPIC_-fPIE_-gdwarf-4_-Wall/constbranchindex/crypto_hash/sha512/rust_sha2/work/target/release/deps" "-L" ".../supercop-data/panther/amd64/lib" "-L" ".../supercop-data/panther/amd64/try/c/clang_-march=native_-O_-fwrapv_-Qunused-arguments_-fPIC_-fPIE_-gdwarf-4_-Wall/constbranchindex/crypto_hash/sha512/rust_sha2/work/target/release/build/crypto_hash_sha512-8610fd54643f5720/out" "-L" "/usr/lib/rustlib/x86_64-unknown-linux-gnu/lib" "-lmeasure-anything" "-lmeasure" "-lsupercop" "-lkernelrandombytes" "-lcpucycles" "-lcrypto" "-lntl" "-lnsl" "-lm" "-Wl,-Bstatic" ".../supercop-data/panther/amd64/try/c/clang_-march=native_-O_-fwrapv_-Qunused-arguments_-fPIC_-fPIE_-gdwarf-4_-Wall/constbranchindex/crypto_hash/sha512/rust_sha2/work/target/release/deps/libcrypto_hash_sha512-e4fe8efba091fb47.rlib" ".../supercop-data/panther/amd64/try/c/clang_-march=native_-O_-fwrapv_-Qunused-arguments_-fPIC_-fPIE_-gdwarf-4_-Wall/constbranchindex/crypto_hash/sha512/rust_sha2/work/target/release/deps/libsha2-fee2faec0cc98b9d.rlib" ".../supercop-data/panther/amd64/try/c/clang_-march=native_-O_-fwrapv_-Qunused-arguments_-fPIC_-fPIE_-gdwarf-4_-Wall/constbranchindex/crypto_hash/sha512/rust_sha2/work/target/release/deps/libcpuid_bool-a511188b3e8fb9e7.rlib" ".../supercop-data/panther/amd64/try/c/clang_-march=native_-O_-fwrapv_-Qunused-arguments_-fPIC_-fPIE_-gdwarf-4_-Wall/constbranchindex/crypto_hash/sha512/rust_sha2/work/target/release/deps/libcfg_if-11669ae4b1851f60.rlib" ".../supercop-data/panther/amd64/try/c/clang_-march=native_-O_-fwrapv_-Qunused-arguments_-fPIC_-fPIE_-gdwarf-4_-Wall/constbranchindex/crypto_hash/sha512/rust_sha2/work/target/release/deps/libopaque_debug-ff52af415c56e1a8.rlib" ".../supercop-data/panther/amd64/try/c/clang_-march=native_-O_-fwrapv_-Qunused-arguments_-fPIC_-fPIE_-gdwarf-4_-Wall/constbranchindex/crypto_hash/sha512/rust_sha2/work/target/release/deps/libdigest-137540d47480a0cd.rlib" ".../supercop-data/panther/amd64/try/c/clang_-march=native_-O_-fwrapv_-Qunused-arguments_-fPIC_-fPIE_-gdwarf-4_-Wall/constbranchindex/crypto_hash/sha512/rust_sha2/work/target/release/deps/libblock_buffer-d8051f65e68b5aa7.rlib" ".../supercop-data/panther/amd64/try/c/clang_-march=native_-O_-fwrapv_-Qunused-arguments_-fPIC_-fPIE_-gdwarf-4_-Wall/constbranchindex/crypto_hash/sha512/rust_sha2/work/target/release/deps/libgeneric_array-6bd8cd5d26e69f54.rlib" ".../supercop-data/panther/amd64/try/c/clang_-march=native_-O_-fwrapv_-Qunused-arguments_-fPIC_-fPIE_-gdwarf-4_-Wall/constbranchindex/crypto_hash/sha512/rust_sha2/work/target/release/deps/libtypenum-ac0d7f64b1a84d19.rlib" "-Wl,--start-group" "/usr/lib/rustlib/x86_64-unknown-linux-gnu/lib/libstd-6bf3f16f340782ca.rlib" "/usr/lib/rustlib/x86_64-unknown-linux-gnu/lib/libpanic_unwind-13f3099d50c21bc6.rlib" "/usr/lib/rustlib/x86_64-unknown-linux-gnu/lib/libminiz_oxide-a2ba33c985785afe.rlib" "/usr/lib/rustlib/x86_64-unknown-linux-gnu/lib/libadler-3f6e9f8f4afbea6d.rlib" "/usr/lib/rustlib/x86_64-unknown-linux-gnu/lib/libobject-af517d7f13e7c960.rlib" "/usr/lib/rustlib/x86_64-unknown-linux-gnu/lib/libaddr2line-12740563628e601f.rlib" "/usr/lib/rustlib/x86_64-unknown-linux-gnu/lib/libgimli-0ac82a1e1820dd21.rlib" "/usr/lib/rustlib/x86_64-unknown-linux-gnu/lib/librustc_demangle-3ac2d0878c297d42.rlib" "/usr/lib/rustlib/x86_64-unknown-linux-gnu/lib/libhashbrown-c6632ca171f954dd.rlib" "/usr/lib/rustlib/x86_64-unknown-linux-gnu/lib/librustc_std_workspace_alloc-b5bfd0198c7b740d.rlib" "/usr/lib/rustlib/x86_64-unknown-linux-gnu/lib/libunwind-bd645b20c6c7b56d.rlib" "/usr/lib/rustlib/x86_64-unknown-linux-gnu/lib/libcfg_if-b9e1e523c0c29a77.rlib" "/usr/lib/rustlib/x86_64-unknown-linux-gnu/lib/liblibc-dfbef8c525de0186.rlib" "/usr/lib/rustlib/x86_64-unknown-linux-gnu/lib/liballoc-1ebf406bd4ea5769.rlib" "/usr/lib/rustlib/x86_64-unknown-linux-gnu/lib/librustc_std_workspace_core-5e0675f526ef5c6b.rlib" "/usr/lib/rustlib/x86_64-unknown-linux-gnu/lib/libcore-3375e4f89d420e7a.rlib" "-Wl,--end-group" "/usr/lib/rustlib/x86_64-unknown-linux-gnu/lib/libcompiler_builtins-f74b197469e67088.rlib" "-Wl,-Bdynamic" "-lgcc_s" "-lc" "-lm" "-lrt" "-lpthread" "-lutil" "-ldl" "-lutil"
try.c:   = note: /usr/bin/ld: cannot find -lcpucycles
try.c:           collect2: error: ld returned 1 exit status
try.c:
try.c:
try.c: error: aborting due to previous error
try.c:
try.c: error: could not compile `crypto_hash_sha512`.
try.c:
try.c: To learn more, run the command again with --verbose.

Number of similar (implementation,compiler) pairs: 1, namely:
ImplementationCompiler
rust_sha2clang -march=native -O -fwrapv -Qunused-arguments -fPIC -fPIE -gdwarf-4 -Wall (Debian_Clang_11.0.1)

Compiler output


try.c: error: linking with `cc` failed: exit code: 1
try.c:   |
try.c:   = note: "cc" "-Wl,--as-needed" "-Wl,-z,noexecstack" "-m64" "-Wl,--eh-frame-hdr" "-L" "/usr/lib/rustlib/x86_64-unknown-linux-gnu/lib" ".../supercop-data/panther/amd64/try/c/clang_-march=native_-Os_-fwrapv_-Qunused-arguments_-fPIC_-fPIE_-gdwarf-4_-Wall/constbranchindex/crypto_hash/sha512/rust_sha2/work/target/release/deps/measure-62e65a11161a4206.measure.9ynvwos1-cgu.0.rcgu.o" ".../supercop-data/panther/amd64/try/c/clang_-march=native_-Os_-fwrapv_-Qunused-arguments_-fPIC_-fPIE_-gdwarf-4_-Wall/constbranchindex/crypto_hash/sha512/rust_sha2/work/target/release/deps/measure-62e65a11161a4206.measure.9ynvwos1-cgu.1.rcgu.o" ".../supercop-data/panther/amd64/try/c/clang_-march=native_-Os_-fwrapv_-Qunused-arguments_-fPIC_-fPIE_-gdwarf-4_-Wall/constbranchindex/crypto_hash/sha512/rust_sha2/work/target/release/deps/measure-62e65a11161a4206.measure.9ynvwos1-cgu.2.rcgu.o" ".../supercop-data/panther/amd64/try/c/clang_-march=native_-Os_-fwrapv_-Qunused-arguments_-fPIC_-fPIE_-gdwarf-4_-Wall/constbranchindex/crypto_hash/sha512/rust_sha2/work/target/release/deps/measure-62e65a11161a4206.measure.9ynvwos1-cgu.3.rcgu.o" ".../supercop-data/panther/amd64/try/c/clang_-march=native_-Os_-fwrapv_-Qunused-arguments_-fPIC_-fPIE_-gdwarf-4_-Wall/constbranchindex/crypto_hash/sha512/rust_sha2/work/target/release/deps/measure-62e65a11161a4206.measure.9ynvwos1-cgu.4.rcgu.o" "-o" ".../supercop-data/panther/amd64/try/c/clang_-march=native_-Os_-fwrapv_-Qunused-arguments_-fPIC_-fPIE_-gdwarf-4_-Wall/constbranchindex/crypto_hash/sha512/rust_sha2/work/target/release/deps/measure-62e65a11161a4206" ".../supercop-data/panther/amd64/try/c/clang_-march=native_-Os_-fwrapv_-Qunused-arguments_-fPIC_-fPIE_-gdwarf-4_-Wall/constbranchindex/crypto_hash/sha512/rust_sha2/work/target/release/deps/measure-62e65a11161a4206.33ylmmgb9f5xq2mk.rcgu.o" "-Wl,--gc-sections" "-pie" "-Wl,-zrelro" "-Wl,-znow" "-Wl,-O1" "-nodefaultlibs" "-L" ".../supercop-data/panther/amd64/try/c/clang_-march=native_-Os_-fwrapv_-Qunused-arguments_-fPIC_-fPIE_-gdwarf-4_-Wall/constbranchindex/crypto_hash/sha512/rust_sha2/work/target/release/deps" "-L" ".../supercop-data/panther/amd64/lib" "-L" ".../supercop-data/panther/amd64/try/c/clang_-march=native_-Os_-fwrapv_-Qunused-arguments_-fPIC_-fPIE_-gdwarf-4_-Wall/constbranchindex/crypto_hash/sha512/rust_sha2/work/target/release/build/crypto_hash_sha512-8610fd54643f5720/out" "-L" "/usr/lib/rustlib/x86_64-unknown-linux-gnu/lib" "-lmeasure-anything" "-lmeasure" "-lsupercop" "-lkernelrandombytes" "-lcpucycles" "-lcrypto" "-lntl" "-lnsl" "-lm" "-Wl,-Bstatic" ".../supercop-data/panther/amd64/try/c/clang_-march=native_-Os_-fwrapv_-Qunused-arguments_-fPIC_-fPIE_-gdwarf-4_-Wall/constbranchindex/crypto_hash/sha512/rust_sha2/work/target/release/deps/libcrypto_hash_sha512-e4fe8efba091fb47.rlib" ".../supercop-data/panther/amd64/try/c/clang_-march=native_-Os_-fwrapv_-Qunused-arguments_-fPIC_-fPIE_-gdwarf-4_-Wall/constbranchindex/crypto_hash/sha512/rust_sha2/work/target/release/deps/libsha2-fee2faec0cc98b9d.rlib" ".../supercop-data/panther/amd64/try/c/clang_-march=native_-Os_-fwrapv_-Qunused-arguments_-fPIC_-fPIE_-gdwarf-4_-Wall/constbranchindex/crypto_hash/sha512/rust_sha2/work/target/release/deps/libcpuid_bool-a511188b3e8fb9e7.rlib" ".../supercop-data/panther/amd64/try/c/clang_-march=native_-Os_-fwrapv_-Qunused-arguments_-fPIC_-fPIE_-gdwarf-4_-Wall/constbranchindex/crypto_hash/sha512/rust_sha2/work/target/release/deps/libcfg_if-11669ae4b1851f60.rlib" ".../supercop-data/panther/amd64/try/c/clang_-march=native_-Os_-fwrapv_-Qunused-arguments_-fPIC_-fPIE_-gdwarf-4_-Wall/constbranchindex/crypto_hash/sha512/rust_sha2/work/target/release/deps/libopaque_debug-ff52af415c56e1a8.rlib" ".../supercop-data/panther/amd64/try/c/clang_-march=native_-Os_-fwrapv_-Qunused-arguments_-fPIC_-fPIE_-gdwarf-4_-Wall/constbranchindex/crypto_hash/sha512/rust_sha2/work/target/release/deps/libdigest-137540d47480a0cd.rlib" ".../supercop-data/panther/amd64/try/c/clang_-march=native_-Os_-fwrapv_-Qunused-arguments_-fPIC_-fPIE_-gdwarf-4_-Wall/constbranchindex/crypto_hash/sha512/rust_sha2/work/target/release/deps/libblock_buffer-d8051f65e68b5aa7.rlib" ".../supercop-data/panther/amd64/try/c/clang_-march=native_-Os_-fwrapv_-Qunused-arguments_-fPIC_-fPIE_-gdwarf-4_-Wall/constbranchindex/crypto_hash/sha512/rust_sha2/work/target/release/deps/libgeneric_array-6bd8cd5d26e69f54.rlib" ".../supercop-data/panther/amd64/try/c/clang_-march=native_-Os_-fwrapv_-Qunused-arguments_-fPIC_-fPIE_-gdwarf-4_-Wall/constbranchindex/crypto_hash/sha512/rust_sha2/work/target/release/deps/libtypenum-ac0d7f64b1a84d19.rlib" "-Wl,--start-group" "/usr/lib/rustlib/x86_64-unknown-linux-gnu/lib/libstd-6bf3f16f340782ca.rlib" "/usr/lib/rustlib/x86_64-unknown-linux-gnu/lib/libpanic_unwind-13f3099d50c21bc6.rlib" "/usr/lib/rustlib/x86_64-unknown-linux-gnu/lib/libminiz_oxide-a2ba33c985785afe.rlib" "/usr/lib/rustlib/x86_64-unknown-linux-gnu/lib/libadler-3f6e9f8f4afbea6d.rlib" "/usr/lib/rustlib/x86_64-unknown-linux-gnu/lib/libobject-af517d7f13e7c960.rlib" "/usr/lib/rustlib/x86_64-unknown-linux-gnu/lib/libaddr2line-12740563628e601f.rlib" "/usr/lib/rustlib/x86_64-unknown-linux-gnu/lib/libgimli-0ac82a1e1820dd21.rlib" "/usr/lib/rustlib/x86_64-unknown-linux-gnu/lib/librustc_demangle-3ac2d0878c297d42.rlib" "/usr/lib/rustlib/x86_64-unknown-linux-gnu/lib/libhashbrown-c6632ca171f954dd.rlib" "/usr/lib/rustlib/x86_64-unknown-linux-gnu/lib/librustc_std_workspace_alloc-b5bfd0198c7b740d.rlib" "/usr/lib/rustlib/x86_64-unknown-linux-gnu/lib/libunwind-bd645b20c6c7b56d.rlib" "/usr/lib/rustlib/x86_64-unknown-linux-gnu/lib/libcfg_if-b9e1e523c0c29a77.rlib" "/usr/lib/rustlib/x86_64-unknown-linux-gnu/lib/liblibc-dfbef8c525de0186.rlib" "/usr/lib/rustlib/x86_64-unknown-linux-gnu/lib/liballoc-1ebf406bd4ea5769.rlib" "/usr/lib/rustlib/x86_64-unknown-linux-gnu/lib/librustc_std_workspace_core-5e0675f526ef5c6b.rlib" "/usr/lib/rustlib/x86_64-unknown-linux-gnu/lib/libcore-3375e4f89d420e7a.rlib" "-Wl,--end-group" "/usr/lib/rustlib/x86_64-unknown-linux-gnu/lib/libcompiler_builtins-f74b197469e67088.rlib" "-Wl,-Bdynamic" "-lgcc_s" "-lc" "-lm" "-lrt" "-lpthread" "-lutil" "-ldl" "-lutil"
try.c:   = note: /usr/bin/ld: cannot find -lcpucycles
try.c:           collect2: error: ld returned 1 exit status
try.c:
try.c:
try.c: error: aborting due to previous error
try.c:
try.c: error: could not compile `crypto_hash_sha512`.
try.c:
try.c: To learn more, run the command again with --verbose.

Number of similar (implementation,compiler) pairs: 1, namely:
ImplementationCompiler
rust_sha2clang -march=native -Os -fwrapv -Qunused-arguments -fPIC -fPIE -gdwarf-4 -Wall (Debian_Clang_11.0.1)

Compiler output


try.c: error: linking with `cc` failed: exit code: 1
try.c:   |
try.c:   = note: "cc" "-Wl,--as-needed" "-Wl,-z,noexecstack" "-m64" "-Wl,--eh-frame-hdr" "-L" "/usr/lib/rustlib/x86_64-unknown-linux-gnu/lib" ".../supercop-data/panther/amd64/try/c/clang_-mcpu=native_-O3_-fwrapv_-Qunused-arguments_-fPIC_-fPIE_-gdwarf-4_-Wall/constbranchindex/crypto_hash/sha512/rust_sha2/work/target/release/deps/try_small-a8983f9801c8ab31.try_small.1opzrqsz-cgu.0.rcgu.o" ".../supercop-data/panther/amd64/try/c/clang_-mcpu=native_-O3_-fwrapv_-Qunused-arguments_-fPIC_-fPIE_-gdwarf-4_-Wall/constbranchindex/crypto_hash/sha512/rust_sha2/work/target/release/deps/try_small-a8983f9801c8ab31.try_small.1opzrqsz-cgu.1.rcgu.o" ".../supercop-data/panther/amd64/try/c/clang_-mcpu=native_-O3_-fwrapv_-Qunused-arguments_-fPIC_-fPIE_-gdwarf-4_-Wall/constbranchindex/crypto_hash/sha512/rust_sha2/work/target/release/deps/try_small-a8983f9801c8ab31.try_small.1opzrqsz-cgu.2.rcgu.o" ".../supercop-data/panther/amd64/try/c/clang_-mcpu=native_-O3_-fwrapv_-Qunused-arguments_-fPIC_-fPIE_-gdwarf-4_-Wall/constbranchindex/crypto_hash/sha512/rust_sha2/work/target/release/deps/try_small-a8983f9801c8ab31.try_small.1opzrqsz-cgu.3.rcgu.o" ".../supercop-data/panther/amd64/try/c/clang_-mcpu=native_-O3_-fwrapv_-Qunused-arguments_-fPIC_-fPIE_-gdwarf-4_-Wall/constbranchindex/crypto_hash/sha512/rust_sha2/work/target/release/deps/try_small-a8983f9801c8ab31.try_small.1opzrqsz-cgu.4.rcgu.o" "-o" ".../supercop-data/panther/amd64/try/c/clang_-mcpu=native_-O3_-fwrapv_-Qunused-arguments_-fPIC_-fPIE_-gdwarf-4_-Wall/constbranchindex/crypto_hash/sha512/rust_sha2/work/target/release/deps/try_small-a8983f9801c8ab31" ".../supercop-data/panther/amd64/try/c/clang_-mcpu=native_-O3_-fwrapv_-Qunused-arguments_-fPIC_-fPIE_-gdwarf-4_-Wall/constbranchindex/crypto_hash/sha512/rust_sha2/work/target/release/deps/try_small-a8983f9801c8ab31.21l1w8xgeq9dohzd.rcgu.o" "-Wl,--gc-sections" "-pie" "-Wl,-zrelro" "-Wl,-znow" "-Wl,-O1" "-nodefaultlibs" "-L" ".../supercop-data/panther/amd64/try/c/clang_-mcpu=native_-O3_-fwrapv_-Qunused-arguments_-fPIC_-fPIE_-gdwarf-4_-Wall/constbranchindex/crypto_hash/sha512/rust_sha2/work/target/release/deps" "-L" ".../supercop-data/panther/amd64/lib" "-L" ".../supercop-data/panther/amd64/try/c/clang_-mcpu=native_-O3_-fwrapv_-Qunused-arguments_-fPIC_-fPIE_-gdwarf-4_-Wall/constbranchindex/crypto_hash/sha512/rust_sha2/work/target/release/build/crypto_hash_sha512-8610fd54643f5720/out" "-L" "/usr/lib/rustlib/x86_64-unknown-linux-gnu/lib" "-ltry-anything" "-ltry-small" "-lsupercop" "-lkernelrandombytes" "-lcpucycles" "-lcrypto" "-lntl" "-lnsl" "-lm" "-Wl,-Bstatic" ".../supercop-data/panther/amd64/try/c/clang_-mcpu=native_-O3_-fwrapv_-Qunused-arguments_-fPIC_-fPIE_-gdwarf-4_-Wall/constbranchindex/crypto_hash/sha512/rust_sha2/work/target/release/deps/libcrypto_hash_sha512-e4fe8efba091fb47.rlib" ".../supercop-data/panther/amd64/try/c/clang_-mcpu=native_-O3_-fwrapv_-Qunused-arguments_-fPIC_-fPIE_-gdwarf-4_-Wall/constbranchindex/crypto_hash/sha512/rust_sha2/work/target/release/deps/libsha2-fee2faec0cc98b9d.rlib" ".../supercop-data/panther/amd64/try/c/clang_-mcpu=native_-O3_-fwrapv_-Qunused-arguments_-fPIC_-fPIE_-gdwarf-4_-Wall/constbranchindex/crypto_hash/sha512/rust_sha2/work/target/release/deps/libcpuid_bool-a511188b3e8fb9e7.rlib" ".../supercop-data/panther/amd64/try/c/clang_-mcpu=native_-O3_-fwrapv_-Qunused-arguments_-fPIC_-fPIE_-gdwarf-4_-Wall/constbranchindex/crypto_hash/sha512/rust_sha2/work/target/release/deps/libcfg_if-11669ae4b1851f60.rlib" ".../supercop-data/panther/amd64/try/c/clang_-mcpu=native_-O3_-fwrapv_-Qunused-arguments_-fPIC_-fPIE_-gdwarf-4_-Wall/constbranchindex/crypto_hash/sha512/rust_sha2/work/target/release/deps/libopaque_debug-ff52af415c56e1a8.rlib" ".../supercop-data/panther/amd64/try/c/clang_-mcpu=native_-O3_-fwrapv_-Qunused-arguments_-fPIC_-fPIE_-gdwarf-4_-Wall/constbranchindex/crypto_hash/sha512/rust_sha2/work/target/release/deps/libdigest-137540d47480a0cd.rlib" ".../supercop-data/panther/amd64/try/c/clang_-mcpu=native_-O3_-fwrapv_-Qunused-arguments_-fPIC_-fPIE_-gdwarf-4_-Wall/constbranchindex/crypto_hash/sha512/rust_sha2/work/target/release/deps/libblock_buffer-d8051f65e68b5aa7.rlib" ".../supercop-data/panther/amd64/try/c/clang_-mcpu=native_-O3_-fwrapv_-Qunused-arguments_-fPIC_-fPIE_-gdwarf-4_-Wall/constbranchindex/crypto_hash/sha512/rust_sha2/work/target/release/deps/libgeneric_array-6bd8cd5d26e69f54.rlib" ".../supercop-data/panther/amd64/try/c/clang_-mcpu=native_-O3_-fwrapv_-Qunused-arguments_-fPIC_-fPIE_-gdwarf-4_-Wall/constbranchindex/crypto_hash/sha512/rust_sha2/work/target/release/deps/libtypenum-ac0d7f64b1a84d19.rlib" "-Wl,--start-group" "/usr/lib/rustlib/x86_64-unknown-linux-gnu/lib/libstd-6bf3f16f340782ca.rlib" "/usr/lib/rustlib/x86_64-unknown-linux-gnu/lib/libpanic_unwind-13f3099d50c21bc6.rlib" "/usr/lib/rustlib/x86_64-unknown-linux-gnu/lib/libminiz_oxide-a2ba33c985785afe.rlib" "/usr/lib/rustlib/x86_64-unknown-linux-gnu/lib/libadler-3f6e9f8f4afbea6d.rlib" "/usr/lib/rustlib/x86_64-unknown-linux-gnu/lib/libobject-af517d7f13e7c960.rlib" "/usr/lib/rustlib/x86_64-unknown-linux-gnu/lib/libaddr2line-12740563628e601f.rlib" "/usr/lib/rustlib/x86_64-unknown-linux-gnu/lib/libgimli-0ac82a1e1820dd21.rlib" "/usr/lib/rustlib/x86_64-unknown-linux-gnu/lib/librustc_demangle-3ac2d0878c297d42.rlib" "/usr/lib/rustlib/x86_64-unknown-linux-gnu/lib/libhashbrown-c6632ca171f954dd.rlib" "/usr/lib/rustlib/x86_64-unknown-linux-gnu/lib/librustc_std_workspace_alloc-b5bfd0198c7b740d.rlib" "/usr/lib/rustlib/x86_64-unknown-linux-gnu/lib/libunwind-bd645b20c6c7b56d.rlib" "/usr/lib/rustlib/x86_64-unknown-linux-gnu/lib/libcfg_if-b9e1e523c0c29a77.rlib" "/usr/lib/rustlib/x86_64-unknown-linux-gnu/lib/liblibc-dfbef8c525de0186.rlib" "/usr/lib/rustlib/x86_64-unknown-linux-gnu/lib/liballoc-1ebf406bd4ea5769.rlib" "/usr/lib/rustlib/x86_64-unknown-linux-gnu/lib/librustc_std_workspace_core-5e0675f526ef5c6b.rlib" "/usr/lib/rustlib/x86_64-unknown-linux-gnu/lib/libcore-3375e4f89d420e7a.rlib" "-Wl,--end-group" "/usr/lib/rustlib/x86_64-unknown-linux-gnu/lib/libcompiler_builtins-f74b197469e67088.rlib" "-Wl,-Bdynamic" "-lgcc_s" "-lc" "-lm" "-lrt" "-lpthread" "-lutil" "-ldl" "-lutil"
try.c:   = note: /usr/bin/ld: cannot find -lcpucycles
try.c:           collect2: error: ld returned 1 exit status
try.c:
try.c:
try.c: error: aborting due to previous error
try.c:
try.c: error: could not compile `crypto_hash_sha512`.
try.c:
try.c: To learn more, run the command again with --verbose.

Number of similar (implementation,compiler) pairs: 1, namely:
ImplementationCompiler
rust_sha2clang -mcpu=native -O3 -fwrapv -Qunused-arguments -fPIC -fPIE -gdwarf-4 -Wall (Debian_Clang_11.0.1)

Compiler output


try.c: error: linking with `cc` failed: exit code: 1
try.c:   |
try.c:   = note: "cc" "-Wl,--as-needed" "-Wl,-z,noexecstack" "-m64" "-Wl,--eh-frame-hdr" "-L" "/usr/lib/rustlib/x86_64-unknown-linux-gnu/lib" ".../supercop-data/panther/amd64/try/c/gcc_-march=native_-mtune=native_-O2_-fwrapv_-fPIC_-fPIE_-gdwarf-4_-Wall/constbranchindex/crypto_hash/sha512/rust_sha2/work/target/release/deps/measure-62e65a11161a4206.measure.9ynvwos1-cgu.0.rcgu.o" ".../supercop-data/panther/amd64/try/c/gcc_-march=native_-mtune=native_-O2_-fwrapv_-fPIC_-fPIE_-gdwarf-4_-Wall/constbranchindex/crypto_hash/sha512/rust_sha2/work/target/release/deps/measure-62e65a11161a4206.measure.9ynvwos1-cgu.1.rcgu.o" ".../supercop-data/panther/amd64/try/c/gcc_-march=native_-mtune=native_-O2_-fwrapv_-fPIC_-fPIE_-gdwarf-4_-Wall/constbranchindex/crypto_hash/sha512/rust_sha2/work/target/release/deps/measure-62e65a11161a4206.measure.9ynvwos1-cgu.2.rcgu.o" ".../supercop-data/panther/amd64/try/c/gcc_-march=native_-mtune=native_-O2_-fwrapv_-fPIC_-fPIE_-gdwarf-4_-Wall/constbranchindex/crypto_hash/sha512/rust_sha2/work/target/release/deps/measure-62e65a11161a4206.measure.9ynvwos1-cgu.3.rcgu.o" ".../supercop-data/panther/amd64/try/c/gcc_-march=native_-mtune=native_-O2_-fwrapv_-fPIC_-fPIE_-gdwarf-4_-Wall/constbranchindex/crypto_hash/sha512/rust_sha2/work/target/release/deps/measure-62e65a11161a4206.measure.9ynvwos1-cgu.4.rcgu.o" "-o" ".../supercop-data/panther/amd64/try/c/gcc_-march=native_-mtune=native_-O2_-fwrapv_-fPIC_-fPIE_-gdwarf-4_-Wall/constbranchindex/crypto_hash/sha512/rust_sha2/work/target/release/deps/measure-62e65a11161a4206" ".../supercop-data/panther/amd64/try/c/gcc_-march=native_-mtune=native_-O2_-fwrapv_-fPIC_-fPIE_-gdwarf-4_-Wall/constbranchindex/crypto_hash/sha512/rust_sha2/work/target/release/deps/measure-62e65a11161a4206.33ylmmgb9f5xq2mk.rcgu.o" "-Wl,--gc-sections" "-pie" "-Wl,-zrelro" "-Wl,-znow" "-Wl,-O1" "-nodefaultlibs" "-L" ".../supercop-data/panther/amd64/try/c/gcc_-march=native_-mtune=native_-O2_-fwrapv_-fPIC_-fPIE_-gdwarf-4_-Wall/constbranchindex/crypto_hash/sha512/rust_sha2/work/target/release/deps" "-L" ".../supercop-data/panther/amd64/lib" "-L" ".../supercop-data/panther/amd64/try/c/gcc_-march=native_-mtune=native_-O2_-fwrapv_-fPIC_-fPIE_-gdwarf-4_-Wall/constbranchindex/crypto_hash/sha512/rust_sha2/work/target/release/build/crypto_hash_sha512-8610fd54643f5720/out" "-L" "/usr/lib/rustlib/x86_64-unknown-linux-gnu/lib" "-lmeasure-anything" "-lmeasure" "-lsupercop" "-lkernelrandombytes" "-lcpucycles" "-lcrypto" "-lntl" "-lnsl" "-lm" "-Wl,-Bstatic" ".../supercop-data/panther/amd64/try/c/gcc_-march=native_-mtune=native_-O2_-fwrapv_-fPIC_-fPIE_-gdwarf-4_-Wall/constbranchindex/crypto_hash/sha512/rust_sha2/work/target/release/deps/libcrypto_hash_sha512-e4fe8efba091fb47.rlib" ".../supercop-data/panther/amd64/try/c/gcc_-march=native_-mtune=native_-O2_-fwrapv_-fPIC_-fPIE_-gdwarf-4_-Wall/constbranchindex/crypto_hash/sha512/rust_sha2/work/target/release/deps/libsha2-fee2faec0cc98b9d.rlib" ".../supercop-data/panther/amd64/try/c/gcc_-march=native_-mtune=native_-O2_-fwrapv_-fPIC_-fPIE_-gdwarf-4_-Wall/constbranchindex/crypto_hash/sha512/rust_sha2/work/target/release/deps/libcpuid_bool-a511188b3e8fb9e7.rlib" ".../supercop-data/panther/amd64/try/c/gcc_-march=native_-mtune=native_-O2_-fwrapv_-fPIC_-fPIE_-gdwarf-4_-Wall/constbranchindex/crypto_hash/sha512/rust_sha2/work/target/release/deps/libcfg_if-11669ae4b1851f60.rlib" ".../supercop-data/panther/amd64/try/c/gcc_-march=native_-mtune=native_-O2_-fwrapv_-fPIC_-fPIE_-gdwarf-4_-Wall/constbranchindex/crypto_hash/sha512/rust_sha2/work/target/release/deps/libopaque_debug-ff52af415c56e1a8.rlib" ".../supercop-data/panther/amd64/try/c/gcc_-march=native_-mtune=native_-O2_-fwrapv_-fPIC_-fPIE_-gdwarf-4_-Wall/constbranchindex/crypto_hash/sha512/rust_sha2/work/target/release/deps/libdigest-137540d47480a0cd.rlib" ".../supercop-data/panther/amd64/try/c/gcc_-march=native_-mtune=native_-O2_-fwrapv_-fPIC_-fPIE_-gdwarf-4_-Wall/constbranchindex/crypto_hash/sha512/rust_sha2/work/target/release/deps/libblock_buffer-d8051f65e68b5aa7.rlib" ".../supercop-data/panther/amd64/try/c/gcc_-march=native_-mtune=native_-O2_-fwrapv_-fPIC_-fPIE_-gdwarf-4_-Wall/constbranchindex/crypto_hash/sha512/rust_sha2/work/target/release/deps/libgeneric_array-6bd8cd5d26e69f54.rlib" ".../supercop-data/panther/amd64/try/c/gcc_-march=native_-mtune=native_-O2_-fwrapv_-fPIC_-fPIE_-gdwarf-4_-Wall/constbranchindex/crypto_hash/sha512/rust_sha2/work/target/release/deps/libtypenum-ac0d7f64b1a84d19.rlib" "-Wl,--start-group" "/usr/lib/rustlib/x86_64-unknown-linux-gnu/lib/libstd-6bf3f16f340782ca.rlib" "/usr/lib/rustlib/x86_64-unknown-linux-gnu/lib/libpanic_unwind-13f3099d50c21bc6.rlib" "/usr/lib/rustlib/x86_64-unknown-linux-gnu/lib/libminiz_oxide-a2ba33c985785afe.rlib" "/usr/lib/rustlib/x86_64-unknown-linux-gnu/lib/libadler-3f6e9f8f4afbea6d.rlib" "/usr/lib/rustlib/x86_64-unknown-linux-gnu/lib/libobject-af517d7f13e7c960.rlib" "/usr/lib/rustlib/x86_64-unknown-linux-gnu/lib/libaddr2line-12740563628e601f.rlib" "/usr/lib/rustlib/x86_64-unknown-linux-gnu/lib/libgimli-0ac82a1e1820dd21.rlib" "/usr/lib/rustlib/x86_64-unknown-linux-gnu/lib/librustc_demangle-3ac2d0878c297d42.rlib" "/usr/lib/rustlib/x86_64-unknown-linux-gnu/lib/libhashbrown-c6632ca171f954dd.rlib" "/usr/lib/rustlib/x86_64-unknown-linux-gnu/lib/librustc_std_workspace_alloc-b5bfd0198c7b740d.rlib" "/usr/lib/rustlib/x86_64-unknown-linux-gnu/lib/libunwind-bd645b20c6c7b56d.rlib" "/usr/lib/rustlib/x86_64-unknown-linux-gnu/lib/libcfg_if-b9e1e523c0c29a77.rlib" "/usr/lib/rustlib/x86_64-unknown-linux-gnu/lib/liblibc-dfbef8c525de0186.rlib" "/usr/lib/rustlib/x86_64-unknown-linux-gnu/lib/liballoc-1ebf406bd4ea5769.rlib" "/usr/lib/rustlib/x86_64-unknown-linux-gnu/lib/librustc_std_workspace_core-5e0675f526ef5c6b.rlib" "/usr/lib/rustlib/x86_64-unknown-linux-gnu/lib/libcore-3375e4f89d420e7a.rlib" "-Wl,--end-group" "/usr/lib/rustlib/x86_64-unknown-linux-gnu/lib/libcompiler_builtins-f74b197469e67088.rlib" "-Wl,-Bdynamic" "-lgcc_s" "-lc" "-lm" "-lrt" "-lpthread" "-lutil" "-ldl" "-lutil"
try.c:   = note: /usr/bin/ld: cannot find -lcpucycles
try.c:           collect2: error: ld returned 1 exit status
try.c:
try.c:
try.c: error: aborting due to previous error
try.c:
try.c: error: could not compile `crypto_hash_sha512`.
try.c:
try.c: To learn more, run the command again with --verbose.

Number of similar (implementation,compiler) pairs: 1, namely:
ImplementationCompiler
rust_sha2gcc -march=native -mtune=native -O2 -fwrapv -fPIC -fPIE -gdwarf-4 -Wall (10.2.1_20210110)

Compiler output


try.c: error: linking with `cc` failed: exit code: 1
try.c:   |
try.c:   = note: "cc" "-Wl,--as-needed" "-Wl,-z,noexecstack" "-m64" "-Wl,--eh-frame-hdr" "-L" "/usr/lib/rustlib/x86_64-unknown-linux-gnu/lib" ".../supercop-data/panther/amd64/try/c/gcc_-march=native_-mtune=native_-O3_-fwrapv_-fPIC_-fPIE_-gdwarf-4_-Wall/constbranchindex/crypto_hash/sha512/rust_sha2/work/target/release/deps/measure-62e65a11161a4206.measure.9ynvwos1-cgu.0.rcgu.o" ".../supercop-data/panther/amd64/try/c/gcc_-march=native_-mtune=native_-O3_-fwrapv_-fPIC_-fPIE_-gdwarf-4_-Wall/constbranchindex/crypto_hash/sha512/rust_sha2/work/target/release/deps/measure-62e65a11161a4206.measure.9ynvwos1-cgu.1.rcgu.o" ".../supercop-data/panther/amd64/try/c/gcc_-march=native_-mtune=native_-O3_-fwrapv_-fPIC_-fPIE_-gdwarf-4_-Wall/constbranchindex/crypto_hash/sha512/rust_sha2/work/target/release/deps/measure-62e65a11161a4206.measure.9ynvwos1-cgu.2.rcgu.o" ".../supercop-data/panther/amd64/try/c/gcc_-march=native_-mtune=native_-O3_-fwrapv_-fPIC_-fPIE_-gdwarf-4_-Wall/constbranchindex/crypto_hash/sha512/rust_sha2/work/target/release/deps/measure-62e65a11161a4206.measure.9ynvwos1-cgu.3.rcgu.o" ".../supercop-data/panther/amd64/try/c/gcc_-march=native_-mtune=native_-O3_-fwrapv_-fPIC_-fPIE_-gdwarf-4_-Wall/constbranchindex/crypto_hash/sha512/rust_sha2/work/target/release/deps/measure-62e65a11161a4206.measure.9ynvwos1-cgu.4.rcgu.o" "-o" ".../supercop-data/panther/amd64/try/c/gcc_-march=native_-mtune=native_-O3_-fwrapv_-fPIC_-fPIE_-gdwarf-4_-Wall/constbranchindex/crypto_hash/sha512/rust_sha2/work/target/release/deps/measure-62e65a11161a4206" ".../supercop-data/panther/amd64/try/c/gcc_-march=native_-mtune=native_-O3_-fwrapv_-fPIC_-fPIE_-gdwarf-4_-Wall/constbranchindex/crypto_hash/sha512/rust_sha2/work/target/release/deps/measure-62e65a11161a4206.33ylmmgb9f5xq2mk.rcgu.o" "-Wl,--gc-sections" "-pie" "-Wl,-zrelro" "-Wl,-znow" "-Wl,-O1" "-nodefaultlibs" "-L" ".../supercop-data/panther/amd64/try/c/gcc_-march=native_-mtune=native_-O3_-fwrapv_-fPIC_-fPIE_-gdwarf-4_-Wall/constbranchindex/crypto_hash/sha512/rust_sha2/work/target/release/deps" "-L" ".../supercop-data/panther/amd64/lib" "-L" ".../supercop-data/panther/amd64/try/c/gcc_-march=native_-mtune=native_-O3_-fwrapv_-fPIC_-fPIE_-gdwarf-4_-Wall/constbranchindex/crypto_hash/sha512/rust_sha2/work/target/release/build/crypto_hash_sha512-8610fd54643f5720/out" "-L" "/usr/lib/rustlib/x86_64-unknown-linux-gnu/lib" "-lmeasure-anything" "-lmeasure" "-lsupercop" "-lkernelrandombytes" "-lcpucycles" "-lcrypto" "-lntl" "-lnsl" "-lm" "-Wl,-Bstatic" ".../supercop-data/panther/amd64/try/c/gcc_-march=native_-mtune=native_-O3_-fwrapv_-fPIC_-fPIE_-gdwarf-4_-Wall/constbranchindex/crypto_hash/sha512/rust_sha2/work/target/release/deps/libcrypto_hash_sha512-e4fe8efba091fb47.rlib" ".../supercop-data/panther/amd64/try/c/gcc_-march=native_-mtune=native_-O3_-fwrapv_-fPIC_-fPIE_-gdwarf-4_-Wall/constbranchindex/crypto_hash/sha512/rust_sha2/work/target/release/deps/libsha2-fee2faec0cc98b9d.rlib" ".../supercop-data/panther/amd64/try/c/gcc_-march=native_-mtune=native_-O3_-fwrapv_-fPIC_-fPIE_-gdwarf-4_-Wall/constbranchindex/crypto_hash/sha512/rust_sha2/work/target/release/deps/libcpuid_bool-a511188b3e8fb9e7.rlib" ".../supercop-data/panther/amd64/try/c/gcc_-march=native_-mtune=native_-O3_-fwrapv_-fPIC_-fPIE_-gdwarf-4_-Wall/constbranchindex/crypto_hash/sha512/rust_sha2/work/target/release/deps/libcfg_if-11669ae4b1851f60.rlib" ".../supercop-data/panther/amd64/try/c/gcc_-march=native_-mtune=native_-O3_-fwrapv_-fPIC_-fPIE_-gdwarf-4_-Wall/constbranchindex/crypto_hash/sha512/rust_sha2/work/target/release/deps/libopaque_debug-ff52af415c56e1a8.rlib" ".../supercop-data/panther/amd64/try/c/gcc_-march=native_-mtune=native_-O3_-fwrapv_-fPIC_-fPIE_-gdwarf-4_-Wall/constbranchindex/crypto_hash/sha512/rust_sha2/work/target/release/deps/libdigest-137540d47480a0cd.rlib" ".../supercop-data/panther/amd64/try/c/gcc_-march=native_-mtune=native_-O3_-fwrapv_-fPIC_-fPIE_-gdwarf-4_-Wall/constbranchindex/crypto_hash/sha512/rust_sha2/work/target/release/deps/libblock_buffer-d8051f65e68b5aa7.rlib" ".../supercop-data/panther/amd64/try/c/gcc_-march=native_-mtune=native_-O3_-fwrapv_-fPIC_-fPIE_-gdwarf-4_-Wall/constbranchindex/crypto_hash/sha512/rust_sha2/work/target/release/deps/libgeneric_array-6bd8cd5d26e69f54.rlib" ".../supercop-data/panther/amd64/try/c/gcc_-march=native_-mtune=native_-O3_-fwrapv_-fPIC_-fPIE_-gdwarf-4_-Wall/constbranchindex/crypto_hash/sha512/rust_sha2/work/target/release/deps/libtypenum-ac0d7f64b1a84d19.rlib" "-Wl,--start-group" "/usr/lib/rustlib/x86_64-unknown-linux-gnu/lib/libstd-6bf3f16f340782ca.rlib" "/usr/lib/rustlib/x86_64-unknown-linux-gnu/lib/libpanic_unwind-13f3099d50c21bc6.rlib" "/usr/lib/rustlib/x86_64-unknown-linux-gnu/lib/libminiz_oxide-a2ba33c985785afe.rlib" "/usr/lib/rustlib/x86_64-unknown-linux-gnu/lib/libadler-3f6e9f8f4afbea6d.rlib" "/usr/lib/rustlib/x86_64-unknown-linux-gnu/lib/libobject-af517d7f13e7c960.rlib" "/usr/lib/rustlib/x86_64-unknown-linux-gnu/lib/libaddr2line-12740563628e601f.rlib" "/usr/lib/rustlib/x86_64-unknown-linux-gnu/lib/libgimli-0ac82a1e1820dd21.rlib" "/usr/lib/rustlib/x86_64-unknown-linux-gnu/lib/librustc_demangle-3ac2d0878c297d42.rlib" "/usr/lib/rustlib/x86_64-unknown-linux-gnu/lib/libhashbrown-c6632ca171f954dd.rlib" "/usr/lib/rustlib/x86_64-unknown-linux-gnu/lib/librustc_std_workspace_alloc-b5bfd0198c7b740d.rlib" "/usr/lib/rustlib/x86_64-unknown-linux-gnu/lib/libunwind-bd645b20c6c7b56d.rlib" "/usr/lib/rustlib/x86_64-unknown-linux-gnu/lib/libcfg_if-b9e1e523c0c29a77.rlib" "/usr/lib/rustlib/x86_64-unknown-linux-gnu/lib/liblibc-dfbef8c525de0186.rlib" "/usr/lib/rustlib/x86_64-unknown-linux-gnu/lib/liballoc-1ebf406bd4ea5769.rlib" "/usr/lib/rustlib/x86_64-unknown-linux-gnu/lib/librustc_std_workspace_core-5e0675f526ef5c6b.rlib" "/usr/lib/rustlib/x86_64-unknown-linux-gnu/lib/libcore-3375e4f89d420e7a.rlib" "-Wl,--end-group" "/usr/lib/rustlib/x86_64-unknown-linux-gnu/lib/libcompiler_builtins-f74b197469e67088.rlib" "-Wl,-Bdynamic" "-lgcc_s" "-lc" "-lm" "-lrt" "-lpthread" "-lutil" "-ldl" "-lutil"
try.c:   = note: /usr/bin/ld: cannot find -lcpucycles
try.c:           collect2: error: ld returned 1 exit status
try.c:
try.c:
try.c: error: aborting due to previous error
try.c:
try.c: error: could not compile `crypto_hash_sha512`.
try.c:
try.c: To learn more, run the command again with --verbose.

Number of similar (implementation,compiler) pairs: 1, namely:
ImplementationCompiler
rust_sha2gcc -march=native -mtune=native -O3 -fwrapv -fPIC -fPIE -gdwarf-4 -Wall (10.2.1_20210110)

Compiler output


try.c: error: linking with `cc` failed: exit code: 1
try.c:   |
try.c:   = note: "cc" "-Wl,--as-needed" "-Wl,-z,noexecstack" "-m64" "-Wl,--eh-frame-hdr" "-L" "/usr/lib/rustlib/x86_64-unknown-linux-gnu/lib" ".../supercop-data/panther/amd64/try/c/gcc_-march=native_-mtune=native_-O_-fwrapv_-fPIC_-fPIE_-gdwarf-4_-Wall/constbranchindex/crypto_hash/sha512/rust_sha2/work/target/release/deps/try-2e984dae12dcb697.try.be54quaq-cgu.0.rcgu.o" ".../supercop-data/panther/amd64/try/c/gcc_-march=native_-mtune=native_-O_-fwrapv_-fPIC_-fPIE_-gdwarf-4_-Wall/constbranchindex/crypto_hash/sha512/rust_sha2/work/target/release/deps/try-2e984dae12dcb697.try.be54quaq-cgu.1.rcgu.o" ".../supercop-data/panther/amd64/try/c/gcc_-march=native_-mtune=native_-O_-fwrapv_-fPIC_-fPIE_-gdwarf-4_-Wall/constbranchindex/crypto_hash/sha512/rust_sha2/work/target/release/deps/try-2e984dae12dcb697.try.be54quaq-cgu.2.rcgu.o" ".../supercop-data/panther/amd64/try/c/gcc_-march=native_-mtune=native_-O_-fwrapv_-fPIC_-fPIE_-gdwarf-4_-Wall/constbranchindex/crypto_hash/sha512/rust_sha2/work/target/release/deps/try-2e984dae12dcb697.try.be54quaq-cgu.3.rcgu.o" ".../supercop-data/panther/amd64/try/c/gcc_-march=native_-mtune=native_-O_-fwrapv_-fPIC_-fPIE_-gdwarf-4_-Wall/constbranchindex/crypto_hash/sha512/rust_sha2/work/target/release/deps/try-2e984dae12dcb697.try.be54quaq-cgu.4.rcgu.o" "-o" ".../supercop-data/panther/amd64/try/c/gcc_-march=native_-mtune=native_-O_-fwrapv_-fPIC_-fPIE_-gdwarf-4_-Wall/constbranchindex/crypto_hash/sha512/rust_sha2/work/target/release/deps/try-2e984dae12dcb697" ".../supercop-data/panther/amd64/try/c/gcc_-march=native_-mtune=native_-O_-fwrapv_-fPIC_-fPIE_-gdwarf-4_-Wall/constbranchindex/crypto_hash/sha512/rust_sha2/work/target/release/deps/try-2e984dae12dcb697.44gegrhwt6zkjd5o.rcgu.o" "-Wl,--gc-sections" "-pie" "-Wl,-zrelro" "-Wl,-znow" "-Wl,-O1" "-nodefaultlibs" "-L" ".../supercop-data/panther/amd64/try/c/gcc_-march=native_-mtune=native_-O_-fwrapv_-fPIC_-fPIE_-gdwarf-4_-Wall/constbranchindex/crypto_hash/sha512/rust_sha2/work/target/release/deps" "-L" ".../supercop-data/panther/amd64/lib" "-L" ".../supercop-data/panther/amd64/try/c/gcc_-march=native_-mtune=native_-O_-fwrapv_-fPIC_-fPIE_-gdwarf-4_-Wall/constbranchindex/crypto_hash/sha512/rust_sha2/work/target/release/build/crypto_hash_sha512-8610fd54643f5720/out" "-L" "/usr/lib/rustlib/x86_64-unknown-linux-gnu/lib" "-ltry-anything" "-ltry" "-lsupercop" "-lkernelrandombytes" "-lcpucycles" "-lcrypto" "-lntl" "-lnsl" "-lm" "-Wl,-Bstatic" ".../supercop-data/panther/amd64/try/c/gcc_-march=native_-mtune=native_-O_-fwrapv_-fPIC_-fPIE_-gdwarf-4_-Wall/constbranchindex/crypto_hash/sha512/rust_sha2/work/target/release/deps/libcrypto_hash_sha512-e4fe8efba091fb47.rlib" ".../supercop-data/panther/amd64/try/c/gcc_-march=native_-mtune=native_-O_-fwrapv_-fPIC_-fPIE_-gdwarf-4_-Wall/constbranchindex/crypto_hash/sha512/rust_sha2/work/target/release/deps/libsha2-fee2faec0cc98b9d.rlib" ".../supercop-data/panther/amd64/try/c/gcc_-march=native_-mtune=native_-O_-fwrapv_-fPIC_-fPIE_-gdwarf-4_-Wall/constbranchindex/crypto_hash/sha512/rust_sha2/work/target/release/deps/libcpuid_bool-a511188b3e8fb9e7.rlib" ".../supercop-data/panther/amd64/try/c/gcc_-march=native_-mtune=native_-O_-fwrapv_-fPIC_-fPIE_-gdwarf-4_-Wall/constbranchindex/crypto_hash/sha512/rust_sha2/work/target/release/deps/libcfg_if-11669ae4b1851f60.rlib" ".../supercop-data/panther/amd64/try/c/gcc_-march=native_-mtune=native_-O_-fwrapv_-fPIC_-fPIE_-gdwarf-4_-Wall/constbranchindex/crypto_hash/sha512/rust_sha2/work/target/release/deps/libopaque_debug-ff52af415c56e1a8.rlib" ".../supercop-data/panther/amd64/try/c/gcc_-march=native_-mtune=native_-O_-fwrapv_-fPIC_-fPIE_-gdwarf-4_-Wall/constbranchindex/crypto_hash/sha512/rust_sha2/work/target/release/deps/libdigest-137540d47480a0cd.rlib" ".../supercop-data/panther/amd64/try/c/gcc_-march=native_-mtune=native_-O_-fwrapv_-fPIC_-fPIE_-gdwarf-4_-Wall/constbranchindex/crypto_hash/sha512/rust_sha2/work/target/release/deps/libblock_buffer-d8051f65e68b5aa7.rlib" ".../supercop-data/panther/amd64/try/c/gcc_-march=native_-mtune=native_-O_-fwrapv_-fPIC_-fPIE_-gdwarf-4_-Wall/constbranchindex/crypto_hash/sha512/rust_sha2/work/target/release/deps/libgeneric_array-6bd8cd5d26e69f54.rlib" ".../supercop-data/panther/amd64/try/c/gcc_-march=native_-mtune=native_-O_-fwrapv_-fPIC_-fPIE_-gdwarf-4_-Wall/constbranchindex/crypto_hash/sha512/rust_sha2/work/target/release/deps/libtypenum-ac0d7f64b1a84d19.rlib" "-Wl,--start-group" "/usr/lib/rustlib/x86_64-unknown-linux-gnu/lib/libstd-6bf3f16f340782ca.rlib" "/usr/lib/rustlib/x86_64-unknown-linux-gnu/lib/libpanic_unwind-13f3099d50c21bc6.rlib" "/usr/lib/rustlib/x86_64-unknown-linux-gnu/lib/libminiz_oxide-a2ba33c985785afe.rlib" "/usr/lib/rustlib/x86_64-unknown-linux-gnu/lib/libadler-3f6e9f8f4afbea6d.rlib" "/usr/lib/rustlib/x86_64-unknown-linux-gnu/lib/libobject-af517d7f13e7c960.rlib" "/usr/lib/rustlib/x86_64-unknown-linux-gnu/lib/libaddr2line-12740563628e601f.rlib" "/usr/lib/rustlib/x86_64-unknown-linux-gnu/lib/libgimli-0ac82a1e1820dd21.rlib" "/usr/lib/rustlib/x86_64-unknown-linux-gnu/lib/librustc_demangle-3ac2d0878c297d42.rlib" "/usr/lib/rustlib/x86_64-unknown-linux-gnu/lib/libhashbrown-c6632ca171f954dd.rlib" "/usr/lib/rustlib/x86_64-unknown-linux-gnu/lib/librustc_std_workspace_alloc-b5bfd0198c7b740d.rlib" "/usr/lib/rustlib/x86_64-unknown-linux-gnu/lib/libunwind-bd645b20c6c7b56d.rlib" "/usr/lib/rustlib/x86_64-unknown-linux-gnu/lib/libcfg_if-b9e1e523c0c29a77.rlib" "/usr/lib/rustlib/x86_64-unknown-linux-gnu/lib/liblibc-dfbef8c525de0186.rlib" "/usr/lib/rustlib/x86_64-unknown-linux-gnu/lib/liballoc-1ebf406bd4ea5769.rlib" "/usr/lib/rustlib/x86_64-unknown-linux-gnu/lib/librustc_std_workspace_core-5e0675f526ef5c6b.rlib" "/usr/lib/rustlib/x86_64-unknown-linux-gnu/lib/libcore-3375e4f89d420e7a.rlib" "-Wl,--end-group" "/usr/lib/rustlib/x86_64-unknown-linux-gnu/lib/libcompiler_builtins-f74b197469e67088.rlib" "-Wl,-Bdynamic" "-lgcc_s" "-lc" "-lm" "-lrt" "-lpthread" "-lutil" "-ldl" "-lutil"
try.c:   = note: /usr/bin/ld: cannot find -lcpucycles
try.c:           collect2: error: ld returned 1 exit status
try.c:
try.c:
try.c: error: aborting due to previous error
try.c:
try.c: error: could not compile `crypto_hash_sha512`.
try.c:
try.c: To learn more, run the command again with --verbose.

Number of similar (implementation,compiler) pairs: 1, namely:
ImplementationCompiler
rust_sha2gcc -march=native -mtune=native -O -fwrapv -fPIC -fPIE -gdwarf-4 -Wall (10.2.1_20210110)

Compiler output


try.c: error: linking with `cc` failed: exit code: 1
try.c:   |
try.c:   = note: "cc" "-Wl,--as-needed" "-Wl,-z,noexecstack" "-m64" "-Wl,--eh-frame-hdr" "-L" "/usr/lib/rustlib/x86_64-unknown-linux-gnu/lib" ".../supercop-data/panther/amd64/try/c/gcc_-march=native_-mtune=native_-Os_-fwrapv_-fPIC_-fPIE_-gdwarf-4_-Wall/constbranchindex/crypto_hash/sha512/rust_sha2/work/target/release/deps/try_small-a8983f9801c8ab31.try_small.1opzrqsz-cgu.0.rcgu.o" ".../supercop-data/panther/amd64/try/c/gcc_-march=native_-mtune=native_-Os_-fwrapv_-fPIC_-fPIE_-gdwarf-4_-Wall/constbranchindex/crypto_hash/sha512/rust_sha2/work/target/release/deps/try_small-a8983f9801c8ab31.try_small.1opzrqsz-cgu.1.rcgu.o" ".../supercop-data/panther/amd64/try/c/gcc_-march=native_-mtune=native_-Os_-fwrapv_-fPIC_-fPIE_-gdwarf-4_-Wall/constbranchindex/crypto_hash/sha512/rust_sha2/work/target/release/deps/try_small-a8983f9801c8ab31.try_small.1opzrqsz-cgu.2.rcgu.o" ".../supercop-data/panther/amd64/try/c/gcc_-march=native_-mtune=native_-Os_-fwrapv_-fPIC_-fPIE_-gdwarf-4_-Wall/constbranchindex/crypto_hash/sha512/rust_sha2/work/target/release/deps/try_small-a8983f9801c8ab31.try_small.1opzrqsz-cgu.3.rcgu.o" ".../supercop-data/panther/amd64/try/c/gcc_-march=native_-mtune=native_-Os_-fwrapv_-fPIC_-fPIE_-gdwarf-4_-Wall/constbranchindex/crypto_hash/sha512/rust_sha2/work/target/release/deps/try_small-a8983f9801c8ab31.try_small.1opzrqsz-cgu.4.rcgu.o" "-o" ".../supercop-data/panther/amd64/try/c/gcc_-march=native_-mtune=native_-Os_-fwrapv_-fPIC_-fPIE_-gdwarf-4_-Wall/constbranchindex/crypto_hash/sha512/rust_sha2/work/target/release/deps/try_small-a8983f9801c8ab31" ".../supercop-data/panther/amd64/try/c/gcc_-march=native_-mtune=native_-Os_-fwrapv_-fPIC_-fPIE_-gdwarf-4_-Wall/constbranchindex/crypto_hash/sha512/rust_sha2/work/target/release/deps/try_small-a8983f9801c8ab31.21l1w8xgeq9dohzd.rcgu.o" "-Wl,--gc-sections" "-pie" "-Wl,-zrelro" "-Wl,-znow" "-Wl,-O1" "-nodefaultlibs" "-L" ".../supercop-data/panther/amd64/try/c/gcc_-march=native_-mtune=native_-Os_-fwrapv_-fPIC_-fPIE_-gdwarf-4_-Wall/constbranchindex/crypto_hash/sha512/rust_sha2/work/target/release/deps" "-L" ".../supercop-data/panther/amd64/lib" "-L" ".../supercop-data/panther/amd64/try/c/gcc_-march=native_-mtune=native_-Os_-fwrapv_-fPIC_-fPIE_-gdwarf-4_-Wall/constbranchindex/crypto_hash/sha512/rust_sha2/work/target/release/build/crypto_hash_sha512-8610fd54643f5720/out" "-L" "/usr/lib/rustlib/x86_64-unknown-linux-gnu/lib" "-ltry-anything" "-ltry-small" "-lsupercop" "-lkernelrandombytes" "-lcpucycles" "-lcrypto" "-lntl" "-lnsl" "-lm" "-Wl,-Bstatic" ".../supercop-data/panther/amd64/try/c/gcc_-march=native_-mtune=native_-Os_-fwrapv_-fPIC_-fPIE_-gdwarf-4_-Wall/constbranchindex/crypto_hash/sha512/rust_sha2/work/target/release/deps/libcrypto_hash_sha512-e4fe8efba091fb47.rlib" ".../supercop-data/panther/amd64/try/c/gcc_-march=native_-mtune=native_-Os_-fwrapv_-fPIC_-fPIE_-gdwarf-4_-Wall/constbranchindex/crypto_hash/sha512/rust_sha2/work/target/release/deps/libsha2-fee2faec0cc98b9d.rlib" ".../supercop-data/panther/amd64/try/c/gcc_-march=native_-mtune=native_-Os_-fwrapv_-fPIC_-fPIE_-gdwarf-4_-Wall/constbranchindex/crypto_hash/sha512/rust_sha2/work/target/release/deps/libcpuid_bool-a511188b3e8fb9e7.rlib" ".../supercop-data/panther/amd64/try/c/gcc_-march=native_-mtune=native_-Os_-fwrapv_-fPIC_-fPIE_-gdwarf-4_-Wall/constbranchindex/crypto_hash/sha512/rust_sha2/work/target/release/deps/libcfg_if-11669ae4b1851f60.rlib" ".../supercop-data/panther/amd64/try/c/gcc_-march=native_-mtune=native_-Os_-fwrapv_-fPIC_-fPIE_-gdwarf-4_-Wall/constbranchindex/crypto_hash/sha512/rust_sha2/work/target/release/deps/libopaque_debug-ff52af415c56e1a8.rlib" ".../supercop-data/panther/amd64/try/c/gcc_-march=native_-mtune=native_-Os_-fwrapv_-fPIC_-fPIE_-gdwarf-4_-Wall/constbranchindex/crypto_hash/sha512/rust_sha2/work/target/release/deps/libdigest-137540d47480a0cd.rlib" ".../supercop-data/panther/amd64/try/c/gcc_-march=native_-mtune=native_-Os_-fwrapv_-fPIC_-fPIE_-gdwarf-4_-Wall/constbranchindex/crypto_hash/sha512/rust_sha2/work/target/release/deps/libblock_buffer-d8051f65e68b5aa7.rlib" ".../supercop-data/panther/amd64/try/c/gcc_-march=native_-mtune=native_-Os_-fwrapv_-fPIC_-fPIE_-gdwarf-4_-Wall/constbranchindex/crypto_hash/sha512/rust_sha2/work/target/release/deps/libgeneric_array-6bd8cd5d26e69f54.rlib" ".../supercop-data/panther/amd64/try/c/gcc_-march=native_-mtune=native_-Os_-fwrapv_-fPIC_-fPIE_-gdwarf-4_-Wall/constbranchindex/crypto_hash/sha512/rust_sha2/work/target/release/deps/libtypenum-ac0d7f64b1a84d19.rlib" "-Wl,--start-group" "/usr/lib/rustlib/x86_64-unknown-linux-gnu/lib/libstd-6bf3f16f340782ca.rlib" "/usr/lib/rustlib/x86_64-unknown-linux-gnu/lib/libpanic_unwind-13f3099d50c21bc6.rlib" "/usr/lib/rustlib/x86_64-unknown-linux-gnu/lib/libminiz_oxide-a2ba33c985785afe.rlib" "/usr/lib/rustlib/x86_64-unknown-linux-gnu/lib/libadler-3f6e9f8f4afbea6d.rlib" "/usr/lib/rustlib/x86_64-unknown-linux-gnu/lib/libobject-af517d7f13e7c960.rlib" "/usr/lib/rustlib/x86_64-unknown-linux-gnu/lib/libaddr2line-12740563628e601f.rlib" "/usr/lib/rustlib/x86_64-unknown-linux-gnu/lib/libgimli-0ac82a1e1820dd21.rlib" "/usr/lib/rustlib/x86_64-unknown-linux-gnu/lib/librustc_demangle-3ac2d0878c297d42.rlib" "/usr/lib/rustlib/x86_64-unknown-linux-gnu/lib/libhashbrown-c6632ca171f954dd.rlib" "/usr/lib/rustlib/x86_64-unknown-linux-gnu/lib/librustc_std_workspace_alloc-b5bfd0198c7b740d.rlib" "/usr/lib/rustlib/x86_64-unknown-linux-gnu/lib/libunwind-bd645b20c6c7b56d.rlib" "/usr/lib/rustlib/x86_64-unknown-linux-gnu/lib/libcfg_if-b9e1e523c0c29a77.rlib" "/usr/lib/rustlib/x86_64-unknown-linux-gnu/lib/liblibc-dfbef8c525de0186.rlib" "/usr/lib/rustlib/x86_64-unknown-linux-gnu/lib/liballoc-1ebf406bd4ea5769.rlib" "/usr/lib/rustlib/x86_64-unknown-linux-gnu/lib/librustc_std_workspace_core-5e0675f526ef5c6b.rlib" "/usr/lib/rustlib/x86_64-unknown-linux-gnu/lib/libcore-3375e4f89d420e7a.rlib" "-Wl,--end-group" "/usr/lib/rustlib/x86_64-unknown-linux-gnu/lib/libcompiler_builtins-f74b197469e67088.rlib" "-Wl,-Bdynamic" "-lgcc_s" "-lc" "-lm" "-lrt" "-lpthread" "-lutil" "-ldl" "-lutil"
try.c:   = note: /usr/bin/ld: cannot find -lcpucycles
try.c:           collect2: error: ld returned 1 exit status
try.c:
try.c:
try.c: error: aborting due to previous error
try.c:
try.c: error: could not compile `crypto_hash_sha512`.
try.c:
try.c: To learn more, run the command again with --verbose.

Number of similar (implementation,compiler) pairs: 1, namely:
ImplementationCompiler
rust_sha2gcc -march=native -mtune=native -Os -fwrapv -fPIC -fPIE -gdwarf-4 -Wall (10.2.1_20210110)

TIMECOP error (can be valgrind bug)


Process terminating with default action of signal 4 (SIGILL)
 Illegal opcode at address 0x402030
   at 0x...: st32 (try-anything.c:47)
   by 0x...: core (try-anything.c:78)
   by 0x...: salsa20 (try-anything.c:101)
   by 0x...: testvector (try-anything.c:124)
   by 0x...: myrandom (try-anything.c:132)
   by 0x...: test (try.c:85)
   by 0x...: main (try-anything.c:345)

Number of similar (implementation,compiler) pairs: 5, namely:
ImplementationCompiler
blocksplusavxclang -march=native -O2 -fwrapv -Qunused-arguments -fPIC -fPIE -gdwarf-4 -Wall (Debian_Clang_11.0.1)
compactclang -march=native -O2 -fwrapv -Qunused-arguments -fPIC -fPIE -gdwarf-4 -Wall (Debian_Clang_11.0.1)
refclang -march=native -O2 -fwrapv -Qunused-arguments -fPIC -fPIE -gdwarf-4 -Wall (Debian_Clang_11.0.1)
sphlibclang -march=native -O2 -fwrapv -Qunused-arguments -fPIC -fPIE -gdwarf-4 -Wall (Debian_Clang_11.0.1)
sphlib-smallclang -march=native -O2 -fwrapv -Qunused-arguments -fPIC -fPIE -gdwarf-4 -Wall (Debian_Clang_11.0.1)

TIMECOP error (can be valgrind bug)


Process terminating with default action of signal 4 (SIGILL)
 Illegal opcode at address 0x403152
   at 0x...: crypto_hashblocks_sha512_avx_constbranchindex_inner (inner.c:145)
   by 0x...: crypto_hashblocks_sha512_avx_constbranchindex (constants.c:97)
   by 0x...: crypto_hash_sha512_blocksplusavx_constbranchindex (hash.c:39)
   by 0x...: test (try.c:90)
   by 0x...: main (try-anything.c:345)

Number of similar (implementation,compiler) pairs: 1, namely:
ImplementationCompiler
blocksplusavxclang -march=native -O3 -fwrapv -Qunused-arguments -fPIC -fPIE -gdwarf-4 -Wall (Debian_Clang_11.0.1)

TIMECOP error (can be valgrind bug)


Process terminating with default action of signal 4 (SIGILL)
 Illegal opcode at address 0x402812
   at 0x...: crypto_hashblocks_sha512_avx_constbranchindex_inner (inner.c:145)
   by 0x...: crypto_hashblocks_sha512_avx_constbranchindex (constants.c:97)
   by 0x...: crypto_hash_sha512_blocksplusavx_constbranchindex (hash.c:39)
   by 0x...: test (try.c:90)
   by 0x...: main (try-anything.c:345)

Number of similar (implementation,compiler) pairs: 1, namely:
ImplementationCompiler
blocksplusavxclang -march=native -O -fwrapv -Qunused-arguments -fPIC -fPIE -gdwarf-4 -Wall (Debian_Clang_11.0.1)

TIMECOP error (can be valgrind bug)


Process terminating with default action of signal 4 (SIGILL)
 Illegal opcode at address 0x401A7A
   at 0x...: core (try-anything.c:73)
   by 0x...: salsa20 (try-anything.c:101)
   by 0x...: testvector (try-anything.c:124)
   by 0x...: myrandom (try-anything.c:132)
   by 0x...: test (try.c:85)
   by 0x...: main (try-anything.c:345)

Number of similar (implementation,compiler) pairs: 5, namely:
ImplementationCompiler
blocksplusavxclang -march=native -Os -fwrapv -Qunused-arguments -fPIC -fPIE -gdwarf-4 -Wall (Debian_Clang_11.0.1)
compactclang -march=native -Os -fwrapv -Qunused-arguments -fPIC -fPIE -gdwarf-4 -Wall (Debian_Clang_11.0.1)
refclang -march=native -Os -fwrapv -Qunused-arguments -fPIC -fPIE -gdwarf-4 -Wall (Debian_Clang_11.0.1)
sphlibclang -march=native -Os -fwrapv -Qunused-arguments -fPIC -fPIE -gdwarf-4 -Wall (Debian_Clang_11.0.1)
sphlib-smallclang -march=native -Os -fwrapv -Qunused-arguments -fPIC -fPIE -gdwarf-4 -Wall (Debian_Clang_11.0.1)

TIMECOP error (can be valgrind bug)


Process terminating with default action of signal 4 (SIGILL)
 Illegal opcode at address 0x109CA9
   at 0x...: salsa20.part.0 (try-anything.c:102)
   by 0x...: salsa20 (try-anything.c:85)
   by 0x...: canary (try-anything.c:148)
   by 0x...: input_prepare (try-anything.c:163)
   by 0x...: test (try.c:88)
   by 0x...: main (try-anything.c:345)

Number of similar (implementation,compiler) pairs: 5, namely:
ImplementationCompiler
blocksplusavxgcc -march=native -mtune=native -O2 -fwrapv -fPIC -fPIE -gdwarf-4 -Wall (10.2.1_20210110)
compactgcc -march=native -mtune=native -O2 -fwrapv -fPIC -fPIE -gdwarf-4 -Wall (10.2.1_20210110)
refgcc -march=native -mtune=native -O2 -fwrapv -fPIC -fPIE -gdwarf-4 -Wall (10.2.1_20210110)
sphlibgcc -march=native -mtune=native -O2 -fwrapv -fPIC -fPIE -gdwarf-4 -Wall (10.2.1_20210110)
sphlib-smallgcc -march=native -mtune=native -O2 -fwrapv -fPIC -fPIE -gdwarf-4 -Wall (10.2.1_20210110)

TIMECOP error (can be valgrind bug)


Process terminating with default action of signal 4 (SIGILL)
 Illegal opcode at address 0x109B6A
   at 0x...: st32 (try-anything.c:47)
   by 0x...: core (try-anything.c:78)
   by 0x...: salsa20 (try-anything.c:101)
   by 0x...: salsa20 (try-anything.c:81)
   by 0x...: testvector (try-anything.c:124)
   by 0x...: myrandom (try-anything.c:132)
   by 0x...: test (try.c:85)
   by 0x...: main (try-anything.c:345)

Number of similar (implementation,compiler) pairs: 5, namely:
ImplementationCompiler
blocksplusavxgcc -march=native -mtune=native -O3 -fwrapv -fPIC -fPIE -gdwarf-4 -Wall (10.2.1_20210110)
compactgcc -march=native -mtune=native -O3 -fwrapv -fPIC -fPIE -gdwarf-4 -Wall (10.2.1_20210110)
refgcc -march=native -mtune=native -O3 -fwrapv -fPIC -fPIE -gdwarf-4 -Wall (10.2.1_20210110)
sphlibgcc -march=native -mtune=native -O3 -fwrapv -fPIC -fPIE -gdwarf-4 -Wall (10.2.1_20210110)
sphlib-smallgcc -march=native -mtune=native -O3 -fwrapv -fPIC -fPIE -gdwarf-4 -Wall (10.2.1_20210110)

TIMECOP error (can be valgrind bug)


Process terminating with default action of signal 4 (SIGILL)
 Illegal opcode at address 0x10A862
   at 0x...: crypto_hashblocks_sha512_avx_constbranchindex_inner (inner.c:145)
   by 0x...: crypto_hashblocks_sha512_avx_constbranchindex (constants.c:97)
   by 0x...: crypto_hash_sha512_blocksplusavx_constbranchindex (hash.c:39)
   by 0x...: test (try.c:90)
   by 0x...: main (try-anything.c:345)

Number of similar (implementation,compiler) pairs: 1, namely:
ImplementationCompiler
blocksplusavxgcc -march=native -mtune=native -O -fwrapv -fPIC -fPIE -gdwarf-4 -Wall (10.2.1_20210110)

TIMECOP error (can be valgrind bug)


Process terminating with default action of signal 4 (SIGILL)
 Illegal opcode at address 0x10A572
   at 0x...: crypto_hashblocks_sha512_avx_constbranchindex_inner (inner.c:145)
   by 0x...: crypto_hashblocks_sha512_avx_constbranchindex (constants.c:97)
   by 0x...: crypto_hash_sha512_blocksplusavx_constbranchindex (hash.c:39)
   by 0x...: test (try.c:90)
   by 0x...: main (try-anything.c:345)

Number of similar (implementation,compiler) pairs: 1, namely:
ImplementationCompiler
blocksplusavxgcc -march=native -mtune=native -Os -fwrapv -fPIC -fPIE -gdwarf-4 -Wall (10.2.1_20210110)

TIMECOP error (can be valgrind bug)


Process terminating with default action of signal 4 (SIGILL)
 Illegal opcode at address 0x402BC9
   at 0x...: blocks (hash.c:0)
   by 0x...: crypto_hash_sha512_compact_constbranchindex (hash.c:52)
   by 0x...: test (try.c:90)
   by 0x...: main (try-anything.c:345)

Number of similar (implementation,compiler) pairs: 1, namely:
ImplementationCompiler
compactclang -march=native -O3 -fwrapv -Qunused-arguments -fPIC -fPIE -gdwarf-4 -Wall (Debian_Clang_11.0.1)

TIMECOP error (can be valgrind bug)


Process terminating with default action of signal 4 (SIGILL)
 Illegal opcode at address 0x401565
   at 0x...: test (try.c:107)
   by 0x...: main (try-anything.c:345)

Number of similar (implementation,compiler) pairs: 3, namely:
ImplementationCompiler
compactclang -march=native -O -fwrapv -Qunused-arguments -fPIC -fPIE -gdwarf-4 -Wall (Debian_Clang_11.0.1)
sphlibclang -march=native -O -fwrapv -Qunused-arguments -fPIC -fPIE -gdwarf-4 -Wall (Debian_Clang_11.0.1)
sphlib-smallclang -march=native -O -fwrapv -Qunused-arguments -fPIC -fPIE -gdwarf-4 -Wall (Debian_Clang_11.0.1)

TIMECOP error (can be valgrind bug)


Process terminating with default action of signal 4 (SIGILL)
 Illegal opcode at address 0x422010
   at 0x...: st32 (try-anything.cpp:47)
   by 0x...: core(unsigned char*, unsigned char const*, unsigned char const*) (try-anything.cpp:78)
   by 0x...: salsa20 (try-anything.cpp:101)
   by 0x...: testvector (try-anything.cpp:124)
   by 0x...: myrandom() (try-anything.cpp:132)
   by 0x...: test() (try.cpp:85)
   by 0x...: main (try-anything.cpp:345)

Number of similar (implementation,compiler) pairs: 1, namely:
ImplementationCompiler
cryptoppclang++ -march=native -O2 -fwrapv -Qunused-arguments -fPIC -fPIE -gdwarf-4 -Wall (Debian_Clang_11.0.1)

TIMECOP error (can be valgrind bug)


Process terminating with default action of signal 4 (SIGILL)
 Illegal opcode at address 0x4D82B0
   at 0x...: __bswap_64 (byteswap.h:73)
   by 0x...: ByteReverse (misc.h:2287)
   by 0x...: ByteReverse<long unsigned int> (misc.h:2467)
   by 0x...: CryptoPP::IteratedHashBase<unsigned long, CryptoPP::HashTransformation>::HashMultipleBlocks(unsigned long const*, unsigned long) (iterhash.cpp:123)
   by 0x...: HashBlock (iterhash.h:109)
   by 0x...: CryptoPP::IteratedHashBase<unsigned long, CryptoPP::HashTransformation>::Update(unsigned char const*, unsigned long) (iterhash.cpp:74)
   by 0x...: CalculateDigest (include/cryptopp/cryptlib.h:1194)
   by 0x...: crypto_hash_sha512_cryptopp_constbranchindex (hash.cpp:7)
   by 0x...: test() (try.cpp:90)
   by 0x...: main (try-anything.cpp:345)

Number of similar (implementation,compiler) pairs: 1, namely:
ImplementationCompiler
cryptoppclang++ -march=native -O3 -fwrapv -Qunused-arguments -fPIC -fPIE -gdwarf-4 -Wall (Debian_Clang_11.0.1)

TIMECOP error (can be valgrind bug)


Process terminating with default action of signal 4 (SIGILL)
 Illegal opcode at address 0x4D80E0
   at 0x...: __bswap_64 (byteswap.h:73)
   by 0x...: ByteReverse (misc.h:2287)
   by 0x...: ByteReverse<long unsigned int> (misc.h:2467)
   by 0x...: CryptoPP::IteratedHashBase<unsigned long, CryptoPP::HashTransformation>::HashMultipleBlocks(unsigned long const*, unsigned long) (iterhash.cpp:123)
   by 0x...: HashBlock (iterhash.h:109)
   by 0x...: CryptoPP::IteratedHashBase<unsigned long, CryptoPP::HashTransformation>::Update(unsigned char const*, unsigned long) (iterhash.cpp:74)
   by 0x...: CryptoPP::HashTransformation::CalculateDigest(unsigned char*, unsigned char const*, unsigned long) (include/cryptopp/cryptlib.h:1194)
   by 0x...: crypto_hash_sha512_cryptopp_constbranchindex (hash.cpp:7)
   by 0x...: test() (try.cpp:90)
   by 0x...: main (try-anything.cpp:345)

Number of similar (implementation,compiler) pairs: 1, namely:
ImplementationCompiler
cryptoppclang++ -march=native -O -fwrapv -Qunused-arguments -fPIC -fPIE -gdwarf-4 -Wall (Debian_Clang_11.0.1)

TIMECOP error (can be valgrind bug)


Process terminating with default action of signal 4 (SIGILL)
 Illegal opcode at address 0x421A5A
   at 0x...: core(unsigned char*, unsigned char const*, unsigned char const*) (try-anything.cpp:73)
   by 0x...: salsa20 (try-anything.cpp:101)
   by 0x...: testvector (try-anything.cpp:124)
   by 0x...: myrandom() (try-anything.cpp:132)
   by 0x...: test() (try.cpp:85)
   by 0x...: main (try-anything.cpp:345)

Number of similar (implementation,compiler) pairs: 1, namely:
ImplementationCompiler
cryptoppclang++ -march=native -Os -fwrapv -Qunused-arguments -fPIC -fPIE -gdwarf-4 -Wall (Debian_Clang_11.0.1)

TIMECOP error (can be valgrind bug)


Process terminating with default action of signal 4 (SIGILL)
 Illegal opcode at address 0x171D79
   at 0x...: salsa20(unsigned char*, unsigned long, unsigned char const*, unsigned char const*) [clone .part.0] (try-anything.cpp:102)
   by 0x...: salsa20 (try-anything.cpp:85)
   by 0x...: canary (try-anything.cpp:148)
   by 0x...: input_prepare(unsigned char*, unsigned char*, unsigned long long) (try-anything.cpp:163)
   by 0x...: test() (try.cpp:88)
   by 0x...: main (try-anything.cpp:345)

Number of similar (implementation,compiler) pairs: 1, namely:
ImplementationCompiler
cryptoppg++ -march=native -mtune=native -O2 -fwrapv -fPIC -fPIE -gdwarf-4 -Wall (10.2.1_20210110)

TIMECOP error (can be valgrind bug)


Process terminating with default action of signal 4 (SIGILL)
 Illegal opcode at address 0x170C8A
   at 0x...: st32 (try-anything.cpp:47)
   by 0x...: core(unsigned char*, unsigned char const*, unsigned char const*) (try-anything.cpp:78)
   by 0x...: salsa20 (try-anything.cpp:101)
   by 0x...: salsa20 (try-anything.cpp:81)
   by 0x...: testvector (try-anything.cpp:124)
   by 0x...: myrandom() (try-anything.cpp:132)
   by 0x...: test() (try.cpp:85)
   by 0x...: main (try-anything.cpp:345)

Number of similar (implementation,compiler) pairs: 1, namely:
ImplementationCompiler
cryptoppg++ -march=native -mtune=native -O3 -fwrapv -fPIC -fPIE -gdwarf-4 -Wall (10.2.1_20210110)

TIMECOP error (can be valgrind bug)


Process terminating with default action of signal 4 (SIGILL)
 Illegal opcode at address 0x227630
   at 0x...: __bswap_64 (byteswap.h:73)
   by 0x...: ByteReverse (misc.h:2287)
   by 0x...: ByteReverse<long unsigned int> (misc.h:2467)
   by 0x...: CryptoPP::IteratedHashBase<unsigned long, CryptoPP::HashTransformation>::HashMultipleBlocks(unsigned long const*, unsigned long) (iterhash.cpp:123)
   by 0x...: HashBlock (iterhash.h:109)
   by 0x...: CryptoPP::IteratedHashBase<unsigned long, CryptoPP::HashTransformation>::Update(unsigned char const*, unsigned long) (iterhash.cpp:74)
   by 0x...: CalculateDigest (cryptlib.h:1194)
   by 0x...: crypto_hash_sha512_cryptopp_constbranchindex (hash.cpp:7)
   by 0x...: test() (try.cpp:90)
   by 0x...: main (try-anything.cpp:345)

Number of similar (implementation,compiler) pairs: 1, namely:
ImplementationCompiler
cryptoppg++ -march=native -mtune=native -O -fwrapv -fPIC -fPIE -gdwarf-4 -Wall (10.2.1_20210110)

TIMECOP error (can be valgrind bug)


Process terminating with default action of signal 4 (SIGILL)
 Illegal opcode at address 0x226F50
   at 0x...: __bswap_64 (byteswap.h:73)
   by 0x...: ByteReverse (misc.h:2287)
   by 0x...: ByteReverse<long unsigned int> (misc.h:2467)
   by 0x...: CryptoPP::IteratedHashBase<unsigned long, CryptoPP::HashTransformation>::HashMultipleBlocks(unsigned long const*, unsigned long) (iterhash.cpp:123)
   by 0x...: HashBlock (iterhash.h:109)
   by 0x...: CryptoPP::IteratedHashBase<unsigned long, CryptoPP::HashTransformation>::Update(unsigned char const*, unsigned long) (iterhash.cpp:74)
   by 0x...: CryptoPP::HashTransformation::CalculateDigest(unsigned char*, unsigned char const*, unsigned long) (cryptlib.h:1194)
   by 0x...: crypto_hash_sha512_cryptopp_constbranchindex (hash.cpp:7)
   by 0x...: test() (try.cpp:90)
   by 0x...: main (try-anything.cpp:345)

Number of similar (implementation,compiler) pairs: 1, namely:
ImplementationCompiler
cryptoppg++ -march=native -mtune=native -Os -fwrapv -fPIC -fPIE -gdwarf-4 -Wall (10.2.1_20210110)

TIMECOP error (can be valgrind bug)


Process terminating with default action of signal 4 (SIGILL)
 Illegal opcode at address 0x402040
   at 0x...: st32 (try-anything.c:47)
   by 0x...: core (try-anything.c:78)
   by 0x...: salsa20 (try-anything.c:101)
   by 0x...: testvector (try-anything.c:124)
   by 0x...: myrandom (try-anything.c:132)
   by 0x...: test (try.c:85)
   by 0x...: main (try-anything.c:345)

Number of similar (implementation,compiler) pairs: 1, namely:
ImplementationCompiler
opensslclang -march=native -O2 -fwrapv -Qunused-arguments -fPIC -fPIE -gdwarf-4 -Wall (Debian_Clang_11.0.1)

TIMECOP error (can be valgrind bug)


Process terminating with default action of signal 4 (SIGILL)
 Illegal opcode at address 0x40156E
   at 0x...: test (try.c:107)
   by 0x...: main (try-anything.c:345)

Number of similar (implementation,compiler) pairs: 1, namely:
ImplementationCompiler
opensslclang -march=native -O3 -fwrapv -Qunused-arguments -fPIC -fPIE -gdwarf-4 -Wall (Debian_Clang_11.0.1)

TIMECOP error (can be valgrind bug)


Process terminating with default action of signal 4 (SIGILL)
 Illegal opcode at address 0x401575
   at 0x...: test (try.c:107)
   by 0x...: main (try-anything.c:345)

Number of similar (implementation,compiler) pairs: 1, namely:
ImplementationCompiler
opensslclang -march=native -O -fwrapv -Qunused-arguments -fPIC -fPIE -gdwarf-4 -Wall (Debian_Clang_11.0.1)

TIMECOP error (can be valgrind bug)


Process terminating with default action of signal 4 (SIGILL)
 Illegal opcode at address 0x401A8A
   at 0x...: core (try-anything.c:73)
   by 0x...: salsa20 (try-anything.c:101)
   by 0x...: testvector (try-anything.c:124)
   by 0x...: myrandom (try-anything.c:132)
   by 0x...: test (try.c:85)
   by 0x...: main (try-anything.c:345)

Number of similar (implementation,compiler) pairs: 1, namely:
ImplementationCompiler
opensslclang -march=native -Os -fwrapv -Qunused-arguments -fPIC -fPIE -gdwarf-4 -Wall (Debian_Clang_11.0.1)

TIMECOP error (can be valgrind bug)


Process terminating with default action of signal 4 (SIGILL)
 Illegal opcode at address 0x109CB9
   at 0x...: salsa20.part.0 (try-anything.c:102)
   by 0x...: salsa20 (try-anything.c:85)
   by 0x...: canary (try-anything.c:148)
   by 0x...: input_prepare (try-anything.c:163)
   by 0x...: test (try.c:88)
   by 0x...: main (try-anything.c:345)

Number of similar (implementation,compiler) pairs: 1, namely:
ImplementationCompiler
opensslgcc -march=native -mtune=native -O2 -fwrapv -fPIC -fPIE -gdwarf-4 -Wall (10.2.1_20210110)

TIMECOP error (can be valgrind bug)


Process terminating with default action of signal 4 (SIGILL)
 Illegal opcode at address 0x109B7A
   at 0x...: st32 (try-anything.c:47)
   by 0x...: core (try-anything.c:78)
   by 0x...: salsa20 (try-anything.c:101)
   by 0x...: salsa20 (try-anything.c:81)
   by 0x...: testvector (try-anything.c:124)
   by 0x...: myrandom (try-anything.c:132)
   by 0x...: test (try.c:85)
   by 0x...: main (try-anything.c:345)

Number of similar (implementation,compiler) pairs: 1, namely:
ImplementationCompiler
opensslgcc -march=native -mtune=native -O3 -fwrapv -fPIC -fPIE -gdwarf-4 -Wall (10.2.1_20210110)

TIMECOP error (can be valgrind bug)


Process terminating with default action of signal 4 (SIGILL)
 Illegal opcode at address 0x403202
   at 0x...: crypto_hashblocks_sha512_avx_constbranchindex_inner (inner.c:145)
   by 0x...: crypto_hashblocks_sha512_avx_constbranchindex (constants.c:97)
   by 0x...: crypto_hash_sha512_ref_constbranchindex (hash.c:34)
   by 0x...: test (try.c:90)
   by 0x...: main (try-anything.c:345)

Number of similar (implementation,compiler) pairs: 1, namely:
ImplementationCompiler
refclang -march=native -O3 -fwrapv -Qunused-arguments -fPIC -fPIE -gdwarf-4 -Wall (Debian_Clang_11.0.1)

TIMECOP error (can be valgrind bug)


Process terminating with default action of signal 4 (SIGILL)
 Illegal opcode at address 0x4028C2
   at 0x...: crypto_hashblocks_sha512_avx_constbranchindex_inner (inner.c:145)
   by 0x...: crypto_hashblocks_sha512_avx_constbranchindex (constants.c:97)
   by 0x...: crypto_hash_sha512_ref_constbranchindex (hash.c:34)
   by 0x...: test (try.c:90)
   by 0x...: main (try-anything.c:345)

Number of similar (implementation,compiler) pairs: 1, namely:
ImplementationCompiler
refclang -march=native -O -fwrapv -Qunused-arguments -fPIC -fPIE -gdwarf-4 -Wall (Debian_Clang_11.0.1)

TIMECOP error (can be valgrind bug)


Process terminating with default action of signal 4 (SIGILL)
 Illegal opcode at address 0x403042
   at 0x...: crypto_hashblocks_sha512_avx_constbranchindex_inner (inner.c:145)
   by 0x...: crypto_hashblocks_sha512_avx_constbranchindex (constants.c:97)
   by 0x...: crypto_hash_sha512_ref_constbranchindex (hash.c:34)
   by 0x...: test (try.c:90)
   by 0x...: main (try-anything.c:345)

Number of similar (implementation,compiler) pairs: 1, namely:
ImplementationCompiler
refclang -mcpu=native -O3 -fwrapv -Qunused-arguments -fPIC -fPIE -gdwarf-4 -Wall (Debian_Clang_11.0.1)

TIMECOP error (can be valgrind bug)


Process terminating with default action of signal 4 (SIGILL)
 Illegal opcode at address 0x10A8C2
   at 0x...: crypto_hashblocks_sha512_avx_constbranchindex_inner (inner.c:145)
   by 0x...: crypto_hashblocks_sha512_avx_constbranchindex (constants.c:97)
   by 0x...: crypto_hash_sha512_ref_constbranchindex (hash.c:34)
   by 0x...: test (try.c:90)
   by 0x...: main (try-anything.c:345)

Number of similar (implementation,compiler) pairs: 1, namely:
ImplementationCompiler
refgcc -march=native -mtune=native -O -fwrapv -fPIC -fPIE -gdwarf-4 -Wall (10.2.1_20210110)

TIMECOP error (can be valgrind bug)


Process terminating with default action of signal 4 (SIGILL)
 Illegal opcode at address 0x10A612
   at 0x...: crypto_hashblocks_sha512_avx_constbranchindex_inner (inner.c:145)
   by 0x...: crypto_hashblocks_sha512_avx_constbranchindex (constants.c:97)
   by 0x...: crypto_hash_sha512_ref_constbranchindex (hash.c:34)
   by 0x...: test (try.c:90)
   by 0x...: main (try-anything.c:345)

Number of similar (implementation,compiler) pairs: 1, namely:
ImplementationCompiler
refgcc -march=native -mtune=native -Os -fwrapv -fPIC -fPIE -gdwarf-4 -Wall (10.2.1_20210110)

TIMECOP error (can be valgrind bug)


Process terminating with default action of signal 4 (SIGILL)
 Illegal opcode at address 0x40155E
   at 0x...: test (try.c:107)
   by 0x...: main (try-anything.c:345)

Number of similar (implementation,compiler) pairs: 2, namely:
ImplementationCompiler
sphlibclang -march=native -O3 -fwrapv -Qunused-arguments -fPIC -fPIE -gdwarf-4 -Wall (Debian_Clang_11.0.1)
sphlib-smallclang -march=native -O3 -fwrapv -Qunused-arguments -fPIC -fPIE -gdwarf-4 -Wall (Debian_Clang_11.0.1)

Passed TIMECOP


TIMECOP iterations: 10

Number of similar (implementation,compiler) pairs: 12, namely:
ImplementationCompiler
compactclang -mcpu=native -O3 -fwrapv -Qunused-arguments -fPIC -fPIE -gdwarf-4 -Wall (Debian_Clang_11.0.1)
compactgcc -march=native -mtune=native -O -fwrapv -fPIC -fPIE -gdwarf-4 -Wall (10.2.1_20210110)
compactgcc -march=native -mtune=native -Os -fwrapv -fPIC -fPIE -gdwarf-4 -Wall (10.2.1_20210110)
opensslclang -mcpu=native -O3 -fwrapv -Qunused-arguments -fPIC -fPIE -gdwarf-4 -Wall (Debian_Clang_11.0.1)
opensslgcc -march=native -mtune=native -O -fwrapv -fPIC -fPIE -gdwarf-4 -Wall (10.2.1_20210110)
opensslgcc -march=native -mtune=native -Os -fwrapv -fPIC -fPIE -gdwarf-4 -Wall (10.2.1_20210110)
sphlibclang -mcpu=native -O3 -fwrapv -Qunused-arguments -fPIC -fPIE -gdwarf-4 -Wall (Debian_Clang_11.0.1)
sphlibgcc -march=native -mtune=native -O -fwrapv -fPIC -fPIE -gdwarf-4 -Wall (10.2.1_20210110)
sphlibgcc -march=native -mtune=native -Os -fwrapv -fPIC -fPIE -gdwarf-4 -Wall (10.2.1_20210110)
sphlib-smallclang -mcpu=native -O3 -fwrapv -Qunused-arguments -fPIC -fPIE -gdwarf-4 -Wall (Debian_Clang_11.0.1)
sphlib-smallgcc -march=native -mtune=native -O -fwrapv -fPIC -fPIE -gdwarf-4 -Wall (10.2.1_20210110)
sphlib-smallgcc -march=native -mtune=native -Os -fwrapv -fPIC -fPIE -gdwarf-4 -Wall (10.2.1_20210110)