Implementation notes: amd64, panther, crypto_hash/echo256

Computer: panther
Microarchitecture: amd64; Tiger Lake (806c1)
Architecture: amd64
CPU ID: GenuineIntel-000806c1-00-bfebfbff
SUPERCOP version: 20240625
Operation: crypto_hash
Primitive: echo256
TimeObject sizeTest sizeImplementationCompilerBenchmark dateSUPERCOP version
43647869 0 021309 828 920T:ccalik/aesniclang_-march=native_-O2_-fwrapv_-Qunused-arguments_-fPIC_-fPIE_-gdwarf-4_-Wall2024062620240625
43789197 0 022589 828 920T:ccalik/aesniclang_-march=native_-O3_-fwrapv_-Qunused-arguments_-fPIC_-fPIE_-gdwarf-4_-Wall2024062620240625
44875779 0 016107 820 888T:ccalik/aesniclang_-march=native_-Os_-fwrapv_-Qunused-arguments_-fPIC_-fPIE_-gdwarf-4_-Wall2024062620240625
46355951 0 016451 820 888T:ccalik/aesniclang_-march=native_-O_-fwrapv_-Qunused-arguments_-fPIC_-fPIE_-gdwarf-4_-Wall2024062620240625
49398289 0 021408 780 952T:ccalik/aesnigcc_-march=native_-mtune=native_-O3_-fwrapv_-fPIC_-fPIE_-gdwarf-4_-Wall2024062620240625
51016820 0 017808 780 952T:ccalik/aesnigcc_-march=native_-mtune=native_-O2_-fwrapv_-fPIC_-fPIE_-gdwarf-4_-Wall2024062620240625
51216659 0 017272 780 952T:ccalik/aesnigcc_-march=native_-mtune=native_-O_-fwrapv_-fPIC_-fPIE_-gdwarf-4_-Wall2024062620240625
53176121 0 015707 756 920T:ccalik/aesnigcc_-march=native_-mtune=native_-Os_-fwrapv_-fPIC_-fPIE_-gdwarf-4_-Wall2024062620240625
2730314805 0 028245 828 920T:ccalik/bitslicedclang_-march=native_-O2_-fwrapv_-Qunused-arguments_-fPIC_-fPIE_-gdwarf-4_-Wall2024062620240625
2798512666 0 023003 820 888T:ccalik/bitslicedclang_-march=native_-Os_-fwrapv_-Qunused-arguments_-fPIC_-fPIE_-gdwarf-4_-Wall2024062620240625
2850016093 0 029485 828 920T:ccalik/bitslicedclang_-march=native_-O3_-fwrapv_-Qunused-arguments_-fPIC_-fPIE_-gdwarf-4_-Wall2024062620240625
3103513887 0 024387 820 888T:ccalik/bitslicedclang_-march=native_-O_-fwrapv_-Qunused-arguments_-fPIC_-fPIE_-gdwarf-4_-Wall2024062620240625
3389223893 0 037333 828 920T:ccalik/vpermclang_-march=native_-O2_-fwrapv_-Qunused-arguments_-fPIC_-fPIE_-gdwarf-4_-Wall2024062620240625
3407820335 0 030835 820 888T:ccalik/vpermclang_-march=native_-O_-fwrapv_-Qunused-arguments_-fPIC_-fPIE_-gdwarf-4_-Wall2024062620240625
3479726485 0 039877 828 920T:ccalik/vpermclang_-march=native_-O3_-fwrapv_-Qunused-arguments_-fPIC_-fPIE_-gdwarf-4_-Wall2024062620240625
3510222929 0 036048 780 952T:ccalik/vpermgcc_-march=native_-mtune=native_-O3_-fwrapv_-fPIC_-fPIE_-gdwarf-4_-Wall2024062620240625
3515221623 0 031963 820 888T:ccalik/vpermclang_-march=native_-Os_-fwrapv_-Qunused-arguments_-fPIC_-fPIE_-gdwarf-4_-Wall2024062620240625
3527619588 0 030576 780 952T:ccalik/vpermgcc_-march=native_-mtune=native_-O2_-fwrapv_-fPIC_-fPIE_-gdwarf-4_-Wall2024062620240625
3585020413 0 031016 780 952T:ccalik/vpermgcc_-march=native_-mtune=native_-O_-fwrapv_-fPIC_-fPIE_-gdwarf-4_-Wall2024062620240625
3642819913 0 029491 756 920T:ccalik/vpermgcc_-march=native_-mtune=native_-Os_-fwrapv_-fPIC_-fPIE_-gdwarf-4_-Wall2024062620240625
3709114039 0 023619 756 920T:ccalik/bitslicedgcc_-march=native_-mtune=native_-Os_-fwrapv_-fPIC_-fPIE_-gdwarf-4_-Wall2024062620240625
3815414722 0 025336 780 952T:ccalik/bitslicedgcc_-march=native_-mtune=native_-O_-fwrapv_-fPIC_-fPIE_-gdwarf-4_-Wall2024062620240625
3878116401 0 029520 780 952T:ccalik/bitslicedgcc_-march=native_-mtune=native_-O3_-fwrapv_-fPIC_-fPIE_-gdwarf-4_-Wall2024062620240625
3953214892 0 025880 780 952T:ccalik/bitslicedgcc_-march=native_-mtune=native_-O2_-fwrapv_-fPIC_-fPIE_-gdwarf-4_-Wall2024062620240625
4159128643 0 041589 828 888T:sphlibclang_-mcpu=native_-O3_-fwrapv_-Qunused-arguments_-fPIC_-fPIE_-gdwarf-4_-Wall2024062620240625
4216326880 0 036587 756 920T:sphlibgcc_-march=native_-mtune=native_-Os_-fwrapv_-fPIC_-fPIE_-gdwarf-4_-Wall2024062620240625
4240729113 0 042645 828 920T:sphlibclang_-march=native_-O3_-fwrapv_-Qunused-arguments_-fPIC_-fPIE_-gdwarf-4_-Wall2024062620240625
4244931296 0 044504 780 952T:sphlibgcc_-march=native_-mtune=native_-O3_-fwrapv_-fPIC_-fPIE_-gdwarf-4_-Wall2024062620240625
4266328807 0 042325 828 920T:sphlibclang_-march=native_-O2_-fwrapv_-Qunused-arguments_-fPIC_-fPIE_-gdwarf-4_-Wall2024062620240625
4301728695 0 039808 780 952T:sphlibgcc_-march=native_-mtune=native_-O2_-fwrapv_-fPIC_-fPIE_-gdwarf-4_-Wall2024062620240625
4304113608 0 026856 780 952T:sphlib-smallgcc_-march=native_-mtune=native_-O3_-fwrapv_-fPIC_-fPIE_-gdwarf-4_-Wall2024062620240625
4378828048 0 038784 780 952T:sphlibgcc_-march=native_-mtune=native_-O_-fwrapv_-fPIC_-fPIE_-gdwarf-4_-Wall2024062620240625
4383813051 0 026549 828 920T:sphlib-smallclang_-march=native_-O3_-fwrapv_-Qunused-arguments_-fPIC_-fPIE_-gdwarf-4_-Wall2024062620240625
4391312772 0 026261 828 920T:sphlib-smallclang_-march=native_-O2_-fwrapv_-Qunused-arguments_-fPIC_-fPIE_-gdwarf-4_-Wall2024062620240625
4404620308 0 131328 780 984T:generic/opt64gcc_-march=native_-mtune=native_-O2_-fwrapv_-fPIC_-fPIE_-gdwarf-4_-Wall2024062620240625
4416720864 0 130475 756 952T:generic/opt64gcc_-march=native_-mtune=native_-Os_-fwrapv_-fPIC_-fPIE_-gdwarf-4_-Wall2024062620240625
4426413261 0 026245 828 888T:sphlib-smallclang_-mcpu=native_-O3_-fwrapv_-Qunused-arguments_-fPIC_-fPIE_-gdwarf-4_-Wall2024062620240625
4433921692 0 134816 780 984T:generic/opt64gcc_-march=native_-mtune=native_-O3_-fwrapv_-fPIC_-fPIE_-gdwarf-4_-Wall2024062620240625
4535820363 0 131008 780 984T:generic/opt64gcc_-march=native_-mtune=native_-O_-fwrapv_-fPIC_-fPIE_-gdwarf-4_-Wall2024062620240625
4576028337 0 038979 820 888T:sphlibclang_-march=native_-O_-fwrapv_-Qunused-arguments_-fPIC_-fPIE_-gdwarf-4_-Wall2024062620240625
462789344 0 019067 756 920T:sphlib-smallgcc_-march=native_-mtune=native_-Os_-fwrapv_-fPIC_-fPIE_-gdwarf-4_-Wall2024062620240625
4793027288 0 037683 820 888T:sphlibclang_-march=native_-Os_-fwrapv_-Qunused-arguments_-fPIC_-fPIE_-gdwarf-4_-Wall2024062620240625
4809410879 0 022008 780 952T:sphlib-smallgcc_-march=native_-mtune=native_-O2_-fwrapv_-fPIC_-fPIE_-gdwarf-4_-Wall2024062620240625
492569673 0 020347 820 888T:sphlib-smallclang_-march=native_-O_-fwrapv_-Qunused-arguments_-fPIC_-fPIE_-gdwarf-4_-Wall2024062620240625
5029422029 0 132227 820 888T:generic/opt64clang_-march=native_-Os_-fwrapv_-Qunused-arguments_-fPIC_-fPIE_-gdwarf-4_-Wall2024062620240625
5043617737 0 1627355 756 952T:generic/opt32gcc_-march=native_-mtune=native_-Os_-fwrapv_-fPIC_-fPIE_-gdwarf-4_-Wall2024062620240625
5075310358 0 021112 780 952T:sphlib-smallgcc_-march=native_-mtune=native_-O_-fwrapv_-fPIC_-fPIE_-gdwarf-4_-Wall2024062620240625
5176319380 0 1630416 780 984T:generic/opt32gcc_-march=native_-mtune=native_-O2_-fwrapv_-fPIC_-fPIE_-gdwarf-4_-Wall2024062620240625
5288422239 0 1635125 828 920T:generic/opt32clang_-mcpu=native_-O3_-fwrapv_-Qunused-arguments_-fPIC_-fPIE_-gdwarf-4_-Wall2024062620240625
5371423480 0 133995 820 888T:generic/opt64clang_-march=native_-O_-fwrapv_-Qunused-arguments_-fPIC_-fPIE_-gdwarf-4_-Wall2024062620240625
5451622161 0 1635653 828 920T:generic/opt32clang_-march=native_-O3_-fwrapv_-Qunused-arguments_-fPIC_-fPIE_-gdwarf-4_-Wall2024062620240625
545598996 0 019451 820 888T:sphlib-smallclang_-march=native_-Os_-fwrapv_-Qunused-arguments_-fPIC_-fPIE_-gdwarf-4_-Wall2024062620240625
5459722136 0 1635605 828 920T:generic/opt32clang_-march=native_-O2_-fwrapv_-Qunused-arguments_-fPIC_-fPIE_-gdwarf-4_-Wall2024062620240625
5519827040 0 139925 828 888T:generic/opt64clang_-mcpu=native_-O3_-fwrapv_-Qunused-arguments_-fPIC_-fPIE_-gdwarf-4_-Wall2024062620240625
5551224516 0 1637656 780 984T:generic/opt32gcc_-march=native_-mtune=native_-O3_-fwrapv_-fPIC_-fPIE_-gdwarf-4_-Wall2024062620240625
5573718471 0 1629128 780 984T:generic/opt32gcc_-march=native_-mtune=native_-O_-fwrapv_-fPIC_-fPIE_-gdwarf-4_-Wall2024062620240625
5682024564 0 1638037 828 920T:powerpc/pp32cv1clang_-march=native_-O2_-fwrapv_-Qunused-arguments_-fPIC_-fPIE_-gdwarf-4_-Wall2024062620240625
5689624589 0 1638085 828 920T:powerpc/pp32cv1clang_-march=native_-O3_-fwrapv_-Qunused-arguments_-fPIC_-fPIE_-gdwarf-4_-Wall2024062620240625
5875517968 0 1628491 820 920T:generic/opt32clang_-march=native_-O_-fwrapv_-Qunused-arguments_-fPIC_-fPIE_-gdwarf-4_-Wall2024062620240625
6016124736 0 138149 828 920T:generic/opt64clang_-march=native_-O3_-fwrapv_-Qunused-arguments_-fPIC_-fPIE_-gdwarf-4_-Wall2024062620240625
6026424894 0 138373 828 920T:generic/opt64clang_-march=native_-O2_-fwrapv_-Qunused-arguments_-fPIC_-fPIE_-gdwarf-4_-Wall2024062620240625
6079322021 0 1632059 820 920T:powerpc/pp32cv1clang_-march=native_-Os_-fwrapv_-Qunused-arguments_-fPIC_-fPIE_-gdwarf-4_-Wall2024062620240625
6365128639 0 1641525 828 920T:powerpc/pp32cv2clang_-mcpu=native_-O3_-fwrapv_-Qunused-arguments_-fPIC_-fPIE_-gdwarf-4_-Wall2024062620240625
6382128408 0 1641877 828 920T:powerpc/pp32cv2clang_-march=native_-O2_-fwrapv_-Qunused-arguments_-fPIC_-fPIE_-gdwarf-4_-Wall2024062620240625
6400428433 0 1641925 828 920T:powerpc/pp32cv2clang_-march=native_-O3_-fwrapv_-Qunused-arguments_-fPIC_-fPIE_-gdwarf-4_-Wall2024062620240625
6609819938 0 1630011 820 920T:generic/opt32clang_-march=native_-Os_-fwrapv_-Qunused-arguments_-fPIC_-fPIE_-gdwarf-4_-Wall2024062620240625
6849524772 0 1634843 820 920T:powerpc/pp32cv2clang_-march=native_-Os_-fwrapv_-Qunused-arguments_-fPIC_-fPIE_-gdwarf-4_-Wall2024062620240625
7469523968 0 1634491 820 920T:powerpc/pp32cv2clang_-march=native_-O_-fwrapv_-Qunused-arguments_-fPIC_-fPIE_-gdwarf-4_-Wall2024062620240625
7739925733 0 1635355 756 952T:powerpc/pp32cv2gcc_-march=native_-mtune=native_-Os_-fwrapv_-fPIC_-fPIE_-gdwarf-4_-Wall2024062620240625
7820032916 0 1646056 780 984T:powerpc/pp32cv2gcc_-march=native_-mtune=native_-O3_-fwrapv_-fPIC_-fPIE_-gdwarf-4_-Wall2024062620240625
8269428548 0 1639584 780 984T:powerpc/pp32cv2gcc_-march=native_-mtune=native_-O2_-fwrapv_-fPIC_-fPIE_-gdwarf-4_-Wall2024062620240625
8414027590 0 1638248 780 984T:powerpc/pp32cv2gcc_-march=native_-mtune=native_-O_-fwrapv_-fPIC_-fPIE_-gdwarf-4_-Wall2024062620240625
8501621455 0 1634341 828 920T:powerpc/pp32cv1clang_-mcpu=native_-O3_-fwrapv_-Qunused-arguments_-fPIC_-fPIE_-gdwarf-4_-Wall2024062620240625
9452421396 0 1634536 780 984T:powerpc/pp32cv1gcc_-march=native_-mtune=native_-O3_-fwrapv_-fPIC_-fPIE_-gdwarf-4_-Wall2024062620240625
9539117264 0 1627787 820 920T:powerpc/pp32cv1clang_-march=native_-O_-fwrapv_-Qunused-arguments_-fPIC_-fPIE_-gdwarf-4_-Wall2024062620240625
9548618052 0 1629088 780 984T:powerpc/pp32cv1gcc_-march=native_-mtune=native_-O2_-fwrapv_-fPIC_-fPIE_-gdwarf-4_-Wall2024062620240625
10040016556 0 1626187 756 952T:powerpc/pp32cv1gcc_-march=native_-mtune=native_-Os_-fwrapv_-fPIC_-fPIE_-gdwarf-4_-Wall2024062620240625
10135917665 0 1628312 780 984T:powerpc/pp32cv1gcc_-march=native_-mtune=native_-O_-fwrapv_-fPIC_-fPIE_-gdwarf-4_-Wall2024062620240625

Compiler output


echo64.S: echo64.S:1040:2: error: '.att_syntax noprefix' is not supported: registers must have a '%' prefix in .att_syntax
echo64.S:  .att_syntax noprefix
echo64.S:  ^
echo64.S: echo64.S:1053:10: error: unknown token in expression
echo64.S:  movabsq $-9187201950435737472, %rax
echo64.S:          ^
echo64.S: echo64.S:1054:10: error: unknown token in expression
echo64.S:  movabsq $-9187201950435737472, %r11
echo64.S:          ^
echo64.S: echo64.S:1055:10: error: unknown token in expression
echo64.S:  movabsq $7599940337074203, %r10
echo64.S:          ^
echo64.S: echo64.S:1056:7: error: unknown token in expression
echo64.S:  movq %rax, MEM_CST+16(%rip)
echo64.S:       ^
echo64.S: echo64.S:1057:10: error: unknown token in expression
echo64.S:  movabsq $7599940337074203, %r9
echo64.S:          ^
echo64.S: echo64.S:1058:10: error: unknown token in expression
echo64.S:  movabsq $-72340172838076674, %rax
echo64.S:          ^
echo64.S: echo64.S:1059:10: error: unknown token in expression
echo64.S:  movabsq $72340172838076673, %r8
echo64.S:          ^
echo64.S: echo64.S:1060:10: error: unknown token in expression
echo64.S: ...

Number of similar (implementation,compiler) pairs: 5, namely:
ImplementationCompiler
T:aes/aes64clang -march=native -O2 -fwrapv -Qunused-arguments -fPIC -fPIE -gdwarf-4 -Wall (Debian_Clang_11.0.1)
T:aes/aes64clang -march=native -O3 -fwrapv -Qunused-arguments -fPIC -fPIE -gdwarf-4 -Wall (Debian_Clang_11.0.1)
T:aes/aes64clang -march=native -O -fwrapv -Qunused-arguments -fPIC -fPIE -gdwarf-4 -Wall (Debian_Clang_11.0.1)
T:aes/aes64clang -march=native -Os -fwrapv -Qunused-arguments -fPIC -fPIE -gdwarf-4 -Wall (Debian_Clang_11.0.1)
T:aes/aes64clang -mcpu=native -O3 -fwrapv -Qunused-arguments -fPIC -fPIE -gdwarf-4 -Wall (Debian_Clang_11.0.1)

Compiler output


try.c: /usr/bin/ld: libcrypto_hash_echo256.a(echo64.o): relocation R_X86_64_32S against symbol `OLDCV' can not be used when making a PIE object; recompile with -fPIE
try.c: collect2: error: ld returned 1 exit status

Number of similar (implementation,compiler) pairs: 4, namely:
ImplementationCompiler
T:aes/aes64gcc -march=native -mtune=native -O2 -fwrapv -fPIC -fPIE -gdwarf-4 -Wall (10.2.1_20210110)
T:aes/aes64gcc -march=native -mtune=native -O3 -fwrapv -fPIC -fPIE -gdwarf-4 -Wall (10.2.1_20210110)
T:aes/aes64gcc -march=native -mtune=native -O -fwrapv -fPIC -fPIE -gdwarf-4 -Wall (10.2.1_20210110)
T:aes/aes64gcc -march=native -mtune=native -Os -fwrapv -fPIC -fPIE -gdwarf-4 -Wall (10.2.1_20210110)

Compiler output


echo64.S: echo64.S:224:2: error: invalid instruction mnemonic 'movzbl'
echo64.S:  movzbl ebp, ah
echo64.S:  ^~~~~~
echo64.S: echo64.S:227:2: error: invalid instruction mnemonic 'movzbl'
echo64.S:  movzbl esi, al
echo64.S:  ^~~~~~
echo64.S: echo64.S:239:2: error: invalid instruction mnemonic 'movzbl'
echo64.S:  movzbl ebp, bl
echo64.S:  ^~~~~~
echo64.S: echo64.S:242:2: error: invalid instruction mnemonic 'movzbl'
echo64.S:  movzbl esi, bh
echo64.S:  ^~~~~~
echo64.S: echo64.S:254:2: error: invalid instruction mnemonic 'movzbl'
echo64.S:  movzbl ebp, al
echo64.S:  ^~~~~~
echo64.S: echo64.S:257:2: error: invalid instruction mnemonic 'movzbl'
echo64.S:  movzbl esi, ah
echo64.S:  ^~~~~~
echo64.S: echo64.S:269:2: error: invalid instruction mnemonic 'movzbl'
echo64.S:  movzbl ebp, bh
echo64.S:  ^~~~~~
echo64.S: echo64.S:272:2: error: invalid instruction mnemonic 'movzbl'
echo64.S:  movzbl esi, bl
echo64.S:  ^~~~~~
echo64.S: echo64.S:284:2: error: invalid instruction mnemonic 'movzbl'
echo64.S: ...

Number of similar (implementation,compiler) pairs: 5, namely:
ImplementationCompiler
T:athlon/athlon64clang -march=native -O2 -fwrapv -Qunused-arguments -fPIC -fPIE -gdwarf-4 -Wall (Debian_Clang_11.0.1)
T:athlon/athlon64clang -march=native -O3 -fwrapv -Qunused-arguments -fPIC -fPIE -gdwarf-4 -Wall (Debian_Clang_11.0.1)
T:athlon/athlon64clang -march=native -O -fwrapv -Qunused-arguments -fPIC -fPIE -gdwarf-4 -Wall (Debian_Clang_11.0.1)
T:athlon/athlon64clang -march=native -Os -fwrapv -Qunused-arguments -fPIC -fPIE -gdwarf-4 -Wall (Debian_Clang_11.0.1)
T:athlon/athlon64clang -mcpu=native -O3 -fwrapv -Qunused-arguments -fPIC -fPIE -gdwarf-4 -Wall (Debian_Clang_11.0.1)

Compiler output


echo64.S: echo64.c: Assembler messages:
echo64.S: echo64.c:519: Error: no such instruction: `movzbl ebp,ah'
echo64.S: echo64.c:519: Error: no such instruction: `movzbl esi,al'
echo64.S: echo64.c:519: Error: no such instruction: `movzbl ebp,bl'
echo64.S: echo64.c:519: Error: no such instruction: `movzbl esi,bh'
echo64.S: echo64.c:519: Error: no such instruction: `movzbl ebp,al'
echo64.S: echo64.c:519: Error: no such instruction: `movzbl esi,ah'
echo64.S: echo64.c:519: Error: no such instruction: `movzbl ebp,bh'
echo64.S: echo64.c:519: Error: no such instruction: `movzbl esi,bl'
echo64.S: echo64.c:519: Error: no such instruction: `movzbl ebp,ah'
echo64.S: echo64.c:519: Error: no such instruction: `movzbl esi,al'
echo64.S: echo64.c:519: Error: no such instruction: `movzbl ebp,bl'
echo64.S: echo64.c:519: Error: no such instruction: `movzbl esi,bh'
echo64.S: echo64.c:519: Error: no such instruction: `movzbl ebp,al'
echo64.S: echo64.c:519: Error: no such instruction: `movzbl esi,ah'
echo64.S: echo64.c:519: Error: no such instruction: `movzbl ebp,bl'
echo64.S: echo64.c:519: Error: no such instruction: `movzbl esi,bh'
echo64.S: echo64.c:519: Error: no such instruction: `movzbl ebp,dl'
echo64.S: echo64.c:519: Error: no such instruction: `movzbl esi,dh'
echo64.S: echo64.c:519: Error: no such instruction: `movzbl ebp,ch'
echo64.S: echo64.c:519: Error: no such instruction: `movzbl esi,cl'
echo64.S: echo64.c:519: Error: no such instruction: `movzbl ebp,cl'
echo64.S: echo64.c:519: Error: no such instruction: `movzbl esi,ch'
echo64.S: echo64.c:519: Error: no such instruction: `movzbl ebp,dh'
echo64.S: echo64.c:519: Error: no such instruction: `movzbl esi,dl'
echo64.S: ...

Number of similar (implementation,compiler) pairs: 4, namely:
ImplementationCompiler
T:athlon/athlon64gcc -march=native -mtune=native -O2 -fwrapv -fPIC -fPIE -gdwarf-4 -Wall (10.2.1_20210110)
T:athlon/athlon64gcc -march=native -mtune=native -O3 -fwrapv -fPIC -fPIE -gdwarf-4 -Wall (10.2.1_20210110)
T:athlon/athlon64gcc -march=native -mtune=native -O -fwrapv -fPIC -fPIE -gdwarf-4 -Wall (10.2.1_20210110)
T:athlon/athlon64gcc -march=native -mtune=native -Os -fwrapv -fPIC -fPIE -gdwarf-4 -Wall (10.2.1_20210110)

Compiler output


hash.c: hash.c:250:18: warning: unused variable 't3' [-Wunused-variable]
hash.c:         __m128i t1, t2, t3, t4, s1, s2, s3, k1, ktemp;
hash.c:                         ^
hash.c: hash.c:250:22: warning: unused variable 't4' [-Wunused-variable]
hash.c:         __m128i t1, t2, t3, t4, s1, s2, s3, k1, ktemp;
hash.c:                             ^
hash.c: hash.c:250:26: warning: unused variable 's1' [-Wunused-variable]
hash.c:         __m128i t1, t2, t3, t4, s1, s2, s3, k1, ktemp;
hash.c:                                 ^
hash.c: hash.c:250:34: warning: unused variable 's3' [-Wunused-variable]
hash.c:         __m128i t1, t2, t3, t4, s1, s2, s3, k1, ktemp;
hash.c:                                         ^
hash.c: hash.c:250:42: warning: unused variable 'ktemp' [-Wunused-variable]
hash.c:         __m128i t1, t2, t3, t4, s1, s2, s3, k1, ktemp;
hash.c:                                                 ^
hash.c: 5 warnings generated.

Number of similar (implementation,compiler) pairs: 4, namely:
ImplementationCompiler
T:ccalik/aesniclang -march=native -O2 -fwrapv -Qunused-arguments -fPIC -fPIE -gdwarf-4 -Wall (Debian_Clang_11.0.1)
T:ccalik/aesniclang -march=native -O3 -fwrapv -Qunused-arguments -fPIC -fPIE -gdwarf-4 -Wall (Debian_Clang_11.0.1)
T:ccalik/aesniclang -march=native -O -fwrapv -Qunused-arguments -fPIC -fPIE -gdwarf-4 -Wall (Debian_Clang_11.0.1)
T:ccalik/aesniclang -march=native -Os -fwrapv -Qunused-arguments -fPIC -fPIE -gdwarf-4 -Wall (Debian_Clang_11.0.1)

Compiler output


hash.c: hash.c:250:18: warning: unused variable 't3' [-Wunused-variable]
hash.c:         __m128i t1, t2, t3, t4, s1, s2, s3, k1, ktemp;
hash.c:                         ^
hash.c: hash.c:250:22: warning: unused variable 't4' [-Wunused-variable]
hash.c:         __m128i t1, t2, t3, t4, s1, s2, s3, k1, ktemp;
hash.c:                             ^
hash.c: hash.c:250:26: warning: unused variable 's1' [-Wunused-variable]
hash.c:         __m128i t1, t2, t3, t4, s1, s2, s3, k1, ktemp;
hash.c:                                 ^
hash.c: hash.c:250:34: warning: unused variable 's3' [-Wunused-variable]
hash.c:         __m128i t1, t2, t3, t4, s1, s2, s3, k1, ktemp;
hash.c:                                         ^
hash.c: hash.c:250:42: warning: unused variable 'ktemp' [-Wunused-variable]
hash.c:         __m128i t1, t2, t3, t4, s1, s2, s3, k1, ktemp;
hash.c:                                                 ^
hash.c: hash.c:295:4: error: always_inline function '_mm_aesenc_si128' requires target feature 'aes', but would be inlined into function 'Compress' that is compiled without support for 'aes'
hash.c:                         ECHO_ROUND_UNROLL2;
hash.c:                         ^
hash.c: hash.c:185:4: note: expanded from macro 'ECHO_ROUND_UNROLL2'
hash.c:                         ECHO_SUBBYTES(_state, 0, 0);\
hash.c:                         ^
hash.c: hash.c:114:19: note: expanded from macro 'ECHO_SUBBYTES'
hash.c:                                 state[i][j] = _mm_aesenc_si128(state[i][j], k1);\
hash.c:                                               ^
hash.c: hash.c:295:4: error: always_inline function '_mm_aesenc_si128' requires target feature 'aes', but would be inlined into function 'Compress' that is compiled without support for 'aes'
hash.c: ...

Number of similar (implementation,compiler) pairs: 1, namely:
ImplementationCompiler
T:ccalik/aesniclang -mcpu=native -O3 -fwrapv -Qunused-arguments -fPIC -fPIE -gdwarf-4 -Wall (Debian_Clang_11.0.1)

Compiler output


hash.c: In file included from hash.c:20:
hash.c: vperm.h:57:2: warning: multi-line comment [-Wcomment]
hash.c:    57 |  //t2 = _mm_shuffle_epi8(table[0], x);\
hash.c:       |  ^
hash.c: hash.c: In function 'Compress':
hash.c: hash.c:250:42: warning: unused variable 'ktemp' [-Wunused-variable]
hash.c:   250 |  __m128i t1, t2, t3, t4, s1, s2, s3, k1, ktemp;
hash.c:       |                                          ^~~~~
hash.c: hash.c:250:34: warning: unused variable 's3' [-Wunused-variable]
hash.c:   250 |  __m128i t1, t2, t3, t4, s1, s2, s3, k1, ktemp;
hash.c:       |                                  ^~
hash.c: hash.c:250:26: warning: unused variable 's1' [-Wunused-variable]
hash.c:   250 |  __m128i t1, t2, t3, t4, s1, s2, s3, k1, ktemp;
hash.c:       |                          ^~
hash.c: hash.c:250:22: warning: unused variable 't4' [-Wunused-variable]
hash.c:   250 |  __m128i t1, t2, t3, t4, s1, s2, s3, k1, ktemp;
hash.c:       |                      ^~
hash.c: hash.c:250:18: warning: unused variable 't3' [-Wunused-variable]
hash.c:   250 |  __m128i t1, t2, t3, t4, s1, s2, s3, k1, ktemp;
hash.c:       |                  ^~

Number of similar (implementation,compiler) pairs: 4, namely:
ImplementationCompiler
T:ccalik/aesnigcc -march=native -mtune=native -O2 -fwrapv -fPIC -fPIE -gdwarf-4 -Wall (10.2.1_20210110)
T:ccalik/aesnigcc -march=native -mtune=native -O3 -fwrapv -fPIC -fPIE -gdwarf-4 -Wall (10.2.1_20210110)
T:ccalik/aesnigcc -march=native -mtune=native -O -fwrapv -fPIC -fPIE -gdwarf-4 -Wall (10.2.1_20210110)
T:ccalik/aesnigcc -march=native -mtune=native -Os -fwrapv -fPIC -fPIE -gdwarf-4 -Wall (10.2.1_20210110)

Compiler output


hash.c: hash.c:467:4: error: always_inline function '_mm_shuffle_epi8' requires target feature 'ssse3', but would be inlined into function 'Compress' that is compiled without support for 'ssse3'
hash.c:                         AES_SHIFT_ROWS(_state);
hash.c:                         ^
hash.c: hash.c:140:14: note: expanded from macro 'AES_SHIFT_ROWS'
hash.c:                         s[0][0] = _mm_shuffle_epi8(s[0][0], M128(shiftrowsslice));\
hash.c:                                   ^
hash.c: hash.c:467:4: error: always_inline function '_mm_shuffle_epi8' requires target feature 'ssse3', but would be inlined into function 'Compress' that is compiled without support for 'ssse3'
hash.c: hash.c:141:14: note: expanded from macro 'AES_SHIFT_ROWS'
hash.c:                         s[0][1] = _mm_shuffle_epi8(s[0][1], M128(shiftrowsslice));\
hash.c:                                   ^
hash.c: hash.c:467:4: error: always_inline function '_mm_shuffle_epi8' requires target feature 'ssse3', but would be inlined into function 'Compress' that is compiled without support for 'ssse3'
hash.c: hash.c:142:14: note: expanded from macro 'AES_SHIFT_ROWS'
hash.c:                         s[0][2] = _mm_shuffle_epi8(s[0][2], M128(shiftrowsslice));\
hash.c:                                   ^
hash.c: hash.c:467:4: error: always_inline function '_mm_shuffle_epi8' requires target feature 'ssse3', but would be inlined into function 'Compress' that is compiled without support for 'ssse3'
hash.c: hash.c:143:14: note: expanded from macro 'AES_SHIFT_ROWS'
hash.c:                         s[0][3] = _mm_shuffle_epi8(s[0][3], M128(shiftrowsslice));\
hash.c:                                   ^
hash.c: hash.c:467:4: error: always_inline function '_mm_shuffle_epi8' requires target feature 'ssse3', but would be inlined into function 'Compress' that is compiled without support for 'ssse3'
hash.c: hash.c:144:14: note: expanded from macro 'AES_SHIFT_ROWS'
hash.c:                         s[1][0] = _mm_shuffle_epi8(s[1][0], M128(shiftrowsslice));\
hash.c:                                   ^
hash.c: hash.c:467:4: error: always_inline function '_mm_shuffle_epi8' requires target feature 'ssse3', but would be inlined into function 'Compress' that is compiled without support for 'ssse3'
hash.c: hash.c:145:14: note: expanded from macro 'AES_SHIFT_ROWS'
hash.c:                         s[1][1] = _mm_shuffle_epi8(s[1][1], M128(shiftrowsslice));\
hash.c: ...

Number of similar (implementation,compiler) pairs: 1, namely:
ImplementationCompiler
T:ccalik/bitslicedclang -mcpu=native -O3 -fwrapv -Qunused-arguments -fPIC -fPIE -gdwarf-4 -Wall (Debian_Clang_11.0.1)

Compiler output


hash.c: hash.c:264:4: error: always_inline function '_mm_shuffle_epi8' requires target feature 'ssse3', but would be inlined into function 'Compress' that is compiled without support for 'ssse3'
hash.c:                         TRANSFORM(_state[i][j], _k_ipt, t1, t2);
hash.c:                         ^
hash.c: ./vperm.h:52:7: note: expanded from macro 'TRANSFORM'
hash.c:         t1 = _mm_shuffle_epi8(*((__m128i*)table + 1), t1);\
hash.c:              ^
hash.c: hash.c:264:4: error: always_inline function '_mm_shuffle_epi8' requires target feature 'ssse3', but would be inlined into function 'Compress' that is compiled without support for 'ssse3'
hash.c: ./vperm.h:53:7: note: expanded from macro 'TRANSFORM'
hash.c:         x  = _mm_shuffle_epi8(*((__m128i*)table + 0), x);\
hash.c:              ^
hash.c: hash.c:281:5: error: always_inline function '_mm_shuffle_epi8' requires target feature 'ssse3', but would be inlined into function 'Compress' that is compiled without support for 'ssse3'
hash.c:                                 TRANSFORM(_state[i][j], _k_ipt, t1, t2);
hash.c:                                 ^
hash.c: ./vperm.h:52:7: note: expanded from macro 'TRANSFORM'
hash.c:         t1 = _mm_shuffle_epi8(*((__m128i*)table + 1), t1);\
hash.c:              ^
hash.c: hash.c:281:5: error: always_inline function '_mm_shuffle_epi8' requires target feature 'ssse3', but would be inlined into function 'Compress' that is compiled without support for 'ssse3'
hash.c: ./vperm.h:53:7: note: expanded from macro 'TRANSFORM'
hash.c:         x  = _mm_shuffle_epi8(*((__m128i*)table + 0), x);\
hash.c:              ^
hash.c: hash.c:306:4: error: always_inline function '_mm_shuffle_epi8' requires target feature 'ssse3', but would be inlined into function 'Compress' that is compiled without support for 'ssse3'
hash.c:                         ECHO_SUB_AND_MIX(_state, 0, 0, _state2, 0, 0, 1, 2, 3);
hash.c:                         ^
hash.c: hash.c:125:5: note: expanded from macro 'ECHO_SUB_AND_MIX'
hash.c:                                 AES_ROUND_VPERM_CORE(state[i][j], t1, t2, t3, t4, s1, s2, s3);\
hash.c: ...

Number of similar (implementation,compiler) pairs: 1, namely:
ImplementationCompiler
T:ccalik/vpermclang -mcpu=native -O3 -fwrapv -Qunused-arguments -fPIC -fPIE -gdwarf-4 -Wall (Debian_Clang_11.0.1)

Compiler output


hash.c: In file included from hash.c:20:
hash.c: vperm.h:57:2: warning: multi-line comment [-Wcomment]
hash.c:    57 |  //t2 = _mm_shuffle_epi8(table[0], x);\
hash.c:       |  ^

Number of similar (implementation,compiler) pairs: 4, namely:
ImplementationCompiler
T:ccalik/vpermgcc -march=native -mtune=native -O2 -fwrapv -fPIC -fPIE -gdwarf-4 -Wall (10.2.1_20210110)
T:ccalik/vpermgcc -march=native -mtune=native -O3 -fwrapv -fPIC -fPIE -gdwarf-4 -Wall (10.2.1_20210110)
T:ccalik/vpermgcc -march=native -mtune=native -O -fwrapv -fPIC -fPIE -gdwarf-4 -Wall (10.2.1_20210110)
T:ccalik/vpermgcc -march=native -mtune=native -Os -fwrapv -fPIC -fPIE -gdwarf-4 -Wall (10.2.1_20210110)

Compiler output


echo64.S: echo64.S:212:2: error: invalid instruction mnemonic 'movzbl'
echo64.S:  movzbl ebp, ah
echo64.S:  ^~~~~~
echo64.S: echo64.S:218:2: error: invalid instruction mnemonic 'movzbl'
echo64.S:  movzbl esi, al
echo64.S:  ^~~~~~
echo64.S: echo64.S:227:2: error: invalid instruction mnemonic 'movzbl'
echo64.S:  movzbl ebp, bl
echo64.S:  ^~~~~~
echo64.S: echo64.S:233:2: error: invalid instruction mnemonic 'movzbl'
echo64.S:  movzbl esi, bh
echo64.S:  ^~~~~~
echo64.S: echo64.S:242:2: error: invalid instruction mnemonic 'movzbl'
echo64.S:  movzbl ebp, al
echo64.S:  ^~~~~~
echo64.S: echo64.S:248:2: error: invalid instruction mnemonic 'movzbl'
echo64.S:  movzbl esi, ah
echo64.S:  ^~~~~~
echo64.S: echo64.S:257:2: error: invalid instruction mnemonic 'movzbl'
echo64.S:  movzbl ebp, bh
echo64.S:  ^~~~~~
echo64.S: echo64.S:263:2: error: invalid instruction mnemonic 'movzbl'
echo64.S:  movzbl esi, bl
echo64.S:  ^~~~~~
echo64.S: echo64.S:272:2: error: invalid instruction mnemonic 'movzbl'
echo64.S: ...

Number of similar (implementation,compiler) pairs: 5, namely:
ImplementationCompiler
T:core2/core2v64clang -march=native -O2 -fwrapv -Qunused-arguments -fPIC -fPIE -gdwarf-4 -Wall (Debian_Clang_11.0.1)
T:core2/core2v64clang -march=native -O3 -fwrapv -Qunused-arguments -fPIC -fPIE -gdwarf-4 -Wall (Debian_Clang_11.0.1)
T:core2/core2v64clang -march=native -O -fwrapv -Qunused-arguments -fPIC -fPIE -gdwarf-4 -Wall (Debian_Clang_11.0.1)
T:core2/core2v64clang -march=native -Os -fwrapv -Qunused-arguments -fPIC -fPIE -gdwarf-4 -Wall (Debian_Clang_11.0.1)
T:core2/core2v64clang -mcpu=native -O3 -fwrapv -Qunused-arguments -fPIC -fPIE -gdwarf-4 -Wall (Debian_Clang_11.0.1)

Compiler output


echo64.S: echo64.c: Assembler messages:
echo64.S: echo64.c:473: Error: no such instruction: `movzbl ebp,ah'
echo64.S: echo64.c:473: Error: no such instruction: `movzbl esi,al'
echo64.S: echo64.c:473: Error: no such instruction: `movzbl ebp,bl'
echo64.S: echo64.c:473: Error: no such instruction: `movzbl esi,bh'
echo64.S: echo64.c:473: Error: no such instruction: `movzbl ebp,al'
echo64.S: echo64.c:473: Error: no such instruction: `movzbl esi,ah'
echo64.S: echo64.c:473: Error: no such instruction: `movzbl ebp,bh'
echo64.S: echo64.c:473: Error: no such instruction: `movzbl esi,bl'
echo64.S: echo64.c:473: Error: no such instruction: `movzbl ebp,ah'
echo64.S: echo64.c:473: Error: no such instruction: `movzbl esi,al'
echo64.S: echo64.c:473: Error: no such instruction: `movzbl ebp,bl'
echo64.S: echo64.c:473: Error: no such instruction: `movzbl esi,bh'
echo64.S: echo64.c:473: Error: no such instruction: `movzbl ebp,al'
echo64.S: echo64.c:473: Error: no such instruction: `movzbl esi,ah'
echo64.S: echo64.c:473: Error: no such instruction: `movzbl ebp,bl'
echo64.S: echo64.c:473: Error: no such instruction: `movzbl esi,bh'
echo64.S: echo64.c:473: Error: no such instruction: `movzbl ebp,dl'
echo64.S: echo64.c:473: Error: no such instruction: `movzbl esi,dh'
echo64.S: echo64.c:473: Error: no such instruction: `movzbl ebp,ch'
echo64.S: echo64.c:473: Error: no such instruction: `movzbl esi,cl'
echo64.S: echo64.c:473: Error: no such instruction: `movzbl ebp,cl'
echo64.S: echo64.c:473: Error: no such instruction: `movzbl esi,ch'
echo64.S: echo64.c:473: Error: no such instruction: `movzbl ebp,dh'
echo64.S: echo64.c:473: Error: no such instruction: `movzbl esi,dl'
echo64.S: ...

Number of similar (implementation,compiler) pairs: 4, namely:
ImplementationCompiler
T:core2/core2v64gcc -march=native -mtune=native -O2 -fwrapv -fPIC -fPIE -gdwarf-4 -Wall (10.2.1_20210110)
T:core2/core2v64gcc -march=native -mtune=native -O3 -fwrapv -fPIC -fPIE -gdwarf-4 -Wall (10.2.1_20210110)
T:core2/core2v64gcc -march=native -mtune=native -O -fwrapv -fPIC -fPIE -gdwarf-4 -Wall (10.2.1_20210110)
T:core2/core2v64gcc -march=native -mtune=native -Os -fwrapv -fPIC -fPIE -gdwarf-4 -Wall (10.2.1_20210110)

Compiler output


echo32.c: echo32.c:105:18: warning: unused variable 'j' [-Wunused-variable]
echo32.c:         unsigned int i, j;
echo32.c:                         ^
echo32.c: echo32.c:106:16: warning: unused variable 'endianess' [-Wunused-variable]
echo32.c:         unsigned char endianess;
echo32.c:                       ^
echo32.c: echo32.c:342:15: warning: unused variable 'i' [-Wunused-variable]
echo32.c:         unsigned int i;
echo32.c:                      ^
echo32.c: echo32.c:343:21: warning: unused variable 'c0' [-Wunused-variable]
echo32.c:         unsigned long long c0, c1;
echo32.c:                            ^
echo32.c: echo32.c:343:25: warning: unused variable 'c1' [-Wunused-variable]
echo32.c:         unsigned long long c0, c1;
echo32.c:                                ^
echo32.c: echo32.c:441:21: warning: unused variable 'hashlen' [-Wunused-variable]
echo32.c:         unsigned short int hashlen = 0;
echo32.c:                            ^
echo32.c: echo32.c:442:21: warning: unused variable 'messlen_l' [-Wunused-variable]
echo32.c:         unsigned long long messlen_l = 0;
echo32.c:                            ^
echo32.c: echo32.c:443:21: warning: unused variable 'messlen_h' [-Wunused-variable]
echo32.c:         unsigned long long messlen_h = 0;
echo32.c:                            ^
echo32.c: 8 warnings generated.

Number of similar (implementation,compiler) pairs: 5, namely:
ImplementationCompiler
T:generic/opt32clang -march=native -O2 -fwrapv -Qunused-arguments -fPIC -fPIE -gdwarf-4 -Wall (Debian_Clang_11.0.1)
T:generic/opt32clang -march=native -O3 -fwrapv -Qunused-arguments -fPIC -fPIE -gdwarf-4 -Wall (Debian_Clang_11.0.1)
T:generic/opt32clang -march=native -O -fwrapv -Qunused-arguments -fPIC -fPIE -gdwarf-4 -Wall (Debian_Clang_11.0.1)
T:generic/opt32clang -march=native -Os -fwrapv -Qunused-arguments -fPIC -fPIE -gdwarf-4 -Wall (Debian_Clang_11.0.1)
T:generic/opt32clang -mcpu=native -O3 -fwrapv -Qunused-arguments -fPIC -fPIE -gdwarf-4 -Wall (Debian_Clang_11.0.1)

Compiler output


echo32.c: echo32.c: In function 'Init':
echo32.c: echo32.c:106:16: warning: unused variable 'endianess' [-Wunused-variable]
echo32.c:   106 |  unsigned char endianess;
echo32.c:       |                ^~~~~~~~~
echo32.c: echo32.c:105:18: warning: unused variable 'j' [-Wunused-variable]
echo32.c:   105 |  unsigned int i, j;
echo32.c:       |                  ^
echo32.c: echo32.c: In function 'Compress':
echo32.c: echo32.c:343:25: warning: unused variable 'c1' [-Wunused-variable]
echo32.c:   343 |  unsigned long long c0, c1;
echo32.c:       |                         ^~
echo32.c: echo32.c:343:21: warning: unused variable 'c0' [-Wunused-variable]
echo32.c:   343 |  unsigned long long c0, c1;
echo32.c:       |                     ^~
echo32.c: echo32.c:342:15: warning: unused variable 'i' [-Wunused-variable]
echo32.c:   342 |  unsigned int i;
echo32.c:       |               ^
echo32.c: echo32.c: In function 'Final':
echo32.c: echo32.c:443:21: warning: unused variable 'messlen_h' [-Wunused-variable]
echo32.c:   443 |  unsigned long long messlen_h = 0;
echo32.c:       |                     ^~~~~~~~~
echo32.c: echo32.c:442:21: warning: unused variable 'messlen_l' [-Wunused-variable]
echo32.c:   442 |  unsigned long long messlen_l = 0;
echo32.c:       |                     ^~~~~~~~~
echo32.c: echo32.c:441:21: warning: unused variable 'hashlen' [-Wunused-variable]
echo32.c: ...

Number of similar (implementation,compiler) pairs: 4, namely:
ImplementationCompiler
T:generic/opt32gcc -march=native -mtune=native -O2 -fwrapv -fPIC -fPIE -gdwarf-4 -Wall (10.2.1_20210110)
T:generic/opt32gcc -march=native -mtune=native -O3 -fwrapv -fPIC -fPIE -gdwarf-4 -Wall (10.2.1_20210110)
T:generic/opt32gcc -march=native -mtune=native -O -fwrapv -fPIC -fPIE -gdwarf-4 -Wall (10.2.1_20210110)
T:generic/opt32gcc -march=native -mtune=native -Os -fwrapv -fPIC -fPIE -gdwarf-4 -Wall (10.2.1_20210110)

Compiler output


echo64.c: echo64.c:290:30: warning: unused variable 'WT5' [-Wunused-variable]
echo64.c:     WT0, WT1, WT2, WT3, WT4, WT5;
echo64.c:                              ^
echo64.c: echo64.c:432:16: warning: unused variable 'i' [-Wunused-variable]
echo64.c:   unsigned int i;
echo64.c:                ^
echo64.c: echo64.c:501:29: warning: passing 'const unsigned char *' to parameter of type 'BitSequence *' (aka 'unsigned char *') discards qualifiers [-Wincompatible-pointer-types-discards-qualifiers]
echo64.c:   if (Hash(CRYPTO_BYTES * 8,in,inlen * 8,out) == SUCCESS) return 0;
echo64.c:                             ^~
echo64.c: echo64.c:488:46: note: passing argument to parameter 'data' here
echo64.c: HashReturn Hash(int hashbitlen, BitSequence *data, DataLength databitlen, BitSequence *hashval)
echo64.c:                                              ^
echo64.c: 3 warnings generated.

Number of similar (implementation,compiler) pairs: 5, namely:
ImplementationCompiler
T:generic/opt64clang -march=native -O2 -fwrapv -Qunused-arguments -fPIC -fPIE -gdwarf-4 -Wall (Debian_Clang_11.0.1)
T:generic/opt64clang -march=native -O3 -fwrapv -Qunused-arguments -fPIC -fPIE -gdwarf-4 -Wall (Debian_Clang_11.0.1)
T:generic/opt64clang -march=native -O -fwrapv -Qunused-arguments -fPIC -fPIE -gdwarf-4 -Wall (Debian_Clang_11.0.1)
T:generic/opt64clang -march=native -Os -fwrapv -Qunused-arguments -fPIC -fPIE -gdwarf-4 -Wall (Debian_Clang_11.0.1)
T:generic/opt64clang -mcpu=native -O3 -fwrapv -Qunused-arguments -fPIC -fPIE -gdwarf-4 -Wall (Debian_Clang_11.0.1)

Compiler output


echo64.c: echo64.c: In function 'Compress':
echo64.c: echo64.c:290:30: warning: unused variable 'WT5' [-Wunused-variable]
echo64.c:   290 |     WT0, WT1, WT2, WT3, WT4, WT5;
echo64.c:       |                              ^~~
echo64.c: echo64.c: In function 'Final':
echo64.c: echo64.c:432:16: warning: unused variable 'i' [-Wunused-variable]
echo64.c:   432 |   unsigned int i;
echo64.c:       |                ^
echo64.c: echo64.c: In function 'crypto_hash_echo256_generic_opt64_timingleaks':
echo64.c: echo64.c:501:29: warning: passing argument 2 of 'Hash' discards 'const' qualifier from pointer target type [-Wdiscarded-qualifiers]
echo64.c:   501 |   if (Hash(CRYPTO_BYTES * 8,in,inlen * 8,out) == SUCCESS) return 0;
echo64.c:       |                             ^~
echo64.c: echo64.c:488:46: note: expected 'BitSequence *' {aka 'unsigned char *'} but argument is of type 'const unsigned char *'
echo64.c:   488 | HashReturn Hash(int hashbitlen, BitSequence *data, DataLength databitlen, BitSequence *hashval)
echo64.c:       |                                 ~~~~~~~~~~~~~^~~~

Number of similar (implementation,compiler) pairs: 4, namely:
ImplementationCompiler
T:generic/opt64gcc -march=native -mtune=native -O2 -fwrapv -fPIC -fPIE -gdwarf-4 -Wall (10.2.1_20210110)
T:generic/opt64gcc -march=native -mtune=native -O3 -fwrapv -fPIC -fPIE -gdwarf-4 -Wall (10.2.1_20210110)
T:generic/opt64gcc -march=native -mtune=native -O -fwrapv -fPIC -fPIE -gdwarf-4 -Wall (10.2.1_20210110)
T:generic/opt64gcc -march=native -mtune=native -Os -fwrapv -fPIC -fPIE -gdwarf-4 -Wall (10.2.1_20210110)

Compiler output


echo32.S: echo32.S:311:2: error: invalid instruction mnemonic 'addd'
echo32.S:  addd [SHA3_CNT], 1
echo32.S:  ^~~~
echo32.S: echo32.S:575:2: error: invalid instruction mnemonic 'addd'
echo32.S:  addd [SHA3_CNT], 1
echo32.S:  ^~~~
echo32.S: echo32.S:839:2: error: invalid instruction mnemonic 'addd'
echo32.S:  addd [SHA3_CNT], 1
echo32.S:  ^~~~
echo32.S: echo32.S:1103:2: error: invalid instruction mnemonic 'addd'
echo32.S:  addd [SHA3_CNT], 1
echo32.S:  ^~~~
echo32.S: echo32.S:1367:2: error: invalid instruction mnemonic 'addd'
echo32.S:  addd [SHA3_CNT], 1
echo32.S:  ^~~~
echo32.S: echo32.S:1631:2: error: invalid instruction mnemonic 'addd'
echo32.S:  addd [SHA3_CNT], 1
echo32.S:  ^~~~
echo32.S: echo32.S:1895:2: error: invalid instruction mnemonic 'addd'
echo32.S:  addd [SHA3_CNT], 1
echo32.S:  ^~~~
echo32.S: echo32.S:2159:2: error: invalid instruction mnemonic 'addd'
echo32.S:  addd [SHA3_CNT], 1
echo32.S:  ^~~~
echo32.S: echo32.S:2423:2: error: invalid instruction mnemonic 'addd'
echo32.S: ...

Number of similar (implementation,compiler) pairs: 5, namely:
ImplementationCompiler
T:pentium/pentium4v64v1clang -march=native -O2 -fwrapv -Qunused-arguments -fPIC -fPIE -gdwarf-4 -Wall (Debian_Clang_11.0.1)
T:pentium/pentium4v64v1clang -march=native -O3 -fwrapv -Qunused-arguments -fPIC -fPIE -gdwarf-4 -Wall (Debian_Clang_11.0.1)
T:pentium/pentium4v64v1clang -march=native -O -fwrapv -Qunused-arguments -fPIC -fPIE -gdwarf-4 -Wall (Debian_Clang_11.0.1)
T:pentium/pentium4v64v1clang -march=native -Os -fwrapv -Qunused-arguments -fPIC -fPIE -gdwarf-4 -Wall (Debian_Clang_11.0.1)
T:pentium/pentium4v64v1clang -mcpu=native -O3 -fwrapv -Qunused-arguments -fPIC -fPIE -gdwarf-4 -Wall (Debian_Clang_11.0.1)

Compiler output


try.c: /usr/bin/ld: libcrypto_hash_echo256.a(echo32.o): relocation R_X86_64_32S against symbol `SHA3_R' can not be used when making a PIE object; recompile with -fPIE
try.c: collect2: error: ld returned 1 exit status

Number of similar (implementation,compiler) pairs: 4, namely:
ImplementationCompiler
T:pentium/pentium4v64v1gcc -march=native -mtune=native -O2 -fwrapv -fPIC -fPIE -gdwarf-4 -Wall (10.2.1_20210110)
T:pentium/pentium4v64v1gcc -march=native -mtune=native -O3 -fwrapv -fPIC -fPIE -gdwarf-4 -Wall (10.2.1_20210110)
T:pentium/pentium4v64v1gcc -march=native -mtune=native -O -fwrapv -fPIC -fPIE -gdwarf-4 -Wall (10.2.1_20210110)
T:pentium/pentium4v64v1gcc -march=native -mtune=native -Os -fwrapv -fPIC -fPIE -gdwarf-4 -Wall (10.2.1_20210110)

Compiler output


echo64.S: echo64.S:371:2: error: invalid instruction mnemonic 'addd'
echo64.S:  addd [SHA3_CNT], 1
echo64.S:  ^~~~
echo64.S: echo64.S:635:2: error: invalid instruction mnemonic 'addd'
echo64.S:  addd [SHA3_CNT], 1
echo64.S:  ^~~~
echo64.S: echo64.S:899:2: error: invalid instruction mnemonic 'addd'
echo64.S:  addd [SHA3_CNT], 1
echo64.S:  ^~~~
echo64.S: echo64.S:1163:2: error: invalid instruction mnemonic 'addd'
echo64.S:  addd [SHA3_CNT], 1
echo64.S:  ^~~~
echo64.S: echo64.S:1427:2: error: invalid instruction mnemonic 'addd'
echo64.S:  addd [SHA3_CNT], 1
echo64.S:  ^~~~
echo64.S: echo64.S:1691:2: error: invalid instruction mnemonic 'addd'
echo64.S:  addd [SHA3_CNT], 1
echo64.S:  ^~~~
echo64.S: echo64.S:1955:2: error: invalid instruction mnemonic 'addd'
echo64.S:  addd [SHA3_CNT], 1
echo64.S:  ^~~~
echo64.S: echo64.S:2219:2: error: invalid instruction mnemonic 'addd'
echo64.S:  addd [SHA3_CNT], 1
echo64.S:  ^~~~
echo64.S: echo64.S:2483:2: error: invalid instruction mnemonic 'addd'
echo64.S: ...

Number of similar (implementation,compiler) pairs: 5, namely:
ImplementationCompiler
T:pentium/pentium4v64v2clang -march=native -O2 -fwrapv -Qunused-arguments -fPIC -fPIE -gdwarf-4 -Wall (Debian_Clang_11.0.1)
T:pentium/pentium4v64v2clang -march=native -O3 -fwrapv -Qunused-arguments -fPIC -fPIE -gdwarf-4 -Wall (Debian_Clang_11.0.1)
T:pentium/pentium4v64v2clang -march=native -O -fwrapv -Qunused-arguments -fPIC -fPIE -gdwarf-4 -Wall (Debian_Clang_11.0.1)
T:pentium/pentium4v64v2clang -march=native -Os -fwrapv -Qunused-arguments -fPIC -fPIE -gdwarf-4 -Wall (Debian_Clang_11.0.1)
T:pentium/pentium4v64v2clang -mcpu=native -O3 -fwrapv -Qunused-arguments -fPIC -fPIE -gdwarf-4 -Wall (Debian_Clang_11.0.1)

Compiler output


try.c: /usr/bin/ld: libcrypto_hash_echo256.a(echo64.o): relocation R_X86_64_32S against symbol `SHA3_R' can not be used when making a PIE object; recompile with -fPIE
try.c: collect2: error: ld returned 1 exit status

Number of similar (implementation,compiler) pairs: 4, namely:
ImplementationCompiler
T:pentium/pentium4v64v2gcc -march=native -mtune=native -O2 -fwrapv -fPIC -fPIE -gdwarf-4 -Wall (10.2.1_20210110)
T:pentium/pentium4v64v2gcc -march=native -mtune=native -O3 -fwrapv -fPIC -fPIE -gdwarf-4 -Wall (10.2.1_20210110)
T:pentium/pentium4v64v2gcc -march=native -mtune=native -O -fwrapv -fPIC -fPIE -gdwarf-4 -Wall (10.2.1_20210110)
T:pentium/pentium4v64v2gcc -march=native -mtune=native -Os -fwrapv -fPIC -fPIE -gdwarf-4 -Wall (10.2.1_20210110)

Compiler output


echo32.c: echo32.c:106:18: warning: unused variable 'j' [-Wunused-variable]
echo32.c:         unsigned int i, j;
echo32.c:                         ^
echo32.c: echo32.c:107:16: warning: unused variable 'endianess' [-Wunused-variable]
echo32.c:         unsigned char endianess;
echo32.c:                       ^
echo32.c: echo32.c:472:21: warning: unused variable 'c0' [-Wunused-variable]
echo32.c:         unsigned long long c0, c1;
echo32.c:                            ^
echo32.c: echo32.c:472:25: warning: unused variable 'c1' [-Wunused-variable]
echo32.c:         unsigned long long c0, c1;
echo32.c:                                ^
echo32.c: echo32.c:599:21: warning: unused variable 'hashlen' [-Wunused-variable]
echo32.c:         unsigned short int hashlen = 0;
echo32.c:                            ^
echo32.c: echo32.c:600:21: warning: unused variable 'messlen_l' [-Wunused-variable]
echo32.c:         unsigned long long messlen_l = 0;
echo32.c:                            ^
echo32.c: echo32.c:601:21: warning: unused variable 'messlen_h' [-Wunused-variable]
echo32.c:         unsigned long long messlen_h = 0;
echo32.c:                            ^
echo32.c: 7 warnings generated.

Number of similar (implementation,compiler) pairs: 5, namely:
ImplementationCompiler
T:powerpc/pp32cv1clang -march=native -O2 -fwrapv -Qunused-arguments -fPIC -fPIE -gdwarf-4 -Wall (Debian_Clang_11.0.1)
T:powerpc/pp32cv1clang -march=native -O3 -fwrapv -Qunused-arguments -fPIC -fPIE -gdwarf-4 -Wall (Debian_Clang_11.0.1)
T:powerpc/pp32cv1clang -march=native -O -fwrapv -Qunused-arguments -fPIC -fPIE -gdwarf-4 -Wall (Debian_Clang_11.0.1)
T:powerpc/pp32cv1clang -march=native -Os -fwrapv -Qunused-arguments -fPIC -fPIE -gdwarf-4 -Wall (Debian_Clang_11.0.1)
T:powerpc/pp32cv1clang -mcpu=native -O3 -fwrapv -Qunused-arguments -fPIC -fPIE -gdwarf-4 -Wall (Debian_Clang_11.0.1)

Compiler output


echo32.c: echo32.c: In function 'Init':
echo32.c: echo32.c:107:16: warning: unused variable 'endianess' [-Wunused-variable]
echo32.c:   107 |  unsigned char endianess;
echo32.c:       |                ^~~~~~~~~
echo32.c: echo32.c:106:18: warning: unused variable 'j' [-Wunused-variable]
echo32.c:   106 |  unsigned int i, j;
echo32.c:       |                  ^
echo32.c: echo32.c: In function 'Compress':
echo32.c: echo32.c:472:25: warning: unused variable 'c1' [-Wunused-variable]
echo32.c:   472 |  unsigned long long c0, c1;
echo32.c:       |                         ^~
echo32.c: echo32.c:472:21: warning: unused variable 'c0' [-Wunused-variable]
echo32.c:   472 |  unsigned long long c0, c1;
echo32.c:       |                     ^~
echo32.c: echo32.c: In function 'Final':
echo32.c: echo32.c:601:21: warning: unused variable 'messlen_h' [-Wunused-variable]
echo32.c:   601 |  unsigned long long messlen_h = 0;
echo32.c:       |                     ^~~~~~~~~
echo32.c: echo32.c:600:21: warning: unused variable 'messlen_l' [-Wunused-variable]
echo32.c:   600 |  unsigned long long messlen_l = 0;
echo32.c:       |                     ^~~~~~~~~
echo32.c: echo32.c:599:21: warning: unused variable 'hashlen' [-Wunused-variable]
echo32.c:   599 |  unsigned short int hashlen = 0;
echo32.c:       |                     ^~~~~~~

Number of similar (implementation,compiler) pairs: 4, namely:
ImplementationCompiler
T:powerpc/pp32cv1gcc -march=native -mtune=native -O2 -fwrapv -fPIC -fPIE -gdwarf-4 -Wall (10.2.1_20210110)
T:powerpc/pp32cv1gcc -march=native -mtune=native -O3 -fwrapv -fPIC -fPIE -gdwarf-4 -Wall (10.2.1_20210110)
T:powerpc/pp32cv1gcc -march=native -mtune=native -O -fwrapv -fPIC -fPIE -gdwarf-4 -Wall (10.2.1_20210110)
T:powerpc/pp32cv1gcc -march=native -mtune=native -Os -fwrapv -fPIC -fPIE -gdwarf-4 -Wall (10.2.1_20210110)

Compiler output


echo32.c: echo32.c:106:18: warning: unused variable 'j' [-Wunused-variable]
echo32.c:         unsigned int i, j;
echo32.c:                         ^
echo32.c: echo32.c:107:16: warning: unused variable 'endianess' [-Wunused-variable]
echo32.c:         unsigned char endianess;
echo32.c:                       ^
echo32.c: echo32.c:440:21: warning: unused variable 'c0' [-Wunused-variable]
echo32.c:         unsigned long long c0, c1;
echo32.c:                            ^
echo32.c: echo32.c:440:25: warning: unused variable 'c1' [-Wunused-variable]
echo32.c:         unsigned long long c0, c1;
echo32.c:                                ^
echo32.c: echo32.c:567:21: warning: unused variable 'hashlen' [-Wunused-variable]
echo32.c:         unsigned short int hashlen = 0;
echo32.c:                            ^
echo32.c: echo32.c:568:21: warning: unused variable 'messlen_l' [-Wunused-variable]
echo32.c:         unsigned long long messlen_l = 0;
echo32.c:                            ^
echo32.c: echo32.c:569:21: warning: unused variable 'messlen_h' [-Wunused-variable]
echo32.c:         unsigned long long messlen_h = 0;
echo32.c:                            ^
echo32.c: 7 warnings generated.

Number of similar (implementation,compiler) pairs: 5, namely:
ImplementationCompiler
T:powerpc/pp32cv2clang -march=native -O2 -fwrapv -Qunused-arguments -fPIC -fPIE -gdwarf-4 -Wall (Debian_Clang_11.0.1)
T:powerpc/pp32cv2clang -march=native -O3 -fwrapv -Qunused-arguments -fPIC -fPIE -gdwarf-4 -Wall (Debian_Clang_11.0.1)
T:powerpc/pp32cv2clang -march=native -O -fwrapv -Qunused-arguments -fPIC -fPIE -gdwarf-4 -Wall (Debian_Clang_11.0.1)
T:powerpc/pp32cv2clang -march=native -Os -fwrapv -Qunused-arguments -fPIC -fPIE -gdwarf-4 -Wall (Debian_Clang_11.0.1)
T:powerpc/pp32cv2clang -mcpu=native -O3 -fwrapv -Qunused-arguments -fPIC -fPIE -gdwarf-4 -Wall (Debian_Clang_11.0.1)

Compiler output


echo32.c: echo32.c: In function 'Init':
echo32.c: echo32.c:107:16: warning: unused variable 'endianess' [-Wunused-variable]
echo32.c:   107 |  unsigned char endianess;
echo32.c:       |                ^~~~~~~~~
echo32.c: echo32.c:106:18: warning: unused variable 'j' [-Wunused-variable]
echo32.c:   106 |  unsigned int i, j;
echo32.c:       |                  ^
echo32.c: echo32.c: In function 'Compress':
echo32.c: echo32.c:440:25: warning: unused variable 'c1' [-Wunused-variable]
echo32.c:   440 |  unsigned long long c0, c1;
echo32.c:       |                         ^~
echo32.c: echo32.c:440:21: warning: unused variable 'c0' [-Wunused-variable]
echo32.c:   440 |  unsigned long long c0, c1;
echo32.c:       |                     ^~
echo32.c: echo32.c: In function 'Final':
echo32.c: echo32.c:569:21: warning: unused variable 'messlen_h' [-Wunused-variable]
echo32.c:   569 |  unsigned long long messlen_h = 0;
echo32.c:       |                     ^~~~~~~~~
echo32.c: echo32.c:568:21: warning: unused variable 'messlen_l' [-Wunused-variable]
echo32.c:   568 |  unsigned long long messlen_l = 0;
echo32.c:       |                     ^~~~~~~~~
echo32.c: echo32.c:567:21: warning: unused variable 'hashlen' [-Wunused-variable]
echo32.c:   567 |  unsigned short int hashlen = 0;
echo32.c:       |                     ^~~~~~~

Number of similar (implementation,compiler) pairs: 4, namely:
ImplementationCompiler
T:powerpc/pp32cv2gcc -march=native -mtune=native -O2 -fwrapv -fPIC -fPIE -gdwarf-4 -Wall (10.2.1_20210110)
T:powerpc/pp32cv2gcc -march=native -mtune=native -O3 -fwrapv -fPIC -fPIE -gdwarf-4 -Wall (10.2.1_20210110)
T:powerpc/pp32cv2gcc -march=native -mtune=native -O -fwrapv -fPIC -fPIE -gdwarf-4 -Wall (10.2.1_20210110)
T:powerpc/pp32cv2gcc -march=native -mtune=native -Os -fwrapv -fPIC -fPIE -gdwarf-4 -Wall (10.2.1_20210110)