Implementation notes: amd64, panther, crypto_hash/blake3

Computer: panther
Microarchitecture: amd64; Tiger Lake (806c1)
Architecture: amd64
CPU ID: GenuineIntel-000806c1-00-bfebfbff
SUPERCOP version: 20240625
Operation: crypto_hash
Primitive: blake3
TimeObject sizeTest sizeImplementationCompilerBenchmark dateSUPERCOP version
443117577 0 028632 788 952T:avx512gcc_-march=native_-mtune=native_-O2_-fwrapv_-fPIC_-fPIE_-gdwarf-4_-Wall2024062620240625
443217595 0 028175 780 952T:avx512gcc_-march=native_-mtune=native_-O_-fwrapv_-fPIC_-fPIE_-gdwarf-4_-Wall2024062620240625
443318491 0 031656 788 952T:avx512gcc_-march=native_-mtune=native_-O3_-fwrapv_-fPIC_-fPIE_-gdwarf-4_-Wall2024062620240625
443518633 0 031481 836 888T:avx512clang_-mcpu=native_-O3_-fwrapv_-Qunused-arguments_-fPIC_-fPIE_-gdwarf-4_-Wall2024062620240625
444419116 0 032569 836 920T:avx512clang_-march=native_-O3_-fwrapv_-Qunused-arguments_-fPIC_-fPIE_-gdwarf-4_-Wall2024062620240625
444517130 0 027695 828 888T:avx512clang_-march=native_-O_-fwrapv_-Qunused-arguments_-fPIC_-fPIE_-gdwarf-4_-Wall2024062620240625
445317227 0 027503 828 888T:avx512clang_-march=native_-Os_-fwrapv_-Qunused-arguments_-fPIC_-fPIE_-gdwarf-4_-Wall2024062620240625
447916901 0 026531 764 920T:avx512gcc_-march=native_-mtune=native_-Os_-fwrapv_-fPIC_-fPIE_-gdwarf-4_-Wall2024062620240625
449619116 0 032569 836 920T:avx512clang_-march=native_-O2_-fwrapv_-Qunused-arguments_-fPIC_-fPIE_-gdwarf-4_-Wall2024062620240625
550624082 0 036969 836 888T:avx2clang_-mcpu=native_-O3_-fwrapv_-Qunused-arguments_-fPIC_-fPIE_-gdwarf-4_-Wall2024062620240625
553614198 0 027049 836 888T:sse41clang_-mcpu=native_-O3_-fwrapv_-Qunused-arguments_-fPIC_-fPIE_-gdwarf-4_-Wall2024062620240625
733110075 0 022913 836 888T:portableclang_-mcpu=native_-O3_-fwrapv_-Qunused-arguments_-fPIC_-fPIE_-gdwarf-4_-Wall2024062620240625

Compiler output


blake3.c: In file included from blake3.c:12:
blake3.c: ./blake3_static_dispatch.h:8:2: error: "there are wider implementations on this platform; fail the build"
blake3.c: #error "there are wider implementations on this platform; fail the build"
blake3.c:  ^
blake3.c: 1 error generated.

Number of similar (implementation,compiler) pairs: 12, namely:
ImplementationCompiler
T:avx2clang -march=native -O2 -fwrapv -Qunused-arguments -fPIC -fPIE -gdwarf-4 -Wall (Debian_Clang_11.0.1)
T:avx2clang -march=native -O3 -fwrapv -Qunused-arguments -fPIC -fPIE -gdwarf-4 -Wall (Debian_Clang_11.0.1)
T:avx2clang -march=native -O -fwrapv -Qunused-arguments -fPIC -fPIE -gdwarf-4 -Wall (Debian_Clang_11.0.1)
T:avx2clang -march=native -Os -fwrapv -Qunused-arguments -fPIC -fPIE -gdwarf-4 -Wall (Debian_Clang_11.0.1)
T:portableclang -march=native -O2 -fwrapv -Qunused-arguments -fPIC -fPIE -gdwarf-4 -Wall (Debian_Clang_11.0.1)
T:portableclang -march=native -O3 -fwrapv -Qunused-arguments -fPIC -fPIE -gdwarf-4 -Wall (Debian_Clang_11.0.1)
T:portableclang -march=native -O -fwrapv -Qunused-arguments -fPIC -fPIE -gdwarf-4 -Wall (Debian_Clang_11.0.1)
T:portableclang -march=native -Os -fwrapv -Qunused-arguments -fPIC -fPIE -gdwarf-4 -Wall (Debian_Clang_11.0.1)
T:sse41clang -march=native -O2 -fwrapv -Qunused-arguments -fPIC -fPIE -gdwarf-4 -Wall (Debian_Clang_11.0.1)
T:sse41clang -march=native -O3 -fwrapv -Qunused-arguments -fPIC -fPIE -gdwarf-4 -Wall (Debian_Clang_11.0.1)
T:sse41clang -march=native -O -fwrapv -Qunused-arguments -fPIC -fPIE -gdwarf-4 -Wall (Debian_Clang_11.0.1)
T:sse41clang -march=native -Os -fwrapv -Qunused-arguments -fPIC -fPIE -gdwarf-4 -Wall (Debian_Clang_11.0.1)

Compiler output


blake3.c: In file included from blake3.c:12:
blake3.c: blake3_static_dispatch.h:8:2: error: #error "there are wider implementations on this platform; fail the build"
blake3.c:     8 | #error "there are wider implementations on this platform; fail the build"
blake3.c:       |  ^~~~~

Number of similar (implementation,compiler) pairs: 12, namely:
ImplementationCompiler
T:avx2gcc -march=native -mtune=native -O2 -fwrapv -fPIC -fPIE -gdwarf-4 -Wall (10.2.1_20210110)
T:avx2gcc -march=native -mtune=native -O3 -fwrapv -fPIC -fPIE -gdwarf-4 -Wall (10.2.1_20210110)
T:avx2gcc -march=native -mtune=native -O -fwrapv -fPIC -fPIE -gdwarf-4 -Wall (10.2.1_20210110)
T:avx2gcc -march=native -mtune=native -Os -fwrapv -fPIC -fPIE -gdwarf-4 -Wall (10.2.1_20210110)
T:portablegcc -march=native -mtune=native -O2 -fwrapv -fPIC -fPIE -gdwarf-4 -Wall (10.2.1_20210110)
T:portablegcc -march=native -mtune=native -O3 -fwrapv -fPIC -fPIE -gdwarf-4 -Wall (10.2.1_20210110)
T:portablegcc -march=native -mtune=native -O -fwrapv -fPIC -fPIE -gdwarf-4 -Wall (10.2.1_20210110)
T:portablegcc -march=native -mtune=native -Os -fwrapv -fPIC -fPIE -gdwarf-4 -Wall (10.2.1_20210110)
T:sse41gcc -march=native -mtune=native -O2 -fwrapv -fPIC -fPIE -gdwarf-4 -Wall (10.2.1_20210110)
T:sse41gcc -march=native -mtune=native -O3 -fwrapv -fPIC -fPIE -gdwarf-4 -Wall (10.2.1_20210110)
T:sse41gcc -march=native -mtune=native -O -fwrapv -fPIC -fPIE -gdwarf-4 -Wall (10.2.1_20210110)
T:sse41gcc -march=native -mtune=native -Os -fwrapv -fPIC -fPIE -gdwarf-4 -Wall (10.2.1_20210110)

Compiler output


blake3_neon.c: In file included from blake3_neon.c:3:
blake3_neon.c: /usr/lib/llvm-11/lib/clang/11.0.1/include/arm_neon.h:28:2: error: "NEON intrinsics not available with the soft-float ABI. Please use -mfloat-abi=softfp or -mfloat-abi=hard"
blake3_neon.c: #error "NEON intrinsics not available with the soft-float ABI. Please use -mfloat-abi=softfp or -mfloat-abi=hard"
blake3_neon.c:  ^
blake3_neon.c: blake3_neon.c:11:8: error: unknown type name 'uint32x4_t'; did you mean 'uint32_t'?
blake3_neon.c: INLINE uint32x4_t loadu_128(const uint8_t src[16]) {
blake3_neon.c:        ^~~~~~~~~~
blake3_neon.c:        uint32_t
blake3_neon.c: /usr/include/x86_64-linux-gnu/bits/stdint-uintn.h:26:20: note: 'uint32_t' declared here
blake3_neon.c: typedef __uint32_t uint32_t;
blake3_neon.c:                    ^
blake3_neon.c: blake3_neon.c:13:3: error: unknown type name 'uint32x4_t'; did you mean 'uint32_t'?
blake3_neon.c:   uint32x4_t x;
blake3_neon.c:   ^~~~~~~~~~
blake3_neon.c:   uint32_t
blake3_neon.c: /usr/include/x86_64-linux-gnu/bits/stdint-uintn.h:26:20: note: 'uint32_t' declared here
blake3_neon.c: typedef __uint32_t uint32_t;
blake3_neon.c:                    ^
blake3_neon.c: blake3_neon.c:14:3: warning: 'memcpy' will always overflow; destination buffer has size 4, but size argument is 16 [-Wfortify-source]
blake3_neon.c:   memcpy(&x, src, 16);
blake3_neon.c:   ^
blake3_neon.c: blake3_neon.c:18:24: error: unknown type name 'uint32x4_t'; did you mean 'uint32_t'?
blake3_neon.c: INLINE void storeu_128(uint32x4_t src, uint8_t dest[16]) {
blake3_neon.c:                        ^~~~~~~~~~
blake3_neon.c:                        uint32_t
blake3_neon.c: ...

Number of similar (implementation,compiler) pairs: 5, namely:
ImplementationCompiler
T:neonclang -march=native -O2 -fwrapv -Qunused-arguments -fPIC -fPIE -gdwarf-4 -Wall (Debian_Clang_11.0.1)
T:neonclang -march=native -O3 -fwrapv -Qunused-arguments -fPIC -fPIE -gdwarf-4 -Wall (Debian_Clang_11.0.1)
T:neonclang -march=native -O -fwrapv -Qunused-arguments -fPIC -fPIE -gdwarf-4 -Wall (Debian_Clang_11.0.1)
T:neonclang -march=native -Os -fwrapv -Qunused-arguments -fPIC -fPIE -gdwarf-4 -Wall (Debian_Clang_11.0.1)
T:neonclang -mcpu=native -O3 -fwrapv -Qunused-arguments -fPIC -fPIE -gdwarf-4 -Wall (Debian_Clang_11.0.1)

Compiler output


blake3_neon.c: blake3_neon.c:3:10: fatal error: arm_neon.h: No such file or directory
blake3_neon.c:     3 | #include <arm_neon.h>
blake3_neon.c:       |          ^~~~~~~~~~~~
blake3_neon.c: compilation terminated.

Number of similar (implementation,compiler) pairs: 4, namely:
ImplementationCompiler
T:neongcc -march=native -mtune=native -O2 -fwrapv -fPIC -fPIE -gdwarf-4 -Wall (10.2.1_20210110)
T:neongcc -march=native -mtune=native -O3 -fwrapv -fPIC -fPIE -gdwarf-4 -Wall (10.2.1_20210110)
T:neongcc -march=native -mtune=native -O -fwrapv -fPIC -fPIE -gdwarf-4 -Wall (10.2.1_20210110)
T:neongcc -march=native -mtune=native -Os -fwrapv -fPIC -fPIE -gdwarf-4 -Wall (10.2.1_20210110)