Implementation notes: amd64, panther, crypto_hash/asconxofav12

Computer: panther
Microarchitecture: amd64; Tiger Lake (806c1)
Architecture: amd64
CPU ID: GenuineIntel-000806c1-00-bfebfbff
SUPERCOP version: 20231107
Operation: crypto_hash
Primitive: asconxofav12
TimeObject sizeTest sizeImplementationCompilerBenchmark dateSUPERCOP version
227364819 0 015246 804 888opt64clang_-march=native_-O_-fomit-frame-pointer_-fwrapv_-Qunused-arguments_-fPIC_-fPIE2023052920230530
247895058 0 018128 780 952opt64gcc_-march=native_-mtune=native_-O3_-fomit-frame-pointer_-fwrapv_-fPIC_-fPIE2023052920230530
248025112 0 014675 756 920opt64gcc_-march=native_-mtune=native_-Os_-fomit-frame-pointer_-fwrapv_-fPIC_-fPIE2023052920230530
248425058 0 015992 780 952opt64gcc_-march=native_-mtune=native_-O2_-fomit-frame-pointer_-fwrapv_-fPIC_-fPIE2023052920230530
25217721 0 010259 756 920opt64_lowsizegcc_-march=native_-mtune=native_-Os_-fomit-frame-pointer_-fwrapv_-fPIC_-fPIE2023052920230530
252255649 0 016135 772 952opt64gcc_-march=native_-mtune=native_-O_-fomit-frame-pointer_-fwrapv_-fPIC_-fPIE2023052920230530
25466763 0 011688 780 952opt64_lowsizegcc_-march=native_-mtune=native_-O2_-fomit-frame-pointer_-fwrapv_-fPIC_-fPIE2023052920230530
255545397 0 015662 804 888refclang_-march=native_-Os_-fomit-frame-pointer_-fwrapv_-Qunused-arguments_-fPIC_-fPIE2023052920230530
25788688 0 011142 804 888opt64_lowsizeclang_-march=native_-O_-fomit-frame-pointer_-fwrapv_-Qunused-arguments_-fPIC_-fPIE2023052920230530
260456561 0 019624 780 952refgcc_-march=native_-mtune=native_-O3_-fomit-frame-pointer_-fwrapv_-fPIC_-fPIE2023052920230530
266435310 0 016232 780 952refgcc_-march=native_-mtune=native_-O2_-fomit-frame-pointer_-fwrapv_-fPIC_-fPIE2023052920230530
266775228 0 015711 772 952refgcc_-march=native_-mtune=native_-O_-fomit-frame-pointer_-fwrapv_-fPIC_-fPIE2023052920230530
270585832 0 019144 812 920refclang_-march=native_-O3_-fomit-frame-pointer_-fwrapv_-Qunused-arguments_-fPIC_-fPIE2023052920230530
271065832 0 019128 812 920refclang_-march=native_-O2_-fomit-frame-pointer_-fwrapv_-Qunused-arguments_-fPIC_-fPIE2023052920230530
271235203 0 018496 812 920opt64clang_-march=native_-O2_-fomit-frame-pointer_-fwrapv_-Qunused-arguments_-fPIC_-fPIE2023052920230530
271285203 0 018512 812 920opt64clang_-march=native_-O3_-fomit-frame-pointer_-fwrapv_-Qunused-arguments_-fPIC_-fPIE2023052920230530
271535196 0 015454 804 888opt64clang_-march=native_-Os_-fomit-frame-pointer_-fwrapv_-Qunused-arguments_-fPIC_-fPIE2023052920230530
274501260 0 011727 772 952opt64_lowsizegcc_-march=native_-mtune=native_-O_-fomit-frame-pointer_-fwrapv_-fPIC_-fPIE2023052920230530
284105565 0 018328 812 888refclang_-mcpu=native_-O3_-fomit-frame-pointer_-fwrapv_-Qunused-arguments_-fPIC_-fPIE2023052920230530
28605808 0 013864 780 952opt64_lowsizegcc_-march=native_-mtune=native_-O3_-fomit-frame-pointer_-fwrapv_-fPIC_-fPIE2023052920230530
288555004 0 017760 812 888opt64clang_-mcpu=native_-O3_-fomit-frame-pointer_-fwrapv_-Qunused-arguments_-fPIC_-fPIE2023052920230530
293881015 0 010571 756 920refgcc_-march=native_-mtune=native_-Os_-fomit-frame-pointer_-fwrapv_-fPIC_-fPIE2023052920230530
31788800 0 013568 812 888opt64_lowsizeclang_-mcpu=native_-O3_-fomit-frame-pointer_-fwrapv_-Qunused-arguments_-fPIC_-fPIE2023052920230530
324386102 0 015667 756 920opt32gcc_-march=native_-mtune=native_-Os_-fomit-frame-pointer_-fwrapv_-fPIC_-fPIE2023052920230530
326276071 0 016494 804 888opt32clang_-march=native_-O_-fomit-frame-pointer_-fwrapv_-Qunused-arguments_-fPIC_-fPIE2023052920230530
326746170 0 017096 780 952opt32gcc_-march=native_-mtune=native_-O2_-fomit-frame-pointer_-fwrapv_-fPIC_-fPIE2023052920230530
326946170 0 019232 780 952opt32gcc_-march=native_-mtune=native_-O3_-fomit-frame-pointer_-fwrapv_-fPIC_-fPIE2023052920230530
34047734 0 011190 804 888opt32_lowsizeclang_-march=native_-O_-fomit-frame-pointer_-fwrapv_-Qunused-arguments_-fPIC_-fPIE2023052920230530
341896881 0 017367 772 952opt32gcc_-march=native_-mtune=native_-O_-fomit-frame-pointer_-fwrapv_-fPIC_-fPIE2023052920230530
34360813 0 011744 780 952opt32_lowsizegcc_-march=native_-mtune=native_-O2_-fomit-frame-pointer_-fwrapv_-fPIC_-fPIE2023052920230530
34690778 0 010315 756 920opt32_lowsizegcc_-march=native_-mtune=native_-Os_-fomit-frame-pointer_-fwrapv_-fPIC_-fPIE2023052920230530
350246697 0 020000 812 920opt32clang_-march=native_-O2_-fomit-frame-pointer_-fwrapv_-Qunused-arguments_-fPIC_-fPIE2023052920230530
351026697 0 020016 812 920opt32clang_-march=native_-O3_-fomit-frame-pointer_-fwrapv_-Qunused-arguments_-fPIC_-fPIE2023052920230530
351126685 0 016942 804 888opt32clang_-march=native_-Os_-fomit-frame-pointer_-fwrapv_-Qunused-arguments_-fPIC_-fPIE2023052920230530
358956545 0 019296 812 888opt32clang_-mcpu=native_-O3_-fomit-frame-pointer_-fwrapv_-Qunused-arguments_-fPIC_-fPIE2023052920230530
362151311 0 011783 772 952opt32_lowsizegcc_-march=native_-mtune=native_-O_-fomit-frame-pointer_-fwrapv_-fPIC_-fPIE2023052920230530
37012846 0 013896 780 952opt32_lowsizegcc_-march=native_-mtune=native_-O3_-fomit-frame-pointer_-fwrapv_-fPIC_-fPIE2023052920230530
38196853 0 013632 812 888opt32_lowsizeclang_-mcpu=native_-O3_-fomit-frame-pointer_-fwrapv_-Qunused-arguments_-fPIC_-fPIE2023052920230530
47304925 0 014232 812 920opt32_lowsizeclang_-march=native_-O2_-fomit-frame-pointer_-fwrapv_-Qunused-arguments_-fPIC_-fPIE2023052920230530
47386925 0 014248 812 920opt32_lowsizeclang_-march=native_-O3_-fomit-frame-pointer_-fwrapv_-Qunused-arguments_-fPIC_-fPIE2023052920230530
47496904 0 011190 804 888opt32_lowsizeclang_-march=native_-Os_-fomit-frame-pointer_-fwrapv_-Qunused-arguments_-fPIC_-fPIE2023052920230530
49999883 0 014200 812 920opt64_lowsizeclang_-march=native_-O3_-fomit-frame-pointer_-fwrapv_-Qunused-arguments_-fPIC_-fPIE2023052920230530
50044883 0 014184 812 920opt64_lowsizeclang_-march=native_-O2_-fomit-frame-pointer_-fwrapv_-Qunused-arguments_-fPIC_-fPIE2023052920230530
50139870 0 011158 804 888opt64_lowsizeclang_-march=native_-Os_-fomit-frame-pointer_-fwrapv_-Qunused-arguments_-fPIC_-fPIE2023052920230530
610399329 0 022368 780 952bi32gcc_-march=native_-mtune=native_-O3_-fomit-frame-pointer_-fwrapv_-fPIC_-fPIE2023052920230530
610539277 0 020192 780 952bi32gcc_-march=native_-mtune=native_-O2_-fomit-frame-pointer_-fwrapv_-fPIC_-fPIE2023052920230530
635919782 0 020239 772 952bi32gcc_-march=native_-mtune=native_-O_-fomit-frame-pointer_-fwrapv_-fPIC_-fPIE2023052920230530
642373054 0 016144 780 952bi32_lowreggcc_-march=native_-mtune=native_-O3_-fomit-frame-pointer_-fwrapv_-fPIC_-fPIE2023052920230530
645173045 0 014016 780 952bi32_lowreggcc_-march=native_-mtune=native_-O2_-fomit-frame-pointer_-fwrapv_-fPIC_-fPIE2023052920230530
658841571 0 014624 780 952bi32_lowsizegcc_-march=native_-mtune=native_-O3_-fomit-frame-pointer_-fwrapv_-fPIC_-fPIE2023052920230530
661671567 0 012504 780 952bi32_lowsizegcc_-march=native_-mtune=native_-O2_-fomit-frame-pointer_-fwrapv_-fPIC_-fPIE2023052920230530
6645110581 0 023736 812 920bi32clang_-march=native_-O2_-fomit-frame-pointer_-fwrapv_-Qunused-arguments_-fPIC_-fPIE2023052920230530
6653710745 0 020870 804 888bi32clang_-march=native_-Os_-fomit-frame-pointer_-fwrapv_-Qunused-arguments_-fPIC_-fPIE2023052920230530
6659311092 0 024264 812 920bi32clang_-march=native_-O3_-fomit-frame-pointer_-fwrapv_-Qunused-arguments_-fPIC_-fPIE2023052920230530
6726410201 0 020646 804 888bi32clang_-march=native_-O_-fomit-frame-pointer_-fwrapv_-Qunused-arguments_-fPIC_-fPIE2023052920230530
686521930 0 015232 812 920bi32_lowsizeclang_-march=native_-O3_-fomit-frame-pointer_-fwrapv_-Qunused-arguments_-fPIC_-fPIE2023052920230530
687603842 0 016968 812 920bi32_lowregclang_-march=native_-O3_-fomit-frame-pointer_-fwrapv_-Qunused-arguments_-fPIC_-fPIE2023052920230530
690443842 0 016952 812 920bi32_lowregclang_-march=native_-O2_-fomit-frame-pointer_-fwrapv_-Qunused-arguments_-fPIC_-fPIE2023052920230530
690561930 0 015216 812 920bi32_lowsizeclang_-march=native_-O2_-fomit-frame-pointer_-fwrapv_-Qunused-arguments_-fPIC_-fPIE2023052920230530
692743809 0 013926 804 888bi32_lowregclang_-march=native_-Os_-fomit-frame-pointer_-fwrapv_-Qunused-arguments_-fPIC_-fPIE2023052920230530
6942011101 0 023848 812 888bi32clang_-mcpu=native_-O3_-fomit-frame-pointer_-fwrapv_-Qunused-arguments_-fPIC_-fPIE2023052920230530
695981860 0 012134 804 888bi32_lowsizeclang_-march=native_-Os_-fomit-frame-pointer_-fwrapv_-Qunused-arguments_-fPIC_-fPIE2023052920230530
698619278 0 018803 756 920bi32gcc_-march=native_-mtune=native_-Os_-fomit-frame-pointer_-fwrapv_-fPIC_-fPIE2023052920230530
715832612 0 012203 756 920bi32_lowreggcc_-march=native_-mtune=native_-Os_-fomit-frame-pointer_-fwrapv_-fPIC_-fPIE2023052920230530
725931512 0 011067 756 920bi32_lowsizegcc_-march=native_-mtune=native_-Os_-fomit-frame-pointer_-fwrapv_-fPIC_-fPIE2023052920230530
749513466 0 013999 772 952bi32_lowreggcc_-march=native_-mtune=native_-O_-fomit-frame-pointer_-fwrapv_-fPIC_-fPIE2023052920230530
752273433 0 016216 812 888bi32_lowregclang_-mcpu=native_-O3_-fomit-frame-pointer_-fwrapv_-Qunused-arguments_-fPIC_-fPIE2023052920230530
762581761 0 012231 772 952bi32_lowsizegcc_-march=native_-mtune=native_-O_-fomit-frame-pointer_-fwrapv_-fPIC_-fPIE2023052920230530
774161658 0 014424 812 888bi32_lowsizeclang_-mcpu=native_-O3_-fomit-frame-pointer_-fwrapv_-Qunused-arguments_-fPIC_-fPIE2023052920230530
801661602 0 012062 804 888bi32_lowsizeclang_-march=native_-O_-fomit-frame-pointer_-fwrapv_-Qunused-arguments_-fPIC_-fPIE2023052920230530
805413303 0 013790 804 888bi32_lowregclang_-march=native_-O_-fomit-frame-pointer_-fwrapv_-Qunused-arguments_-fPIC_-fPIE2023052920230530
854331329 0 011806 804 888refclang_-march=native_-O_-fomit-frame-pointer_-fwrapv_-Qunused-arguments_-fPIC_-fPIE2023052920230530
1449383209 0 016456 812 920opt8clang_-march=native_-O2_-fomit-frame-pointer_-fwrapv_-Qunused-arguments_-fPIC_-fPIE2023052920230530
1460343051 0 016320 812 920opt8_lowsizeclang_-march=native_-O2_-fomit-frame-pointer_-fwrapv_-Qunused-arguments_-fPIC_-fPIE2023052920230530
1475912246 0 012510 804 888opt8_lowsizeclang_-march=native_-Os_-fomit-frame-pointer_-fwrapv_-Qunused-arguments_-fPIC_-fPIE2023052920230530
1482592142 0 012382 804 888opt8clang_-march=native_-Os_-fomit-frame-pointer_-fwrapv_-Qunused-arguments_-fPIC_-fPIE2023052920230530
1919453902 0 017216 812 920opt8_lowsizeclang_-march=native_-O3_-fomit-frame-pointer_-fwrapv_-Qunused-arguments_-fPIC_-fPIE2023052920230530
1923324412 0 017648 812 920opt8clang_-march=native_-O3_-fomit-frame-pointer_-fwrapv_-Qunused-arguments_-fPIC_-fPIE2023052920230530
2076604008 0 016752 812 888opt8clang_-mcpu=native_-O3_-fomit-frame-pointer_-fwrapv_-Qunused-arguments_-fPIC_-fPIE2023052920230530
2081813511 0 016272 812 888opt8_lowsizeclang_-mcpu=native_-O3_-fomit-frame-pointer_-fwrapv_-Qunused-arguments_-fPIC_-fPIE2023052920230530
2246243838 0 016224 812 888bi8clang_-mcpu=native_-O3_-fomit-frame-pointer_-fwrapv_-Qunused-arguments_-fPIC_-fPIE2023052920230530
2301213282 0 013358 804 888bi8clang_-march=native_-O_-fomit-frame-pointer_-fwrapv_-Qunused-arguments_-fPIC_-fPIE2023052920230530
2518134965 0 017888 812 920bi8clang_-march=native_-O2_-fomit-frame-pointer_-fwrapv_-Qunused-arguments_-fPIC_-fPIE2023052920230530
2521764499 0 014398 804 888bi8clang_-march=native_-Os_-fomit-frame-pointer_-fwrapv_-Qunused-arguments_-fPIC_-fPIE2023052920230530
2530214965 0 017904 812 920bi8clang_-march=native_-O3_-fomit-frame-pointer_-fwrapv_-Qunused-arguments_-fPIC_-fPIE2023052920230530
2596993498 0 016136 780 952bi8gcc_-march=native_-mtune=native_-O3_-fomit-frame-pointer_-fwrapv_-fPIC_-fPIE2023052920230530
2694092051 0 012518 804 888opt8clang_-march=native_-O_-fomit-frame-pointer_-fwrapv_-Qunused-arguments_-fPIC_-fPIE2023052920230530
2704272161 0 012590 804 888opt8_lowsizeclang_-march=native_-O_-fomit-frame-pointer_-fwrapv_-Qunused-arguments_-fPIC_-fPIE2023052920230530
3055543928 0 013091 756 920bi8gcc_-march=native_-mtune=native_-Os_-fomit-frame-pointer_-fwrapv_-fPIC_-fPIE2023052920230530
3278954727 0 014823 772 952bi8gcc_-march=native_-mtune=native_-O_-fomit-frame-pointer_-fwrapv_-fPIC_-fPIE2023052920230530
3336594442 0 014992 780 952bi8gcc_-march=native_-mtune=native_-O2_-fomit-frame-pointer_-fwrapv_-fPIC_-fPIE2023052920230530
5050954115 0 017144 780 952opt8_lowsizegcc_-march=native_-mtune=native_-O3_-fomit-frame-pointer_-fwrapv_-fPIC_-fPIE2023052920230530
5063334759 0 017824 780 952opt8gcc_-march=native_-mtune=native_-O3_-fomit-frame-pointer_-fwrapv_-fPIC_-fPIE2023052920230530
5212043835 0 014279 772 952opt8_lowsizegcc_-march=native_-mtune=native_-O_-fomit-frame-pointer_-fwrapv_-fPIC_-fPIE2023052920230530
5220083824 0 014736 780 952opt8_lowsizegcc_-march=native_-mtune=native_-O2_-fomit-frame-pointer_-fwrapv_-fPIC_-fPIE2023052920230530
5234894023 0 014968 780 952opt8gcc_-march=native_-mtune=native_-O2_-fomit-frame-pointer_-fwrapv_-fPIC_-fPIE2023052920230530
5237723942 0 014431 772 952opt8gcc_-march=native_-mtune=native_-O_-fomit-frame-pointer_-fwrapv_-fPIC_-fPIE2023052920230530
5736693765 0 013291 756 920opt8_lowsizegcc_-march=native_-mtune=native_-Os_-fomit-frame-pointer_-fwrapv_-fPIC_-fPIE2023052920230530
5738903758 0 013323 756 920opt8gcc_-march=native_-mtune=native_-Os_-fomit-frame-pointer_-fwrapv_-fPIC_-fPIE2023052920230530

Compiler output

Implementation: T:asm_esp32
Security model: timingleaks
Compiler: clang -march=native -O2 -fomit-frame-pointer -fwrapv -Qunused-arguments -fPIC -fPIE
ascon.S: ascon.S:1:10: fatal error: 'xtensa/coreasm.h' file not found
ascon.S: #include <xtensa/coreasm.h>
ascon.S: ^~~~~~~~~~~~~~~~~~
ascon.S: 1 error generated.

Number of similar (compiler,implementation) pairs: 5, namely:
CompilerImplementations
clang -march=native -O2 -fomit-frame-pointer -fwrapv -Qunused-arguments -fPIC -fPIE T:asm_esp32
clang -march=native -O3 -fomit-frame-pointer -fwrapv -Qunused-arguments -fPIC -fPIE T:asm_esp32
clang -march=native -O -fomit-frame-pointer -fwrapv -Qunused-arguments -fPIC -fPIE T:asm_esp32
clang -march=native -Os -fomit-frame-pointer -fwrapv -Qunused-arguments -fPIC -fPIE T:asm_esp32
clang -mcpu=native -O3 -fomit-frame-pointer -fwrapv -Qunused-arguments -fPIC -fPIE T:asm_esp32

Compiler output

Implementation: T:asm_esp32
Security model: timingleaks
Compiler: gcc -march=native -mtune=native -O2 -fomit-frame-pointer -fwrapv -fPIC -fPIE
ascon.S: ascon.S:1:10: fatal error: xtensa/coreasm.h: No such file or directory
ascon.S: 1 | #include <xtensa/coreasm.h>
ascon.S: | ^~~~~~~~~~~~~~~~~~
ascon.S: compilation terminated.

Number of similar (compiler,implementation) pairs: 4, namely:
CompilerImplementations
gcc -march=native -mtune=native -O2 -fomit-frame-pointer -fwrapv -fPIC -fPIE T:asm_esp32
gcc -march=native -mtune=native -O3 -fomit-frame-pointer -fwrapv -fPIC -fPIE T:asm_esp32
gcc -march=native -mtune=native -O -fomit-frame-pointer -fwrapv -fPIC -fPIE T:asm_esp32
gcc -march=native -mtune=native -Os -fomit-frame-pointer -fwrapv -fPIC -fPIE T:asm_esp32

Compiler output

Implementation: avr
Security model: constbranchindex
Compiler: clang -march=native -O2 -fomit-frame-pointer -fwrapv -Qunused-arguments -fPIC -fPIE
permutations.S: permutations.S:29:10: fatal error: 'avr/io.h' file not found
permutations.S: #include "avr/io.h"
permutations.S: ^~~~~~~~~~
permutations.S: 1 error generated.

Number of similar (compiler,implementation) pairs: 10, namely:
CompilerImplementations
clang -march=native -O2 -fomit-frame-pointer -fwrapv -Qunused-arguments -fPIC -fPIE avr
clang -march=native -O3 -fomit-frame-pointer -fwrapv -Qunused-arguments -fPIC -fPIE avr
clang -march=native -O -fomit-frame-pointer -fwrapv -Qunused-arguments -fPIC -fPIE avr
clang -march=native -Os -fomit-frame-pointer -fwrapv -Qunused-arguments -fPIC -fPIE avr
clang -mcpu=native -O3 -fomit-frame-pointer -fwrapv -Qunused-arguments -fPIC -fPIE avr
clang -march=native -O2 -fomit-frame-pointer -fwrapv -Qunused-arguments -fPIC -fPIE avr_lowsize
clang -march=native -O3 -fomit-frame-pointer -fwrapv -Qunused-arguments -fPIC -fPIE avr_lowsize
clang -march=native -O -fomit-frame-pointer -fwrapv -Qunused-arguments -fPIC -fPIE avr_lowsize
clang -march=native -Os -fomit-frame-pointer -fwrapv -Qunused-arguments -fPIC -fPIE avr_lowsize
clang -mcpu=native -O3 -fomit-frame-pointer -fwrapv -Qunused-arguments -fPIC -fPIE avr_lowsize

Compiler output

Implementation: avr
Security model: constbranchindex
Compiler: gcc -march=native -mtune=native -O2 -fomit-frame-pointer -fwrapv -fPIC -fPIE
permutations.S: permutations.S:29:10: fatal error: avr/io.h: No such file or directory
permutations.S: 29 | #include "avr/io.h"
permutations.S: | ^~~~~~~~~~
permutations.S: compilation terminated.

Number of similar (compiler,implementation) pairs: 8, namely:
CompilerImplementations
gcc -march=native -mtune=native -O2 -fomit-frame-pointer -fwrapv -fPIC -fPIE avr
gcc -march=native -mtune=native -O3 -fomit-frame-pointer -fwrapv -fPIC -fPIE avr
gcc -march=native -mtune=native -O -fomit-frame-pointer -fwrapv -fPIC -fPIE avr
gcc -march=native -mtune=native -Os -fomit-frame-pointer -fwrapv -fPIC -fPIE avr
gcc -march=native -mtune=native -O2 -fomit-frame-pointer -fwrapv -fPIC -fPIE avr_lowsize
gcc -march=native -mtune=native -O3 -fomit-frame-pointer -fwrapv -fPIC -fPIE avr_lowsize
gcc -march=native -mtune=native -O -fomit-frame-pointer -fwrapv -fPIC -fPIE avr_lowsize
gcc -march=native -mtune=native -Os -fomit-frame-pointer -fwrapv -fPIC -fPIE avr_lowsize

Compiler output

Implementation: T:esp32
Security model: timingleaks
Compiler: clang -march=native -O2 -fomit-frame-pointer -fwrapv -Qunused-arguments -fPIC -fPIE
try.c: /usr/bin/ld: /tmp/try-small-794396.o: in function `doit':
try.c: try-small.c:(.text+0x...): undefined reference to `crypto_hash_asconxofav12_esp32_timingleaks'
try.c: /usr/bin/ld: /tmp/try-small-794396.o: in function `test':
try.c: try-small.c:(.text+0x...): undefined reference to `crypto_hash_asconxofav12_esp32_timingleaks'
try.c: /usr/bin/ld: try-small.c:(.text+0x...): undefined reference to `crypto_hash_asconxofav12_esp32_timingleaks'
try.c: /usr/bin/ld: try-small.c:(.text+0x...): undefined reference to `crypto_hash_asconxofav12_esp32_timingleaks'
try.c: clang: error: linker command failed with exit code 1 (use -v to see invocation)

Number of similar (compiler,implementation) pairs: 1, namely:
CompilerImplementations
clang -march=native -O2 -fomit-frame-pointer -fwrapv -Qunused-arguments -fPIC -fPIE T:esp32

Compiler output

Implementation: T:esp32
Security model: timingleaks
Compiler: clang -march=native -O3 -fomit-frame-pointer -fwrapv -Qunused-arguments -fPIC -fPIE
try.c: /usr/bin/ld: /tmp/try-small-787576.o: in function `doit':
try.c: try-small.c:(.text+0x...): undefined reference to `crypto_hash_asconxofav12_esp32_timingleaks'
try.c: /usr/bin/ld: /tmp/try-small-787576.o: in function `test':
try.c: try-small.c:(.text+0x...): undefined reference to `crypto_hash_asconxofav12_esp32_timingleaks'
try.c: /usr/bin/ld: try-small.c:(.text+0x...): undefined reference to `crypto_hash_asconxofav12_esp32_timingleaks'
try.c: /usr/bin/ld: try-small.c:(.text+0x...): undefined reference to `crypto_hash_asconxofav12_esp32_timingleaks'
try.c: clang: error: linker command failed with exit code 1 (use -v to see invocation)

Number of similar (compiler,implementation) pairs: 1, namely:
CompilerImplementations
clang -march=native -O3 -fomit-frame-pointer -fwrapv -Qunused-arguments -fPIC -fPIE T:esp32

Compiler output

Implementation: T:esp32
Security model: timingleaks
Compiler: clang -march=native -O -fomit-frame-pointer -fwrapv -Qunused-arguments -fPIC -fPIE
try.c: /usr/bin/ld: /tmp/try-small-830343.o: in function `doit':
try.c: try-small.c:(.text+0x...): undefined reference to `crypto_hash_asconxofav12_esp32_timingleaks'
try.c: /usr/bin/ld: /tmp/try-small-830343.o: in function `test':
try.c: try-small.c:(.text+0x...): undefined reference to `crypto_hash_asconxofav12_esp32_timingleaks'
try.c: /usr/bin/ld: try-small.c:(.text+0x...): undefined reference to `crypto_hash_asconxofav12_esp32_timingleaks'
try.c: /usr/bin/ld: try-small.c:(.text+0x...): undefined reference to `crypto_hash_asconxofav12_esp32_timingleaks'
try.c: clang: error: linker command failed with exit code 1 (use -v to see invocation)

Number of similar (compiler,implementation) pairs: 1, namely:
CompilerImplementations
clang -march=native -O -fomit-frame-pointer -fwrapv -Qunused-arguments -fPIC -fPIE T:esp32

Compiler output

Implementation: T:esp32
Security model: timingleaks
Compiler: clang -march=native -Os -fomit-frame-pointer -fwrapv -Qunused-arguments -fPIC -fPIE
try.c: /usr/bin/ld: /tmp/try-small-e82d96.o: in function `doit':
try.c: try-small.c:(.text+0x...): undefined reference to `crypto_hash_asconxofav12_esp32_timingleaks'
try.c: /usr/bin/ld: /tmp/try-small-e82d96.o: in function `test':
try.c: try-small.c:(.text+0x...): undefined reference to `crypto_hash_asconxofav12_esp32_timingleaks'
try.c: /usr/bin/ld: try-small.c:(.text+0x...): undefined reference to `crypto_hash_asconxofav12_esp32_timingleaks'
try.c: /usr/bin/ld: try-small.c:(.text+0x...): undefined reference to `crypto_hash_asconxofav12_esp32_timingleaks'
try.c: clang: error: linker command failed with exit code 1 (use -v to see invocation)

Number of similar (compiler,implementation) pairs: 1, namely:
CompilerImplementations
clang -march=native -Os -fomit-frame-pointer -fwrapv -Qunused-arguments -fPIC -fPIE T:esp32

Compiler output

Implementation: T:esp32
Security model: timingleaks
Compiler: clang -mcpu=native -O3 -fomit-frame-pointer -fwrapv -Qunused-arguments -fPIC -fPIE
try.c: /usr/bin/ld: /tmp/try-small-e79a09.o: in function `doit':
try.c: try-small.c:(.text+0x...): undefined reference to `crypto_hash_asconxofav12_esp32_timingleaks'
try.c: /usr/bin/ld: /tmp/try-small-e79a09.o: in function `test':
try.c: try-small.c:(.text+0x...): undefined reference to `crypto_hash_asconxofav12_esp32_timingleaks'
try.c: /usr/bin/ld: try-small.c:(.text+0x...): undefined reference to `crypto_hash_asconxofav12_esp32_timingleaks'
try.c: /usr/bin/ld: try-small.c:(.text+0x...): undefined reference to `crypto_hash_asconxofav12_esp32_timingleaks'
try.c: clang: error: linker command failed with exit code 1 (use -v to see invocation)

Number of similar (compiler,implementation) pairs: 1, namely:
CompilerImplementations
clang -mcpu=native -O3 -fomit-frame-pointer -fwrapv -Qunused-arguments -fPIC -fPIE T:esp32

Compiler output

Implementation: T:esp32
Security model: timingleaks
Compiler: gcc -march=native -mtune=native -O2 -fomit-frame-pointer -fwrapv -fPIC -fPIE
try.c: /usr/bin/ld: /tmp/ccqupNqR.o: in function `test':
try.c: try-small.c:(.text+0x...): undefined reference to `crypto_hash_asconxofav12_esp32_timingleaks'
try.c: /usr/bin/ld: try-small.c:(.text+0x...): undefined reference to `crypto_hash_asconxofav12_esp32_timingleaks'
try.c: /usr/bin/ld: try-small.c:(.text+0x...): undefined reference to `crypto_hash_asconxofav12_esp32_timingleaks'
try.c: /usr/bin/ld: /tmp/ccqupNqR.o: in function `doit':
try.c: try-small.c:(.text+0x...): undefined reference to `crypto_hash_asconxofav12_esp32_timingleaks'
try.c: collect2: error: ld returned 1 exit status

Number of similar (compiler,implementation) pairs: 1, namely:
CompilerImplementations
gcc -march=native -mtune=native -O2 -fomit-frame-pointer -fwrapv -fPIC -fPIE T:esp32

Compiler output

Implementation: T:esp32
Security model: timingleaks
Compiler: gcc -march=native -mtune=native -O3 -fomit-frame-pointer -fwrapv -fPIC -fPIE
try.c: /usr/bin/ld: /tmp/cczXfFu3.o: in function `test':
try.c: try-small.c:(.text+0x...): undefined reference to `crypto_hash_asconxofav12_esp32_timingleaks'
try.c: /usr/bin/ld: try-small.c:(.text+0x...): undefined reference to `crypto_hash_asconxofav12_esp32_timingleaks'
try.c: /usr/bin/ld: try-small.c:(.text+0x...): undefined reference to `crypto_hash_asconxofav12_esp32_timingleaks'
try.c: /usr/bin/ld: /tmp/cczXfFu3.o: in function `doit':
try.c: try-small.c:(.text+0x...): undefined reference to `crypto_hash_asconxofav12_esp32_timingleaks'
try.c: collect2: error: ld returned 1 exit status

Number of similar (compiler,implementation) pairs: 1, namely:
CompilerImplementations
gcc -march=native -mtune=native -O3 -fomit-frame-pointer -fwrapv -fPIC -fPIE T:esp32

Compiler output

Implementation: T:esp32
Security model: timingleaks
Compiler: gcc -march=native -mtune=native -O -fomit-frame-pointer -fwrapv -fPIC -fPIE
try.c: /usr/bin/ld: /tmp/ccZj1YQY.o: in function `doit':
try.c: try-small.c:(.text+0x...): undefined reference to `crypto_hash_asconxofav12_esp32_timingleaks'
try.c: /usr/bin/ld: /tmp/ccZj1YQY.o: in function `test':
try.c: try-small.c:(.text+0x...): undefined reference to `crypto_hash_asconxofav12_esp32_timingleaks'
try.c: /usr/bin/ld: try-small.c:(.text+0x...): undefined reference to `crypto_hash_asconxofav12_esp32_timingleaks'
try.c: /usr/bin/ld: try-small.c:(.text+0x...): undefined reference to `crypto_hash_asconxofav12_esp32_timingleaks'
try.c: collect2: error: ld returned 1 exit status

Number of similar (compiler,implementation) pairs: 1, namely:
CompilerImplementations
gcc -march=native -mtune=native -O -fomit-frame-pointer -fwrapv -fPIC -fPIE T:esp32

Compiler output

Implementation: T:esp32
Security model: timingleaks
Compiler: gcc -march=native -mtune=native -Os -fomit-frame-pointer -fwrapv -fPIC -fPIE
try.c: /usr/bin/ld: /tmp/ccc2mhc8.o: in function `test':
try.c: try-small.c:(.text+0x...): undefined reference to `crypto_hash_asconxofav12_esp32_timingleaks'
try.c: /usr/bin/ld: try-small.c:(.text+0x...): undefined reference to `crypto_hash_asconxofav12_esp32_timingleaks'
try.c: /usr/bin/ld: try-small.c:(.text+0x...): undefined reference to `crypto_hash_asconxofav12_esp32_timingleaks'
try.c: /usr/bin/ld: /tmp/ccc2mhc8.o: in function `doit':
try.c: try-small.c:(.text+0x...): undefined reference to `crypto_hash_asconxofav12_esp32_timingleaks'
try.c: collect2: error: ld returned 1 exit status

Number of similar (compiler,implementation) pairs: 1, namely:
CompilerImplementations
gcc -march=native -mtune=native -Os -fomit-frame-pointer -fwrapv -fPIC -fPIE T:esp32