Implementation notes: amd64, nucnuc, crypto_aead/morus1280128v1

Computer: nucnuc
Microarchitecture: amd64; Airmont (406c3)
Architecture: amd64
CPU ID: GenuineIntel-000406c3-bfebfbff
SUPERCOP version: 20240425
Operation: crypto_aead
Primitive: morus1280128v1
TimeObject sizeTest sizeImplementationCompilerBenchmark dateSUPERCOP version
1875313355 0 028440 812 1016T:sse2clang_-march=native_-O2_-fomit-frame-pointer_-fwrapv_-Qunused-arguments_-fPIC_-fPIE2024050220240425
1875313355 0 030088 812 1016T:sse2clang_-march=native_-O3_-fomit-frame-pointer_-fwrapv_-Qunused-arguments_-fPIC_-fPIE2024050220240425
1998712757 0 029024 812 1016T:sse2clang_-mcpu=native_-O3_-fomit-frame-pointer_-fwrapv_-Qunused-arguments_-fPIC_-fPIE2024050220240425
211988788 0 022222 804 1016T:sse2clang_-march=native_-Os_-fomit-frame-pointer_-fwrapv_-Qunused-arguments_-fPIC_-fPIE2024050220240425
2161310489 0 026184 780 1080T:sse2gcc_-march=native_-mtune=native_-O3_-fomit-frame-pointer_-fwrapv_-fPIC_-fPIE2024050220240425
2565311626 0 027304 780 1080T:refgcc_-march=native_-mtune=native_-O3_-fomit-frame-pointer_-fwrapv_-fPIC_-fPIE2024050220240425
2570914754 0 030456 780 1080T:ref64gcc_-march=native_-mtune=native_-O3_-fomit-frame-pointer_-fwrapv_-fPIC_-fPIE2024050220240425
406014392 0 019576 812 1016T:refclang_-march=native_-O2_-fomit-frame-pointer_-fwrapv_-Qunused-arguments_-fPIC_-fPIE2024050220240425
406014392 0 021224 812 1016T:refclang_-march=native_-O3_-fomit-frame-pointer_-fwrapv_-Qunused-arguments_-fPIC_-fPIE2024050220240425
417304509 0 020864 812 1016T:refclang_-mcpu=native_-O3_-fomit-frame-pointer_-fwrapv_-Qunused-arguments_-fPIC_-fPIE2024050220240425
422573940 0 018472 780 1080T:refgcc_-march=native_-mtune=native_-O2_-fomit-frame-pointer_-fwrapv_-fPIC_-fPIE2024050220240425
425255516 0 020064 780 1080T:ref64gcc_-march=native_-mtune=native_-O2_-fomit-frame-pointer_-fwrapv_-fPIC_-fPIE2024050220240425
425714009 0 017478 804 1016T:refclang_-march=native_-Os_-fomit-frame-pointer_-fwrapv_-Qunused-arguments_-fPIC_-fPIE2024050220240425
427303154 0 016083 756 1048T:refgcc_-march=native_-mtune=native_-Os_-fomit-frame-pointer_-fwrapv_-fPIC_-fPIE2024050220240425
431573917 0 017999 772 1080T:refgcc_-march=native_-mtune=native_-O_-fomit-frame-pointer_-fwrapv_-fPIC_-fPIE2024050220240425
437064990 0 017931 756 1048T:ref64gcc_-march=native_-mtune=native_-Os_-fomit-frame-pointer_-fwrapv_-fPIC_-fPIE2024050220240425
439236708 0 023552 812 1016T:ref64clang_-march=native_-O3_-fomit-frame-pointer_-fwrapv_-Qunused-arguments_-fPIC_-fPIE2024050220240425
439616747 0 023128 812 1016T:ref64clang_-mcpu=native_-O3_-fomit-frame-pointer_-fwrapv_-Qunused-arguments_-fPIC_-fPIE2024050220240425
439786708 0 021904 812 1016T:ref64clang_-march=native_-O2_-fomit-frame-pointer_-fwrapv_-Qunused-arguments_-fPIC_-fPIE2024050220240425
440385475 0 018958 804 1016T:ref64clang_-march=native_-Os_-fomit-frame-pointer_-fwrapv_-Qunused-arguments_-fPIC_-fPIE2024050220240425
454765443 0 019535 772 1080T:ref64gcc_-march=native_-mtune=native_-O_-fomit-frame-pointer_-fwrapv_-fPIC_-fPIE2024050220240425
465273692 0 017726 804 1016T:refclang_-march=native_-O_-fomit-frame-pointer_-fwrapv_-Qunused-arguments_-fPIC_-fPIE2024050220240425
468365756 0 019782 804 1016T:ref64clang_-march=native_-O_-fomit-frame-pointer_-fwrapv_-Qunused-arguments_-fPIC_-fPIE2024050220240425

Compiler output

Implementation: T:avx2
Security model: timingleaks
Compiler: clang -march=native -O2 -fomit-frame-pointer -fwrapv -Qunused-arguments -fPIC -fPIE
morus1280128v1avx2.c: morus1280128v1avx2.c:55:13: error: always_inline function '_mm256_xor_si256' requires target feature 'avx2', but would be inlined into function 'morus_stateupdate' that is compiled without support for 'avx2'
morus1280128v1avx2.c: state[0] = XOR256(state[0], state[3]);
morus1280128v1avx2.c: ^
morus1280128v1avx2.c: morus1280128v1avx2.c:25:27: note: expanded from macro 'XOR256'
morus1280128v1avx2.c: #define XOR256(x,y) _mm256_xor_si256((x),(y)) /*XOR256(x,y) = x ^ y, where x and y are two 256-bit word*/
morus1280128v1avx2.c: ^
morus1280128v1avx2.c: morus1280128v1avx2.c:55:13: error: AVX vector argument of type '__m256i' (vector of 4 'long long' values) without 'avx' enabled changes the ABI
morus1280128v1avx2.c: morus1280128v1avx2.c:25:27: note: expanded from macro 'XOR256'
morus1280128v1avx2.c: #define XOR256(x,y) _mm256_xor_si256((x),(y)) /*XOR256(x,y) = x ^ y, where x and y are two 256-bit word*/
morus1280128v1avx2.c: ^
morus1280128v1avx2.c: morus1280128v1avx2.c:56:30: error: always_inline function '_mm256_and_si256' requires target feature 'avx2', but would be inlined into function 'morus_stateupdate' that is compiled without support for 'avx2'
morus1280128v1avx2.c: state[0] = XOR256(state[0], AND256(state[1], state[2]));
morus1280128v1avx2.c: ^
morus1280128v1avx2.c: morus1280128v1avx2.c:26:27: note: expanded from macro 'AND256'
morus1280128v1avx2.c: #define AND256(x,y) _mm256_and_si256((x),(y)) /*AND(x,y) = x & y, where x and y are two 256-bit word*/
morus1280128v1avx2.c: ^
morus1280128v1avx2.c: morus1280128v1avx2.c:56:30: error: AVX vector argument of type '__m256i' (vector of 4 'long long' values) without 'avx' enabled changes the ABI
morus1280128v1avx2.c: morus1280128v1avx2.c:26:27: note: expanded from macro 'AND256'
morus1280128v1avx2.c: #define AND256(x,y) _mm256_and_si256((x),(y)) /*AND(x,y) = x & y, where x and y are two 256-bit word*/
morus1280128v1avx2.c: ^
morus1280128v1avx2.c: morus1280128v1avx2.c:56:13: error: always_inline function '_mm256_xor_si256' requires target feature 'avx2', but would be inlined into function 'morus_stateupdate' that is compiled without support for 'avx2'
morus1280128v1avx2.c: state[0] = XOR256(state[0], AND256(state[1], state[2]));
morus1280128v1avx2.c: ^
morus1280128v1avx2.c: morus1280128v1avx2.c:25:27: note: expanded from macro 'XOR256'
morus1280128v1avx2.c: #define XOR256(x,y) _mm256_xor_si256((x),(y)) /*XOR256(x,y) = x ^ y, where x and y are two 256-bit word*/
morus1280128v1avx2.c: ...

Number of similar (compiler,implementation) pairs: 5, namely:
CompilerImplementations
clang -march=native -O2 -fomit-frame-pointer -fwrapv -Qunused-arguments -fPIC -fPIE T:avx2
clang -march=native -O3 -fomit-frame-pointer -fwrapv -Qunused-arguments -fPIC -fPIE T:avx2
clang -march=native -O -fomit-frame-pointer -fwrapv -Qunused-arguments -fPIC -fPIE T:avx2
clang -march=native -Os -fomit-frame-pointer -fwrapv -Qunused-arguments -fPIC -fPIE T:avx2
clang -mcpu=native -O3 -fomit-frame-pointer -fwrapv -Qunused-arguments -fPIC -fPIE T:avx2

Compiler output

Implementation: T:avx2
Security model: timingleaks
Compiler: gcc -march=native -mtune=native -O2 -fomit-frame-pointer -fwrapv -fPIC -fPIE
morus1280128v1avx2.c: morus1280128v1avx2.c: In function 'morus_stateupdate':
morus1280128v1avx2.c: morus1280128v1avx2.c:53:6: note: the ABI for passing parameters with 32-byte alignment has changed in GCC 4.6
morus1280128v1avx2.c: 53 | void morus_stateupdate(__m256i msgblk, __m256i *state)
morus1280128v1avx2.c: | ^~~~~~~~~~~~~~~~~
morus1280128v1avx2.c: morus1280128v1avx2.c:55:11: warning: AVX vector return without AVX enabled changes the ABI [-Wpsabi]
morus1280128v1avx2.c: 55 | state[0] = XOR256(state[0], state[3]);
morus1280128v1avx2.c: | ^
morus1280128v1avx2.c: In file included from /usr/lib/gcc/x86_64-linux-gnu/10/include/immintrin.h:53,
morus1280128v1avx2.c: from morus1280128v1avx2.c:2:
morus1280128v1avx2.c: morus1280128v1avx2.c: In function 'morus_enc_aut_step':
morus1280128v1avx2.c: /usr/lib/gcc/x86_64-linux-gnu/10/include/avx2intrin.h:1068:1: error: inlining failed in call to 'always_inline' '_mm256_permute4x64_epi64': target specific option mismatch
morus1280128v1avx2.c: 1068 | _mm256_permute4x64_epi64 (__m256i __X, const int __M)
morus1280128v1avx2.c: | ^~~~~~~~~~~~~~~~~~~~~~~~
morus1280128v1avx2.c: morus1280128v1avx2.c:41:27: note: called from here
morus1280128v1avx2.c: 41 | #define ROTL256_64(x) _mm256_permute4x64_epi64((x), _MM_SHUFFLE(2,1,0,3)) /*Rotate x by 64-bit positions to the left*/
morus1280128v1avx2.c: | ^~~~~~~~~~~~~~~~~~~~~~~~~~~~~~~~~~~~~~~~~~~~~~~~~~~
morus1280128v1avx2.c: morus1280128v1avx2.c:204:13: note: in expansion of macro 'ROTL256_64'
morus1280128v1avx2.c: 204 | state[2] = ROTL256_64(state[2]);
morus1280128v1avx2.c: | ^~~~~~~~~~
morus1280128v1avx2.c: In file included from /usr/lib/gcc/x86_64-linux-gnu/10/include/immintrin.h:53,
morus1280128v1avx2.c: from morus1280128v1avx2.c:2:
morus1280128v1avx2.c: /usr/lib/gcc/x86_64-linux-gnu/10/include/avx2intrin.h:574:1: error: inlining failed in call to 'always_inline' '_mm256_or_si256': target specific option mismatch
morus1280128v1avx2.c: 574 | _mm256_or_si256 (__m256i __A, __m256i __B)
morus1280128v1avx2.c: | ^~~~~~~~~~~~~~~
morus1280128v1avx2.c: morus1280128v1avx2.c:28:27: note: called from here
morus1280128v1avx2.c: ...

Number of similar (compiler,implementation) pairs: 4, namely:
CompilerImplementations
gcc -march=native -mtune=native -O2 -fomit-frame-pointer -fwrapv -fPIC -fPIE T:avx2
gcc -march=native -mtune=native -O3 -fomit-frame-pointer -fwrapv -fPIC -fPIE T:avx2
gcc -march=native -mtune=native -O -fomit-frame-pointer -fwrapv -fPIC -fPIE T:avx2
gcc -march=native -mtune=native -Os -fomit-frame-pointer -fwrapv -fPIC -fPIE T:avx2

Compiler output

Implementation: T:sse2
Security model: timingleaks
Compiler: clang -march=native -O -fomit-frame-pointer -fwrapv -Qunused-arguments -fPIC -fPIE
try.c: /usr/bin/ld: libcrypto_aead_morus1280128v1.a(morus1280128v1sse2.o): in function `morus_initialization':
try.c: morus1280128v1sse2.c:(.text+0x...): undefined reference to `morus_stateupdate'
try.c: /usr/bin/ld: libcrypto_aead_morus1280128v1.a(morus1280128v1sse2.o): in function `morus_initialization_key_256':
try.c: morus1280128v1sse2.c:(.text+0x...): undefined reference to `morus_stateupdate'
try.c: /usr/bin/ld: libcrypto_aead_morus1280128v1.a(morus1280128v1sse2.o): in function `morus_tag_generation':
try.c: morus1280128v1sse2.c:(.text+0x...): undefined reference to `morus_stateupdate'
try.c: /usr/bin/ld: libcrypto_aead_morus1280128v1.a(morus1280128v1sse2.o): in function `morus_tag_verification':
try.c: morus1280128v1sse2.c:(.text+0x...): undefined reference to `morus_stateupdate'
try.c: /usr/bin/ld: libcrypto_aead_morus1280128v1.a(morus1280128v1sse2.o): in function `morus_enc_aut_partialblock':
try.c: morus1280128v1sse2.c:(.text+0x...): undefined reference to `morus_stateupdate'
try.c: /usr/bin/ld: libcrypto_aead_morus1280128v1.a(morus1280128v1sse2.o):morus1280128v1sse2.c:(.text+0x...): more undefined references to `morus_stateupdate' follow
try.c: /usr/bin/ld: libcrypto_aead_morus1280128v1.a(morus1280128v1sse2.o): in function `crypto_aead_morus1280128v1_sse2_timingleaks_encrypt':
try.c: morus1280128v1sse2.c:(.text+0x...): undefined reference to `morus_enc_aut_step'
try.c: /usr/bin/ld: morus1280128v1sse2.c:(.text+0x...): undefined reference to `morus_enc_aut_step'
try.c: /usr/bin/ld: libcrypto_aead_morus1280128v1.a(morus1280128v1sse2.o): in function `crypto_aead_morus1280128v1_sse2_timingleaks_decrypt':
try.c: morus1280128v1sse2.c:(.text+0x...): undefined reference to `morus_enc_aut_step'
try.c: /usr/bin/ld: morus1280128v1sse2.c:(.text+0x...): undefined reference to `morus_dec_aut_step'
try.c: clang: error: linker command failed with exit code 1 (use -v to see invocation)

Number of similar (compiler,implementation) pairs: 1, namely:
CompilerImplementations
clang -march=native -O -fomit-frame-pointer -fwrapv -Qunused-arguments -fPIC -fPIE T:sse2

Compiler output

Implementation: T:sse2
Security model: timingleaks
Compiler: gcc -march=native -mtune=native -O2 -fomit-frame-pointer -fwrapv -fPIC -fPIE
try.c: /usr/bin/ld: libcrypto_aead_morus1280128v1.a(morus1280128v1sse2.o): in function `morus_initialization':
try.c: morus1280128v1sse2.c:(.text+0x...): undefined reference to `morus_stateupdate'
try.c: /usr/bin/ld: libcrypto_aead_morus1280128v1.a(morus1280128v1sse2.o): in function `morus_initialization_key_256':
try.c: morus1280128v1sse2.c:(.text+0x...): undefined reference to `morus_stateupdate'
try.c: /usr/bin/ld: libcrypto_aead_morus1280128v1.a(morus1280128v1sse2.o): in function `morus_tag_generation':
try.c: morus1280128v1sse2.c:(.text+0x...): undefined reference to `morus_stateupdate'
try.c: /usr/bin/ld: libcrypto_aead_morus1280128v1.a(morus1280128v1sse2.o): in function `morus_tag_verification':
try.c: morus1280128v1sse2.c:(.text+0x...): undefined reference to `morus_stateupdate'
try.c: /usr/bin/ld: libcrypto_aead_morus1280128v1.a(morus1280128v1sse2.o): in function `morus_enc_aut_partialblock':
try.c: morus1280128v1sse2.c:(.text+0x...): undefined reference to `morus_stateupdate'
try.c: /usr/bin/ld: libcrypto_aead_morus1280128v1.a(morus1280128v1sse2.o):morus1280128v1sse2.c:(.text+0x...): more undefined references to `morus_stateupdate' follow
try.c: collect2: error: ld returned 1 exit status

Number of similar (compiler,implementation) pairs: 2, namely:
CompilerImplementations
gcc -march=native -mtune=native -O2 -fomit-frame-pointer -fwrapv -fPIC -fPIE T:sse2
gcc -march=native -mtune=native -O -fomit-frame-pointer -fwrapv -fPIC -fPIE T:sse2

Compiler output

Implementation: T:sse2
Security model: timingleaks
Compiler: gcc -march=native -mtune=native -Os -fomit-frame-pointer -fwrapv -fPIC -fPIE
try.c: /usr/bin/ld: libcrypto_aead_morus1280128v1.a(morus1280128v1sse2.o): in function `morus_initialization':
try.c: morus1280128v1sse2.c:(.text+0x...): undefined reference to `morus_stateupdate'
try.c: /usr/bin/ld: libcrypto_aead_morus1280128v1.a(morus1280128v1sse2.o): in function `morus_initialization_key_256':
try.c: morus1280128v1sse2.c:(.text+0x...): undefined reference to `morus_stateupdate'
try.c: /usr/bin/ld: libcrypto_aead_morus1280128v1.a(morus1280128v1sse2.o): in function `morus_tag_generation':
try.c: morus1280128v1sse2.c:(.text+0x...): undefined reference to `morus_stateupdate'
try.c: /usr/bin/ld: libcrypto_aead_morus1280128v1.a(morus1280128v1sse2.o): in function `morus_tag_verification':
try.c: morus1280128v1sse2.c:(.text+0x...): undefined reference to `morus_stateupdate'
try.c: /usr/bin/ld: libcrypto_aead_morus1280128v1.a(morus1280128v1sse2.o): in function `morus_enc_aut_partialblock':
try.c: morus1280128v1sse2.c:(.text+0x...): undefined reference to `morus_stateupdate'
try.c: /usr/bin/ld: libcrypto_aead_morus1280128v1.a(morus1280128v1sse2.o):morus1280128v1sse2.c:(.text+0x...): more undefined references to `morus_stateupdate' follow
try.c: /usr/bin/ld: libcrypto_aead_morus1280128v1.a(morus1280128v1sse2.o): in function `crypto_aead_morus1280128v1_sse2_timingleaks_encrypt':
try.c: morus1280128v1sse2.c:(.text+0x...): undefined reference to `morus_enc_aut_step'
try.c: /usr/bin/ld: morus1280128v1sse2.c:(.text+0x...): undefined reference to `morus_enc_aut_step'
try.c: /usr/bin/ld: libcrypto_aead_morus1280128v1.a(morus1280128v1sse2.o): in function `crypto_aead_morus1280128v1_sse2_timingleaks_decrypt':
try.c: morus1280128v1sse2.c:(.text+0x...): undefined reference to `morus_enc_aut_step'
try.c: /usr/bin/ld: morus1280128v1sse2.c:(.text+0x...): undefined reference to `morus_dec_aut_step'
try.c: collect2: error: ld returned 1 exit status

Number of similar (compiler,implementation) pairs: 1, namely:
CompilerImplementations
gcc -march=native -mtune=native -Os -fomit-frame-pointer -fwrapv -fPIC -fPIE T:sse2