Test results for amd64, meteor,tiny, crypto_hashblocks/sha512

[Page version: 20261022 14:58:23]

Measurements for amd64, meteor,tiny, crypto_hashblocks Test results for amd64, meteor,tiny, crypto_hashblocks Test results for crypto_hashblocks/sha512
Computer: meteor,tiny
Microarchitecture: amd64; Crestmont (a06a4-20)
Architecture: amd64
CPU ID: GenuineIntel-000a06a4-20-bfebfbff
SUPERCOP version: 20261018
Operation: crypto_hashblocks
Primitive: sha512
TimeObject sizeTest sizeImplementationCompilerBenchmark dateSUPERCOP version
67175341 0 026421 1248 1560avx2clang -march=native -Os -fwrapv -Qunused-arguments -fPIC -fPIE -gdwarf-4 -Wall2026071520260627
67235359 0 024778 1192 1560avx2gcc -march=native -mtune=native -Os -fwrapv -fPIC -fPIE -gdwarf-4 -Wall2026071520260627
67475356 0 029947 1256 1560avx2clang -march=native -O2 -fwrapv -Qunused-arguments -fPIC -fPIE -gdwarf-4 -Wall2026071520260627
67495356 0 028552 1256 1496avx2clang -mcpu=native -O3 -fwrapv -Qunused-arguments -fPIC -fPIE -gdwarf-4 -Wall2026071520260627
67595383 0 026086 1208 1592avx2gcc -march=native -mtune=native -O -fwrapv -fPIC -fPIE -gdwarf-4 -Wall2026071520260627
67715356 0 029867 1256 1560avx2clang -march=native -O3 -fwrapv -Qunused-arguments -fPIC -fPIE -gdwarf-4 -Wall2026071520260627
67755356 0 025880 1256 1496avx2clang -march=native -O -fwrapv -Qunused-arguments -fPIC -fPIE -gdwarf-4 -Wall2026071520260627
67765423 0 028767 1216 1592avx2gcc -march=native -mtune=native -O3 -fwrapv -fPIC -fPIE -gdwarf-4 -Wall2026071520260627
67825423 0 026423 1216 1592avx2gcc -march=native -mtune=native -O2 -fwrapv -fPIC -fPIE -gdwarf-4 -Wall2026071520260627
74615705 0 026099 1256 1496avxclang -march=native -O -fwrapv -Qunused-arguments -fPIC -fPIE -gdwarf-4 -Wall2026071520260627
75575675 0 026669 1248 1560avxclang -march=native -Os -fwrapv -Qunused-arguments -fPIC -fPIE -gdwarf-4 -Wall2026071520260627
75596019 0 030467 1256 1560avxclang -march=native -O3 -fwrapv -Qunused-arguments -fPIC -fPIE -gdwarf-4 -Wall2026071520260627
75636019 0 030547 1256 1560avxclang -march=native -O2 -fwrapv -Qunused-arguments -fPIC -fPIE -gdwarf-4 -Wall2026071520260627
75705710 0 029015 1216 1592avxgcc -march=native -mtune=native -O3 -fwrapv -fPIC -fPIE -gdwarf-4 -Wall2026071520260627
81725768 0 026671 1216 1592avxgcc -march=native -mtune=native -O2 -fwrapv -fPIC -fPIE -gdwarf-4 -Wall2026071520260627
86046351 0 026942 1208 1592avxgcc -march=native -mtune=native -O -fwrapv -fPIC -fPIE -gdwarf-4 -Wall2026071520260627
95686010 0 025325 1192 1560avxgcc -march=native -mtune=native -Os -fwrapv -fPIC -fPIE -gdwarf-4 -Wall2026071520260627
982016120 0 040659 1256 1560refclang -march=native -O2 -fwrapv -Qunused-arguments -fPIC -fPIE -gdwarf-4 -Wall2026071520260627
983616123 0 036504 1256 1496inplaceclang -march=native -O -fwrapv -Qunused-arguments -fPIC -fPIE -gdwarf-4 -Wall2026071520260627
983816123 0 040611 1256 1560inplaceclang -march=native -O3 -fwrapv -Qunused-arguments -fPIC -fPIE -gdwarf-4 -Wall2026071520260627
986416123 0 040659 1256 1560inplaceclang -march=native -O2 -fwrapv -Qunused-arguments -fPIC -fPIE -gdwarf-4 -Wall2026071520260627
986716120 0 036504 1256 1496refclang -march=native -O -fwrapv -Qunused-arguments -fPIC -fPIE -gdwarf-4 -Wall2026071520260627
988816120 0 040579 1256 1560refclang -march=native -O3 -fwrapv -Qunused-arguments -fPIC -fPIE -gdwarf-4 -Wall2026071520260627
990214931 0 038255 1216 1592refgcc -march=native -mtune=native -O3 -fwrapv -fPIC -fPIE -gdwarf-4 -Wall2026071520260627
996414906 0 038255 1216 1592inplacegcc -march=native -mtune=native -O3 -fwrapv -fPIC -fPIE -gdwarf-4 -Wall2026071520260627
100713304 0 026615 1216 1592wflipgcc -march=native -mtune=native -O3 -fwrapv -fPIC -fPIE -gdwarf-4 -Wall2026071520260627
103764504 0 029067 1256 1560compactclang -march=native -O2 -fwrapv -Qunused-arguments -fPIC -fPIE -gdwarf-4 -Wall2026071520260627
103784872 0 029371 1256 1560compactclang -march=native -O3 -fwrapv -Qunused-arguments -fPIC -fPIE -gdwarf-4 -Wall2026071520260627
104413793 0 028259 1256 1560wflipclang -march=native -O3 -fwrapv -Qunused-arguments -fPIC -fPIE -gdwarf-4 -Wall2026071520260627
104674283 0 025247 1216 1592compactgcc -march=native -mtune=native -O2 -fwrapv -fPIC -fPIE -gdwarf-4 -Wall2026071520260627
104993793 0 028339 1256 1560wflipclang -march=native -O2 -fwrapv -Qunused-arguments -fPIC -fPIE -gdwarf-4 -Wall2026071520260627
1050915124 0 036031 1216 1592refgcc -march=native -mtune=native -O2 -fwrapv -fPIC -fPIE -gdwarf-4 -Wall2026071520260627
105163376 0 024397 1248 1560wflipclang -march=native -Os -fwrapv -Qunused-arguments -fPIC -fPIE -gdwarf-4 -Wall2026071520260627
105214445 0 027815 1216 1592compactgcc -march=native -mtune=native -O3 -fwrapv -fPIC -fPIE -gdwarf-4 -Wall2026071520260627
105243446 0 023856 1256 1496wflipclang -march=native -O -fwrapv -Qunused-arguments -fPIC -fPIE -gdwarf-4 -Wall2026071520260627
1058215141 0 036063 1216 1592inplacegcc -march=native -mtune=native -O2 -fwrapv -fPIC -fPIE -gdwarf-4 -Wall2026071520260627
105994184 0 024616 1256 1496compactclang -march=native -O -fwrapv -Qunused-arguments -fPIC -fPIE -gdwarf-4 -Wall2026071520260627
1062616225 0 037253 1248 1560refclang -march=native -Os -fwrapv -Qunused-arguments -fPIC -fPIE -gdwarf-4 -Wall2026071520260627
1065216127 0 037157 1248 1560inplaceclang -march=native -Os -fwrapv -Qunused-arguments -fPIC -fPIE -gdwarf-4 -Wall2026071520260627
107734176 0 025245 1248 1560compactclang -march=native -Os -fwrapv -Qunused-arguments -fPIC -fPIE -gdwarf-4 -Wall2026071520260627
109183484 0 024367 1216 1592wflipgcc -march=native -mtune=native -O2 -fwrapv -fPIC -fPIE -gdwarf-4 -Wall2026071520260627
109435251 0 025822 1208 1592wflipgcc -march=native -mtune=native -O -fwrapv -fPIC -fPIE -gdwarf-4 -Wall2026071520260627
112844384 0 025070 1208 1592compactgcc -march=native -mtune=native -O -fwrapv -fPIC -fPIE -gdwarf-4 -Wall2026071520260627
114281994 0 026475 1256 1560compact4clang -march=native -O3 -fwrapv -Qunused-arguments -fPIC -fPIE -gdwarf-4 -Wall2026071520260627
114561588 0 024943 1216 1592compact4gcc -march=native -mtune=native -O3 -fwrapv -fPIC -fPIE -gdwarf-4 -Wall2026071520260627
1151515469 0 036126 1208 1592inplacegcc -march=native -mtune=native -O -fwrapv -fPIC -fPIE -gdwarf-4 -Wall2026071520260627
1155715448 0 036062 1208 1592refgcc -march=native -mtune=native -O -fwrapv -fPIC -fPIE -gdwarf-4 -Wall2026071520260627
115842436 0 026955 1256 1560compact4clang -march=native -O2 -fwrapv -Qunused-arguments -fPIC -fPIE -gdwarf-4 -Wall2026071520260627
117511533 0 022495 1216 1592compact4gcc -march=native -mtune=native -O2 -fwrapv -fPIC -fPIE -gdwarf-4 -Wall2026071520260627
119241307 0 022349 1248 1560compact4clang -march=native -Os -fwrapv -Qunused-arguments -fPIC -fPIE -gdwarf-4 -Wall2026071520260627
1220416593 0 039688 1256 1496inplaceclang -mcpu=native -O3 -fwrapv -Qunused-arguments -fPIC -fPIE -gdwarf-4 -Wall2026071520260627
1222416604 0 039688 1256 1496refclang -mcpu=native -O3 -fwrapv -Qunused-arguments -fPIC -fPIE -gdwarf-4 -Wall2026071520260627
123831227 0 021640 1256 1496compact4clang -march=native -O -fwrapv -Qunused-arguments -fPIC -fPIE -gdwarf-4 -Wall2026071520260627
128403842 0 026944 1256 1496wflipclang -mcpu=native -O3 -fwrapv -Qunused-arguments -fPIC -fPIE -gdwarf-4 -Wall2026071520260627
129664946 0 028088 1256 1496compactclang -mcpu=native -O3 -fwrapv -Qunused-arguments -fPIC -fPIE -gdwarf-4 -Wall2026071520260627
1321716275 0 035586 1192 1560inplacegcc -march=native -mtune=native -Os -fwrapv -fPIC -fPIE -gdwarf-4 -Wall2026071520260627
1329916288 0 035586 1192 1560refgcc -march=native -mtune=native -Os -fwrapv -fPIC -fPIE -gdwarf-4 -Wall2026071520260627
134044413 0 023762 1192 1560compactgcc -march=native -mtune=native -Os -fwrapv -fPIC -fPIE -gdwarf-4 -Wall2026071520260627
134973753 0 023066 1192 1560wflipgcc -march=native -mtune=native -Os -fwrapv -fPIC -fPIE -gdwarf-4 -Wall2026071520260627
135571981 0 025096 1256 1496compact4clang -mcpu=native -O3 -fwrapv -Qunused-arguments -fPIC -fPIE -gdwarf-4 -Wall2026071520260627
142861451 0 022110 1208 1592compact4gcc -march=native -mtune=native -O -fwrapv -fPIC -fPIE -gdwarf-4 -Wall2026071520260627
153371302 0 020642 1192 1560compact4gcc -march=native -mtune=native -Os -fwrapv -fPIC -fPIE -gdwarf-4 -Wall2026071520260627
161493759 0 028235 1256 1560compact2clang -march=native -O3 -fwrapv -Qunused-arguments -fPIC -fPIE -gdwarf-4 -Wall2026071520260627
172032529 0 027075 1256 1560compact2clang -march=native -O2 -fwrapv -Qunused-arguments -fPIC -fPIE -gdwarf-4 -Wall2026071520260627
177531955 0 026443 1256 1560compact3clang -march=native -O3 -fwrapv -Qunused-arguments -fPIC -fPIE -gdwarf-4 -Wall2026071520260627
180011574 0 026107 1256 1560compact3clang -march=native -O2 -fwrapv -Qunused-arguments -fPIC -fPIE -gdwarf-4 -Wall2026071520260627
182731294 0 021720 1256 1496compact3clang -march=native -O -fwrapv -Qunused-arguments -fPIC -fPIE -gdwarf-4 -Wall2026071520260627
183111825 0 022240 1256 1496compact2clang -march=native -O -fwrapv -Qunused-arguments -fPIC -fPIE -gdwarf-4 -Wall2026071520260627
184421322 0 022381 1248 1560compact3clang -march=native -Os -fwrapv -Qunused-arguments -fPIC -fPIE -gdwarf-4 -Wall2026071520260627
184781675 0 022639 1216 1592compact2gcc -march=native -mtune=native -O2 -fwrapv -fPIC -fPIE -gdwarf-4 -Wall2026071520260627
184871764 0 025143 1216 1592compact2gcc -march=native -mtune=native -O3 -fwrapv -fPIC -fPIE -gdwarf-4 -Wall2026071520260627
185871566 0 022527 1216 1592compact3gcc -march=native -mtune=native -O2 -fwrapv -fPIC -fPIE -gdwarf-4 -Wall2026071520260627
187191483 0 022549 1248 1560compact2clang -march=native -Os -fwrapv -Qunused-arguments -fPIC -fPIE -gdwarf-4 -Wall2026071520260627
191081681 0 025039 1216 1592compact3gcc -march=native -mtune=native -O3 -fwrapv -fPIC -fPIE -gdwarf-4 -Wall2026071520260627
191451611 0 022270 1208 1592compact3gcc -march=native -mtune=native -O -fwrapv -fPIC -fPIE -gdwarf-4 -Wall2026071520260627
196521784 0 022470 1208 1592compact2gcc -march=native -mtune=native -O -fwrapv -fPIC -fPIE -gdwarf-4 -Wall2026071520260627
203633271 0 026376 1256 1496compact2clang -mcpu=native -O3 -fwrapv -Qunused-arguments -fPIC -fPIE -gdwarf-4 -Wall2026071520260627
220441982 0 025096 1256 1496compact3clang -mcpu=native -O3 -fwrapv -Qunused-arguments -fPIC -fPIE -gdwarf-4 -Wall2026071520260627
222931432 0 020770 1192 1560compact3gcc -march=native -mtune=native -Os -fwrapv -fPIC -fPIE -gdwarf-4 -Wall2026071520260627
224861671 0 021002 1192 1560compact2gcc -march=native -mtune=native -Os -fwrapv -fPIC -fPIE -gdwarf-4 -Wall2026071520260627

Compiler output


inner.c: inner.c:88:14: error: always_inline function '_mm256_loadu_si256' requires target feature 'avx', but would be inlined into function 'crypto_hashblocks_sha512_avx_constbranchindex_inner' that is compiled without support for 'avx'
inner.c:    88 |         X0 = _mm256_loadu_si256((void *) (in+0));
inner.c:       |              ^
inner.c: inner.c:88:14: error: AVX vector return of type '__m256i' (vector of 4 'long long' values) without 'avx' enabled changes the ABI
inner.c: inner.c:89:37: error: always_inline function '_mm256_set_epi8' requires target feature 'avx', but would be inlined into function 'crypto_hashblocks_sha512_avx_constbranchindex_inner' that is compiled without support for 'avx'
inner.c:    89 |         X0 = _mm256_shuffle_epi8(X0,bigendian64);
inner.c:       |                                     ^
inner.c: inner.c:26:21: note: expanded from macro 'bigendian64'
inner.c:    26 | #define bigendian64 _mm256_set_epi8(8,9,10,11,12,13,14,15,0,1,2,3,4,5,6,7,8,9,10,11,12,13,14,15,0,1,2,3,4,5,6,7)
inner.c:       |                     ^
inner.c: inner.c:89:37: error: AVX vector return of type '__m256i' (vector of 4 'long long' values) without 'avx' enabled changes the ABI
inner.c: inner.c:26:21: note: expanded from macro 'bigendian64'
inner.c:    26 | #define bigendian64 _mm256_set_epi8(8,9,10,11,12,13,14,15,0,1,2,3,4,5,6,7,8,9,10,11,12,13,14,15,0,1,2,3,4,5,6,7)
inner.c:       |                     ^
inner.c: inner.c:89:14: error: always_inline function '_mm256_shuffle_epi8' requires target feature 'avx2', but would be inlined into function 'crypto_hashblocks_sha512_avx_constbranchindex_inner' that is compiled without support for 'avx2'
inner.c:    89 |         X0 = _mm256_shuffle_epi8(X0,bigendian64);
inner.c:       |              ^
inner.c: inner.c:89:14: error: AVX vector argument of type '__m256i' (vector of 4 'long long' values) without 'avx' enabled changes the ABI
inner.c: inner.c:90:14: error: always_inline function '_mm256_loadu_si256' requires target feature 'avx', but would be inlined into function 'crypto_hashblocks_sha512_avx_constbranchindex_inner' that is compiled without support for 'avx'
inner.c:    90 |         D0 = _mm256_loadu_si256((void *) &constants[0]);
inner.c:       |              ^
inner.c: inner.c:90:14: error: AVX vector return of type '__m256i' (vector of 4 'long long' values) without 'avx' enabled changes the ABI
inner.c: inner.c:91:14: error: always_inline function '_mm256_add_epi64' requires target feature 'avx2', but would be inlined into function 'crypto_hashblocks_sha512_avx_constbranchindex_inner' that is compiled without support for 'avx2'
inner.c:    91 |         D0 = _mm256_add_epi64(X0,D0);
inner.c:       |              ^
inner.c: ...

Number of similar (implementation,compiler) pairs: 1, namely:
ImplementationCompiler
avxclang -mcpu=native -O3 -fwrapv -Qunused-arguments -fPIC -fPIE -gdwarf-4 -Wall (Debian_Clang_19.1.7_(3+b1))

Compiler output


try.c: /usr/bin/ld: libcrypto_hashblocks_sha512.a(blocks.o): in function `crypto_hashblocks_sha512_dolbeau_intelavx2rorxasm_constbranchindex':
try.c: .../supercop-data/meteor,tiny/amd64/try/c/clang_-march=native_-O2_-fwrapv_-Qunused-arguments_-fPIC_-fPIE_-gdwarf-4_-Wall/constbranchindex/crypto_hashblocks/sha512/dolbeau/intelavx2rorxasm/work/blocks.c:45:(.text+0x...): undefined reference to `sha512_rorx'
try.c: clang: error: linker command failed with exit code 1 (use -v to see invocation)

Number of similar (implementation,compiler) pairs: 1, namely:
ImplementationCompiler
dolbeau/intelavx2rorxasmclang -march=native -O2 -fwrapv -Qunused-arguments -fPIC -fPIE -gdwarf-4 -Wall (Debian_Clang_19.1.7_(3+b1))

Compiler output


try.c: /usr/bin/ld: libcrypto_hashblocks_sha512.a(blocks.o): in function `crypto_hashblocks_sha512_dolbeau_intelavx2rorxasm_constbranchindex':
try.c: .../supercop-data/meteor,tiny/amd64/try/c/clang_-march=native_-O3_-fwrapv_-Qunused-arguments_-fPIC_-fPIE_-gdwarf-4_-Wall/constbranchindex/crypto_hashblocks/sha512/dolbeau/intelavx2rorxasm/work/blocks.c:45:(.text+0x...): undefined reference to `sha512_rorx'
try.c: clang: error: linker command failed with exit code 1 (use -v to see invocation)

Number of similar (implementation,compiler) pairs: 1, namely:
ImplementationCompiler
dolbeau/intelavx2rorxasmclang -march=native -O3 -fwrapv -Qunused-arguments -fPIC -fPIE -gdwarf-4 -Wall (Debian_Clang_19.1.7_(3+b1))

Compiler output


try.c: /usr/bin/ld: libcrypto_hashblocks_sha512.a(blocks.o): in function `crypto_hashblocks_sha512_dolbeau_intelavx2rorxasm_constbranchindex':
try.c: .../supercop-data/meteor,tiny/amd64/try/c/clang_-march=native_-O_-fwrapv_-Qunused-arguments_-fPIC_-fPIE_-gdwarf-4_-Wall/constbranchindex/crypto_hashblocks/sha512/dolbeau/intelavx2rorxasm/work/blocks.c:45:(.text+0x...): undefined reference to `sha512_rorx'
try.c: clang: error: linker command failed with exit code 1 (use -v to see invocation)

Number of similar (implementation,compiler) pairs: 1, namely:
ImplementationCompiler
dolbeau/intelavx2rorxasmclang -march=native -O -fwrapv -Qunused-arguments -fPIC -fPIE -gdwarf-4 -Wall (Debian_Clang_19.1.7_(3+b1))

Compiler output


try.c: /usr/bin/ld: libcrypto_hashblocks_sha512.a(blocks.o): in function `crypto_hashblocks_sha512_dolbeau_intelavx2rorxasm_constbranchindex':
try.c: .../supercop-data/meteor,tiny/amd64/try/c/clang_-march=native_-Os_-fwrapv_-Qunused-arguments_-fPIC_-fPIE_-gdwarf-4_-Wall/constbranchindex/crypto_hashblocks/sha512/dolbeau/intelavx2rorxasm/work/blocks.c:45:(.text+0x...): undefined reference to `sha512_rorx'
try.c: clang: error: linker command failed with exit code 1 (use -v to see invocation)

Number of similar (implementation,compiler) pairs: 1, namely:
ImplementationCompiler
dolbeau/intelavx2rorxasmclang -march=native -Os -fwrapv -Qunused-arguments -fPIC -fPIE -gdwarf-4 -Wall (Debian_Clang_19.1.7_(3+b1))

Compiler output


try.c: /usr/bin/ld: libcrypto_hashblocks_sha512.a(blocks.o): in function `crypto_hashblocks_sha512_dolbeau_intelavx2rorxasm_constbranchindex':
try.c: .../supercop-data/meteor,tiny/amd64/try/c/clang_-mcpu=native_-O3_-fwrapv_-Qunused-arguments_-fPIC_-fPIE_-gdwarf-4_-Wall/constbranchindex/crypto_hashblocks/sha512/dolbeau/intelavx2rorxasm/work/blocks.c:45:(.text+0x...): undefined reference to `sha512_rorx'
try.c: clang: error: linker command failed with exit code 1 (use -v to see invocation)

Number of similar (implementation,compiler) pairs: 1, namely:
ImplementationCompiler
dolbeau/intelavx2rorxasmclang -mcpu=native -O3 -fwrapv -Qunused-arguments -fPIC -fPIE -gdwarf-4 -Wall (Debian_Clang_19.1.7_(3+b1))

Compiler output


try.c: /usr/bin/ld: libcrypto_hashblocks_sha512.a(blocks.o): in function `crypto_hashblocks_sha512_dolbeau_intelavx2rorxasm_constbranchindex':
try.c: .../supercop-data/meteor,tiny/amd64/try/c/gcc_-march=native_-mtune=native_-O2_-fwrapv_-fPIC_-fPIE_-gdwarf-4_-Wall/constbranchindex/crypto_hashblocks/sha512/dolbeau/intelavx2rorxasm/work/blocks.c:45:(.text+0x...): undefined reference to `sha512_rorx'
try.c: collect2: error: ld returned 1 exit status

Number of similar (implementation,compiler) pairs: 1, namely:
ImplementationCompiler
dolbeau/intelavx2rorxasmgcc -march=native -mtune=native -O2 -fwrapv -fPIC -fPIE -gdwarf-4 -Wall (14.2.0)

Compiler output


try.c: /usr/bin/ld: libcrypto_hashblocks_sha512.a(blocks.o): in function `crypto_hashblocks_sha512_dolbeau_intelavx2rorxasm_constbranchindex':
try.c: .../supercop-data/meteor,tiny/amd64/try/c/gcc_-march=native_-mtune=native_-O3_-fwrapv_-fPIC_-fPIE_-gdwarf-4_-Wall/constbranchindex/crypto_hashblocks/sha512/dolbeau/intelavx2rorxasm/work/blocks.c:45:(.text+0x...): undefined reference to `sha512_rorx'
try.c: collect2: error: ld returned 1 exit status

Number of similar (implementation,compiler) pairs: 1, namely:
ImplementationCompiler
dolbeau/intelavx2rorxasmgcc -march=native -mtune=native -O3 -fwrapv -fPIC -fPIE -gdwarf-4 -Wall (14.2.0)

Compiler output


try.c: /usr/bin/ld: libcrypto_hashblocks_sha512.a(blocks.o): in function `crypto_hashblocks_sha512_dolbeau_intelavx2rorxasm_constbranchindex':
try.c: .../supercop-data/meteor,tiny/amd64/try/c/gcc_-march=native_-mtune=native_-O_-fwrapv_-fPIC_-fPIE_-gdwarf-4_-Wall/constbranchindex/crypto_hashblocks/sha512/dolbeau/intelavx2rorxasm/work/blocks.c:45:(.text+0x...): undefined reference to `sha512_rorx'
try.c: collect2: error: ld returned 1 exit status

Number of similar (implementation,compiler) pairs: 1, namely:
ImplementationCompiler
dolbeau/intelavx2rorxasmgcc -march=native -mtune=native -O -fwrapv -fPIC -fPIE -gdwarf-4 -Wall (14.2.0)

Compiler output


try.c: /usr/bin/ld: libcrypto_hashblocks_sha512.a(blocks.o): in function `crypto_hashblocks_sha512_dolbeau_intelavx2rorxasm_constbranchindex':
try.c: .../supercop-data/meteor,tiny/amd64/try/c/gcc_-march=native_-mtune=native_-Os_-fwrapv_-fPIC_-fPIE_-gdwarf-4_-Wall/constbranchindex/crypto_hashblocks/sha512/dolbeau/intelavx2rorxasm/work/blocks.c:45:(.text+0x...): undefined reference to `sha512_rorx'
try.c: collect2: error: ld returned 1 exit status

Number of similar (implementation,compiler) pairs: 1, namely:
ImplementationCompiler
dolbeau/intelavx2rorxasmgcc -march=native -mtune=native -Os -fwrapv -fPIC -fPIE -gdwarf-4 -Wall (14.2.0)

Compiler output


try.c: /usr/bin/ld: libcrypto_hashblocks_sha512.a(blocks.o): in function `crypto_hashblocks_sha512_dolbeau_intelavxasm_constbranchindex':
try.c: .../supercop-data/meteor,tiny/amd64/try/c/clang_-march=native_-O2_-fwrapv_-Qunused-arguments_-fPIC_-fPIE_-gdwarf-4_-Wall/constbranchindex/crypto_hashblocks/sha512/dolbeau/intelavxasm/work/blocks.c:45:(.text+0x...): undefined reference to `sha512_avx'
try.c: clang: error: linker command failed with exit code 1 (use -v to see invocation)

Number of similar (implementation,compiler) pairs: 1, namely:
ImplementationCompiler
dolbeau/intelavxasmclang -march=native -O2 -fwrapv -Qunused-arguments -fPIC -fPIE -gdwarf-4 -Wall (Debian_Clang_19.1.7_(3+b1))

Compiler output


try.c: /usr/bin/ld: libcrypto_hashblocks_sha512.a(blocks.o): in function `crypto_hashblocks_sha512_dolbeau_intelavxasm_constbranchindex':
try.c: .../supercop-data/meteor,tiny/amd64/try/c/clang_-march=native_-O3_-fwrapv_-Qunused-arguments_-fPIC_-fPIE_-gdwarf-4_-Wall/constbranchindex/crypto_hashblocks/sha512/dolbeau/intelavxasm/work/blocks.c:45:(.text+0x...): undefined reference to `sha512_avx'
try.c: clang: error: linker command failed with exit code 1 (use -v to see invocation)

Number of similar (implementation,compiler) pairs: 1, namely:
ImplementationCompiler
dolbeau/intelavxasmclang -march=native -O3 -fwrapv -Qunused-arguments -fPIC -fPIE -gdwarf-4 -Wall (Debian_Clang_19.1.7_(3+b1))

Compiler output


try.c: /usr/bin/ld: libcrypto_hashblocks_sha512.a(blocks.o): in function `crypto_hashblocks_sha512_dolbeau_intelavxasm_constbranchindex':
try.c: .../supercop-data/meteor,tiny/amd64/try/c/clang_-march=native_-O_-fwrapv_-Qunused-arguments_-fPIC_-fPIE_-gdwarf-4_-Wall/constbranchindex/crypto_hashblocks/sha512/dolbeau/intelavxasm/work/blocks.c:45:(.text+0x...): undefined reference to `sha512_avx'
try.c: clang: error: linker command failed with exit code 1 (use -v to see invocation)

Number of similar (implementation,compiler) pairs: 1, namely:
ImplementationCompiler
dolbeau/intelavxasmclang -march=native -O -fwrapv -Qunused-arguments -fPIC -fPIE -gdwarf-4 -Wall (Debian_Clang_19.1.7_(3+b1))

Compiler output


try.c: /usr/bin/ld: libcrypto_hashblocks_sha512.a(blocks.o): in function `crypto_hashblocks_sha512_dolbeau_intelavxasm_constbranchindex':
try.c: .../supercop-data/meteor,tiny/amd64/try/c/clang_-march=native_-Os_-fwrapv_-Qunused-arguments_-fPIC_-fPIE_-gdwarf-4_-Wall/constbranchindex/crypto_hashblocks/sha512/dolbeau/intelavxasm/work/blocks.c:45:(.text+0x...): undefined reference to `sha512_avx'
try.c: clang: error: linker command failed with exit code 1 (use -v to see invocation)

Number of similar (implementation,compiler) pairs: 1, namely:
ImplementationCompiler
dolbeau/intelavxasmclang -march=native -Os -fwrapv -Qunused-arguments -fPIC -fPIE -gdwarf-4 -Wall (Debian_Clang_19.1.7_(3+b1))

Compiler output


try.c: /usr/bin/ld: libcrypto_hashblocks_sha512.a(blocks.o): in function `crypto_hashblocks_sha512_dolbeau_intelavxasm_constbranchindex':
try.c: .../supercop-data/meteor,tiny/amd64/try/c/clang_-mcpu=native_-O3_-fwrapv_-Qunused-arguments_-fPIC_-fPIE_-gdwarf-4_-Wall/constbranchindex/crypto_hashblocks/sha512/dolbeau/intelavxasm/work/blocks.c:45:(.text+0x...): undefined reference to `sha512_avx'
try.c: clang: error: linker command failed with exit code 1 (use -v to see invocation)

Number of similar (implementation,compiler) pairs: 1, namely:
ImplementationCompiler
dolbeau/intelavxasmclang -mcpu=native -O3 -fwrapv -Qunused-arguments -fPIC -fPIE -gdwarf-4 -Wall (Debian_Clang_19.1.7_(3+b1))

Compiler output


try.c: /usr/bin/ld: libcrypto_hashblocks_sha512.a(blocks.o): in function `crypto_hashblocks_sha512_dolbeau_intelavxasm_constbranchindex':
try.c: .../supercop-data/meteor,tiny/amd64/try/c/gcc_-march=native_-mtune=native_-O2_-fwrapv_-fPIC_-fPIE_-gdwarf-4_-Wall/constbranchindex/crypto_hashblocks/sha512/dolbeau/intelavxasm/work/blocks.c:45:(.text+0x...): undefined reference to `sha512_avx'
try.c: collect2: error: ld returned 1 exit status

Number of similar (implementation,compiler) pairs: 1, namely:
ImplementationCompiler
dolbeau/intelavxasmgcc -march=native -mtune=native -O2 -fwrapv -fPIC -fPIE -gdwarf-4 -Wall (14.2.0)

Compiler output


try.c: /usr/bin/ld: libcrypto_hashblocks_sha512.a(blocks.o): in function `crypto_hashblocks_sha512_dolbeau_intelavxasm_constbranchindex':
try.c: .../supercop-data/meteor,tiny/amd64/try/c/gcc_-march=native_-mtune=native_-O3_-fwrapv_-fPIC_-fPIE_-gdwarf-4_-Wall/constbranchindex/crypto_hashblocks/sha512/dolbeau/intelavxasm/work/blocks.c:45:(.text+0x...): undefined reference to `sha512_avx'
try.c: collect2: error: ld returned 1 exit status

Number of similar (implementation,compiler) pairs: 1, namely:
ImplementationCompiler
dolbeau/intelavxasmgcc -march=native -mtune=native -O3 -fwrapv -fPIC -fPIE -gdwarf-4 -Wall (14.2.0)

Compiler output


try.c: /usr/bin/ld: libcrypto_hashblocks_sha512.a(blocks.o): in function `crypto_hashblocks_sha512_dolbeau_intelavxasm_constbranchindex':
try.c: .../supercop-data/meteor,tiny/amd64/try/c/gcc_-march=native_-mtune=native_-O_-fwrapv_-fPIC_-fPIE_-gdwarf-4_-Wall/constbranchindex/crypto_hashblocks/sha512/dolbeau/intelavxasm/work/blocks.c:45:(.text+0x...): undefined reference to `sha512_avx'
try.c: collect2: error: ld returned 1 exit status

Number of similar (implementation,compiler) pairs: 1, namely:
ImplementationCompiler
dolbeau/intelavxasmgcc -march=native -mtune=native -O -fwrapv -fPIC -fPIE -gdwarf-4 -Wall (14.2.0)

Compiler output


try.c: /usr/bin/ld: libcrypto_hashblocks_sha512.a(blocks.o): in function `crypto_hashblocks_sha512_dolbeau_intelavxasm_constbranchindex':
try.c: .../supercop-data/meteor,tiny/amd64/try/c/gcc_-march=native_-mtune=native_-Os_-fwrapv_-fPIC_-fPIE_-gdwarf-4_-Wall/constbranchindex/crypto_hashblocks/sha512/dolbeau/intelavxasm/work/blocks.c:45:(.text+0x...): undefined reference to `sha512_avx'
try.c: collect2: error: ld returned 1 exit status

Number of similar (implementation,compiler) pairs: 1, namely:
ImplementationCompiler
dolbeau/intelavxasmgcc -march=native -mtune=native -Os -fwrapv -fPIC -fPIE -gdwarf-4 -Wall (14.2.0)

Compiler output


try.c: /usr/bin/ld: libcrypto_hashblocks_sha512.a(blocks.o): in function `crypto_hashblocks_sha512_dolbeau_intelsse4asm_constbranchindex':
try.c: .../supercop-data/meteor,tiny/amd64/try/c/clang_-march=native_-O2_-fwrapv_-Qunused-arguments_-fPIC_-fPIE_-gdwarf-4_-Wall/constbranchindex/crypto_hashblocks/sha512/dolbeau/intelsse4asm/work/blocks.c:45:(.text+0x...): undefined reference to `sha512_sse4'
try.c: clang: error: linker command failed with exit code 1 (use -v to see invocation)

Number of similar (implementation,compiler) pairs: 1, namely:
ImplementationCompiler
dolbeau/intelsse4asmclang -march=native -O2 -fwrapv -Qunused-arguments -fPIC -fPIE -gdwarf-4 -Wall (Debian_Clang_19.1.7_(3+b1))

Compiler output


try.c: /usr/bin/ld: libcrypto_hashblocks_sha512.a(blocks.o): in function `crypto_hashblocks_sha512_dolbeau_intelsse4asm_constbranchindex':
try.c: .../supercop-data/meteor,tiny/amd64/try/c/clang_-march=native_-O3_-fwrapv_-Qunused-arguments_-fPIC_-fPIE_-gdwarf-4_-Wall/constbranchindex/crypto_hashblocks/sha512/dolbeau/intelsse4asm/work/blocks.c:45:(.text+0x...): undefined reference to `sha512_sse4'
try.c: clang: error: linker command failed with exit code 1 (use -v to see invocation)

Number of similar (implementation,compiler) pairs: 1, namely:
ImplementationCompiler
dolbeau/intelsse4asmclang -march=native -O3 -fwrapv -Qunused-arguments -fPIC -fPIE -gdwarf-4 -Wall (Debian_Clang_19.1.7_(3+b1))

Compiler output


try.c: /usr/bin/ld: libcrypto_hashblocks_sha512.a(blocks.o): in function `crypto_hashblocks_sha512_dolbeau_intelsse4asm_constbranchindex':
try.c: .../supercop-data/meteor,tiny/amd64/try/c/clang_-march=native_-O_-fwrapv_-Qunused-arguments_-fPIC_-fPIE_-gdwarf-4_-Wall/constbranchindex/crypto_hashblocks/sha512/dolbeau/intelsse4asm/work/blocks.c:45:(.text+0x...): undefined reference to `sha512_sse4'
try.c: clang: error: linker command failed with exit code 1 (use -v to see invocation)

Number of similar (implementation,compiler) pairs: 1, namely:
ImplementationCompiler
dolbeau/intelsse4asmclang -march=native -O -fwrapv -Qunused-arguments -fPIC -fPIE -gdwarf-4 -Wall (Debian_Clang_19.1.7_(3+b1))

Compiler output


try.c: /usr/bin/ld: libcrypto_hashblocks_sha512.a(blocks.o): in function `crypto_hashblocks_sha512_dolbeau_intelsse4asm_constbranchindex':
try.c: .../supercop-data/meteor,tiny/amd64/try/c/clang_-march=native_-Os_-fwrapv_-Qunused-arguments_-fPIC_-fPIE_-gdwarf-4_-Wall/constbranchindex/crypto_hashblocks/sha512/dolbeau/intelsse4asm/work/blocks.c:45:(.text+0x...): undefined reference to `sha512_sse4'
try.c: clang: error: linker command failed with exit code 1 (use -v to see invocation)

Number of similar (implementation,compiler) pairs: 1, namely:
ImplementationCompiler
dolbeau/intelsse4asmclang -march=native -Os -fwrapv -Qunused-arguments -fPIC -fPIE -gdwarf-4 -Wall (Debian_Clang_19.1.7_(3+b1))

Compiler output


try.c: /usr/bin/ld: libcrypto_hashblocks_sha512.a(blocks.o): in function `crypto_hashblocks_sha512_dolbeau_intelsse4asm_constbranchindex':
try.c: .../supercop-data/meteor,tiny/amd64/try/c/clang_-mcpu=native_-O3_-fwrapv_-Qunused-arguments_-fPIC_-fPIE_-gdwarf-4_-Wall/constbranchindex/crypto_hashblocks/sha512/dolbeau/intelsse4asm/work/blocks.c:45:(.text+0x...): undefined reference to `sha512_sse4'
try.c: clang: error: linker command failed with exit code 1 (use -v to see invocation)

Number of similar (implementation,compiler) pairs: 1, namely:
ImplementationCompiler
dolbeau/intelsse4asmclang -mcpu=native -O3 -fwrapv -Qunused-arguments -fPIC -fPIE -gdwarf-4 -Wall (Debian_Clang_19.1.7_(3+b1))

Compiler output


try.c: /usr/bin/ld: libcrypto_hashblocks_sha512.a(blocks.o): in function `crypto_hashblocks_sha512_dolbeau_intelsse4asm_constbranchindex':
try.c: .../supercop-data/meteor,tiny/amd64/try/c/gcc_-march=native_-mtune=native_-O2_-fwrapv_-fPIC_-fPIE_-gdwarf-4_-Wall/constbranchindex/crypto_hashblocks/sha512/dolbeau/intelsse4asm/work/blocks.c:45:(.text+0x...): undefined reference to `sha512_sse4'
try.c: collect2: error: ld returned 1 exit status

Number of similar (implementation,compiler) pairs: 1, namely:
ImplementationCompiler
dolbeau/intelsse4asmgcc -march=native -mtune=native -O2 -fwrapv -fPIC -fPIE -gdwarf-4 -Wall (14.2.0)

Compiler output


try.c: /usr/bin/ld: libcrypto_hashblocks_sha512.a(blocks.o): in function `crypto_hashblocks_sha512_dolbeau_intelsse4asm_constbranchindex':
try.c: .../supercop-data/meteor,tiny/amd64/try/c/gcc_-march=native_-mtune=native_-O3_-fwrapv_-fPIC_-fPIE_-gdwarf-4_-Wall/constbranchindex/crypto_hashblocks/sha512/dolbeau/intelsse4asm/work/blocks.c:45:(.text+0x...): undefined reference to `sha512_sse4'
try.c: collect2: error: ld returned 1 exit status

Number of similar (implementation,compiler) pairs: 1, namely:
ImplementationCompiler
dolbeau/intelsse4asmgcc -march=native -mtune=native -O3 -fwrapv -fPIC -fPIE -gdwarf-4 -Wall (14.2.0)

Compiler output


try.c: /usr/bin/ld: libcrypto_hashblocks_sha512.a(blocks.o): in function `crypto_hashblocks_sha512_dolbeau_intelsse4asm_constbranchindex':
try.c: .../supercop-data/meteor,tiny/amd64/try/c/gcc_-march=native_-mtune=native_-O_-fwrapv_-fPIC_-fPIE_-gdwarf-4_-Wall/constbranchindex/crypto_hashblocks/sha512/dolbeau/intelsse4asm/work/blocks.c:45:(.text+0x...): undefined reference to `sha512_sse4'
try.c: collect2: error: ld returned 1 exit status

Number of similar (implementation,compiler) pairs: 1, namely:
ImplementationCompiler
dolbeau/intelsse4asmgcc -march=native -mtune=native -O -fwrapv -fPIC -fPIE -gdwarf-4 -Wall (14.2.0)

Compiler output


try.c: /usr/bin/ld: libcrypto_hashblocks_sha512.a(blocks.o): in function `crypto_hashblocks_sha512_dolbeau_intelsse4asm_constbranchindex':
try.c: .../supercop-data/meteor,tiny/amd64/try/c/gcc_-march=native_-mtune=native_-Os_-fwrapv_-fPIC_-fPIE_-gdwarf-4_-Wall/constbranchindex/crypto_hashblocks/sha512/dolbeau/intelsse4asm/work/blocks.c:45:(.text+0x...): undefined reference to `sha512_sse4'
try.c: collect2: error: ld returned 1 exit status

Number of similar (implementation,compiler) pairs: 1, namely:
ImplementationCompiler
dolbeau/intelsse4asmgcc -march=native -mtune=native -Os -fwrapv -fPIC -fPIE -gdwarf-4 -Wall (14.2.0)

TIMECOP error (can be valgrind bug)


error 132

Process terminating with default action of signal 4 (SIGILL)
 Illegal opcode at address 0x10B497
   at 0x...: main (try-anything.c:362)
Illegal instruction

Number of similar (implementation,compiler) pairs: 8, namely:
ImplementationCompiler
avxclang -march=native -O2 -fwrapv -Qunused-arguments -fPIC -fPIE -gdwarf-4 -Wall (Debian_Clang_19.1.7_(3+b1))
compactclang -march=native -O2 -fwrapv -Qunused-arguments -fPIC -fPIE -gdwarf-4 -Wall (Debian_Clang_19.1.7_(3+b1))
compact2clang -march=native -O2 -fwrapv -Qunused-arguments -fPIC -fPIE -gdwarf-4 -Wall (Debian_Clang_19.1.7_(3+b1))
compact3clang -march=native -O2 -fwrapv -Qunused-arguments -fPIC -fPIE -gdwarf-4 -Wall (Debian_Clang_19.1.7_(3+b1))
compact4clang -march=native -O2 -fwrapv -Qunused-arguments -fPIC -fPIE -gdwarf-4 -Wall (Debian_Clang_19.1.7_(3+b1))
inplaceclang -march=native -O2 -fwrapv -Qunused-arguments -fPIC -fPIE -gdwarf-4 -Wall (Debian_Clang_19.1.7_(3+b1))
refclang -march=native -O2 -fwrapv -Qunused-arguments -fPIC -fPIE -gdwarf-4 -Wall (Debian_Clang_19.1.7_(3+b1))
wflipclang -march=native -O2 -fwrapv -Qunused-arguments -fPIC -fPIE -gdwarf-4 -Wall (Debian_Clang_19.1.7_(3+b1))

TIMECOP error (can be valgrind bug)


error 132

Process terminating with default action of signal 4 (SIGILL)
 Illegal opcode at address 0x10B4A7
   at 0x...: main (try-anything.c:362)
Illegal instruction

Number of similar (implementation,compiler) pairs: 8, namely:
ImplementationCompiler
avxclang -march=native -O3 -fwrapv -Qunused-arguments -fPIC -fPIE -gdwarf-4 -Wall (Debian_Clang_19.1.7_(3+b1))
compactclang -march=native -O3 -fwrapv -Qunused-arguments -fPIC -fPIE -gdwarf-4 -Wall (Debian_Clang_19.1.7_(3+b1))
compact2clang -march=native -O3 -fwrapv -Qunused-arguments -fPIC -fPIE -gdwarf-4 -Wall (Debian_Clang_19.1.7_(3+b1))
compact3clang -march=native -O3 -fwrapv -Qunused-arguments -fPIC -fPIE -gdwarf-4 -Wall (Debian_Clang_19.1.7_(3+b1))
compact4clang -march=native -O3 -fwrapv -Qunused-arguments -fPIC -fPIE -gdwarf-4 -Wall (Debian_Clang_19.1.7_(3+b1))
inplaceclang -march=native -O3 -fwrapv -Qunused-arguments -fPIC -fPIE -gdwarf-4 -Wall (Debian_Clang_19.1.7_(3+b1))
refclang -march=native -O3 -fwrapv -Qunused-arguments -fPIC -fPIE -gdwarf-4 -Wall (Debian_Clang_19.1.7_(3+b1))
wflipclang -march=native -O3 -fwrapv -Qunused-arguments -fPIC -fPIE -gdwarf-4 -Wall (Debian_Clang_19.1.7_(3+b1))

TIMECOP error (can be valgrind bug)


error 132

Process terminating with default action of signal 4 (SIGILL)
 Illegal opcode at address 0x10ADDF
   at 0x...: main (try-anything.c:362)
Illegal instruction

Number of similar (implementation,compiler) pairs: 8, namely:
ImplementationCompiler
avxclang -march=native -Os -fwrapv -Qunused-arguments -fPIC -fPIE -gdwarf-4 -Wall (Debian_Clang_19.1.7_(3+b1))
compactclang -march=native -Os -fwrapv -Qunused-arguments -fPIC -fPIE -gdwarf-4 -Wall (Debian_Clang_19.1.7_(3+b1))
compact2clang -march=native -Os -fwrapv -Qunused-arguments -fPIC -fPIE -gdwarf-4 -Wall (Debian_Clang_19.1.7_(3+b1))
compact3clang -march=native -Os -fwrapv -Qunused-arguments -fPIC -fPIE -gdwarf-4 -Wall (Debian_Clang_19.1.7_(3+b1))
compact4clang -march=native -Os -fwrapv -Qunused-arguments -fPIC -fPIE -gdwarf-4 -Wall (Debian_Clang_19.1.7_(3+b1))
inplaceclang -march=native -Os -fwrapv -Qunused-arguments -fPIC -fPIE -gdwarf-4 -Wall (Debian_Clang_19.1.7_(3+b1))
refclang -march=native -Os -fwrapv -Qunused-arguments -fPIC -fPIE -gdwarf-4 -Wall (Debian_Clang_19.1.7_(3+b1))
wflipclang -march=native -Os -fwrapv -Qunused-arguments -fPIC -fPIE -gdwarf-4 -Wall (Debian_Clang_19.1.7_(3+b1))

TIMECOP error (can be valgrind bug)


error 132

Process terminating with default action of signal 4 (SIGILL)
 Illegal opcode at address 0x10B4F7
   at 0x...: main (try-anything.c:362)
Illegal instruction

Number of similar (implementation,compiler) pairs: 1, namely:
ImplementationCompiler
avx2clang -march=native -O2 -fwrapv -Qunused-arguments -fPIC -fPIE -gdwarf-4 -Wall (Debian_Clang_19.1.7_(3+b1))

TIMECOP error (can be valgrind bug)


error 132

Process terminating with default action of signal 4 (SIGILL)
 Illegal opcode at address 0x10B507
   at 0x...: main (try-anything.c:362)
Illegal instruction

Number of similar (implementation,compiler) pairs: 1, namely:
ImplementationCompiler
avx2clang -march=native -O3 -fwrapv -Qunused-arguments -fPIC -fPIE -gdwarf-4 -Wall (Debian_Clang_19.1.7_(3+b1))

TIMECOP error (can be valgrind bug)


error 132

Process terminating with default action of signal 4 (SIGILL)
 Illegal opcode at address 0x10AE3F
   at 0x...: main (try-anything.c:362)
Illegal instruction

Number of similar (implementation,compiler) pairs: 1, namely:
ImplementationCompiler
avx2clang -march=native -Os -fwrapv -Qunused-arguments -fPIC -fPIE -gdwarf-4 -Wall (Debian_Clang_19.1.7_(3+b1))

Passed TIMECOP


TIMECOP iterations: 10

Number of similar (implementation,compiler) pairs: 53, namely:
ImplementationCompiler
avxclang -march=native -O -fwrapv -Qunused-arguments -fPIC -fPIE -gdwarf-4 -Wall (Debian_Clang_19.1.7_(3+b1))
avxgcc -march=native -mtune=native -O2 -fwrapv -fPIC -fPIE -gdwarf-4 -Wall (14.2.0)
avxgcc -march=native -mtune=native -O3 -fwrapv -fPIC -fPIE -gdwarf-4 -Wall (14.2.0)
avxgcc -march=native -mtune=native -O -fwrapv -fPIC -fPIE -gdwarf-4 -Wall (14.2.0)
avxgcc -march=native -mtune=native -Os -fwrapv -fPIC -fPIE -gdwarf-4 -Wall (14.2.0)
avx2clang -march=native -O -fwrapv -Qunused-arguments -fPIC -fPIE -gdwarf-4 -Wall (Debian_Clang_19.1.7_(3+b1))
avx2clang -mcpu=native -O3 -fwrapv -Qunused-arguments -fPIC -fPIE -gdwarf-4 -Wall (Debian_Clang_19.1.7_(3+b1))
avx2gcc -march=native -mtune=native -O2 -fwrapv -fPIC -fPIE -gdwarf-4 -Wall (14.2.0)
avx2gcc -march=native -mtune=native -O3 -fwrapv -fPIC -fPIE -gdwarf-4 -Wall (14.2.0)
avx2gcc -march=native -mtune=native -O -fwrapv -fPIC -fPIE -gdwarf-4 -Wall (14.2.0)
avx2gcc -march=native -mtune=native -Os -fwrapv -fPIC -fPIE -gdwarf-4 -Wall (14.2.0)
compactclang -march=native -O -fwrapv -Qunused-arguments -fPIC -fPIE -gdwarf-4 -Wall (Debian_Clang_19.1.7_(3+b1))
compactclang -mcpu=native -O3 -fwrapv -Qunused-arguments -fPIC -fPIE -gdwarf-4 -Wall (Debian_Clang_19.1.7_(3+b1))
compactgcc -march=native -mtune=native -O2 -fwrapv -fPIC -fPIE -gdwarf-4 -Wall (14.2.0)
compactgcc -march=native -mtune=native -O3 -fwrapv -fPIC -fPIE -gdwarf-4 -Wall (14.2.0)
compactgcc -march=native -mtune=native -O -fwrapv -fPIC -fPIE -gdwarf-4 -Wall (14.2.0)
compactgcc -march=native -mtune=native -Os -fwrapv -fPIC -fPIE -gdwarf-4 -Wall (14.2.0)
compact2clang -march=native -O -fwrapv -Qunused-arguments -fPIC -fPIE -gdwarf-4 -Wall (Debian_Clang_19.1.7_(3+b1))
compact2clang -mcpu=native -O3 -fwrapv -Qunused-arguments -fPIC -fPIE -gdwarf-4 -Wall (Debian_Clang_19.1.7_(3+b1))
compact2gcc -march=native -mtune=native -O2 -fwrapv -fPIC -fPIE -gdwarf-4 -Wall (14.2.0)
compact2gcc -march=native -mtune=native -O3 -fwrapv -fPIC -fPIE -gdwarf-4 -Wall (14.2.0)
compact2gcc -march=native -mtune=native -O -fwrapv -fPIC -fPIE -gdwarf-4 -Wall (14.2.0)
compact2gcc -march=native -mtune=native -Os -fwrapv -fPIC -fPIE -gdwarf-4 -Wall (14.2.0)
compact3clang -march=native -O -fwrapv -Qunused-arguments -fPIC -fPIE -gdwarf-4 -Wall (Debian_Clang_19.1.7_(3+b1))
compact3clang -mcpu=native -O3 -fwrapv -Qunused-arguments -fPIC -fPIE -gdwarf-4 -Wall (Debian_Clang_19.1.7_(3+b1))
compact3gcc -march=native -mtune=native -O2 -fwrapv -fPIC -fPIE -gdwarf-4 -Wall (14.2.0)
compact3gcc -march=native -mtune=native -O3 -fwrapv -fPIC -fPIE -gdwarf-4 -Wall (14.2.0)
compact3gcc -march=native -mtune=native -O -fwrapv -fPIC -fPIE -gdwarf-4 -Wall (14.2.0)
compact3gcc -march=native -mtune=native -Os -fwrapv -fPIC -fPIE -gdwarf-4 -Wall (14.2.0)
compact4clang -march=native -O -fwrapv -Qunused-arguments -fPIC -fPIE -gdwarf-4 -Wall (Debian_Clang_19.1.7_(3+b1))
compact4clang -mcpu=native -O3 -fwrapv -Qunused-arguments -fPIC -fPIE -gdwarf-4 -Wall (Debian_Clang_19.1.7_(3+b1))
compact4gcc -march=native -mtune=native -O2 -fwrapv -fPIC -fPIE -gdwarf-4 -Wall (14.2.0)
compact4gcc -march=native -mtune=native -O3 -fwrapv -fPIC -fPIE -gdwarf-4 -Wall (14.2.0)
compact4gcc -march=native -mtune=native -O -fwrapv -fPIC -fPIE -gdwarf-4 -Wall (14.2.0)
compact4gcc -march=native -mtune=native -Os -fwrapv -fPIC -fPIE -gdwarf-4 -Wall (14.2.0)
inplaceclang -march=native -O -fwrapv -Qunused-arguments -fPIC -fPIE -gdwarf-4 -Wall (Debian_Clang_19.1.7_(3+b1))
inplaceclang -mcpu=native -O3 -fwrapv -Qunused-arguments -fPIC -fPIE -gdwarf-4 -Wall (Debian_Clang_19.1.7_(3+b1))
inplacegcc -march=native -mtune=native -O2 -fwrapv -fPIC -fPIE -gdwarf-4 -Wall (14.2.0)
inplacegcc -march=native -mtune=native -O3 -fwrapv -fPIC -fPIE -gdwarf-4 -Wall (14.2.0)
inplacegcc -march=native -mtune=native -O -fwrapv -fPIC -fPIE -gdwarf-4 -Wall (14.2.0)
inplacegcc -march=native -mtune=native -Os -fwrapv -fPIC -fPIE -gdwarf-4 -Wall (14.2.0)
refclang -march=native -O -fwrapv -Qunused-arguments -fPIC -fPIE -gdwarf-4 -Wall (Debian_Clang_19.1.7_(3+b1))
refclang -mcpu=native -O3 -fwrapv -Qunused-arguments -fPIC -fPIE -gdwarf-4 -Wall (Debian_Clang_19.1.7_(3+b1))
refgcc -march=native -mtune=native -O2 -fwrapv -fPIC -fPIE -gdwarf-4 -Wall (14.2.0)
refgcc -march=native -mtune=native -O3 -fwrapv -fPIC -fPIE -gdwarf-4 -Wall (14.2.0)
refgcc -march=native -mtune=native -O -fwrapv -fPIC -fPIE -gdwarf-4 -Wall (14.2.0)
refgcc -march=native -mtune=native -Os -fwrapv -fPIC -fPIE -gdwarf-4 -Wall (14.2.0)
wflipclang -march=native -O -fwrapv -Qunused-arguments -fPIC -fPIE -gdwarf-4 -Wall (Debian_Clang_19.1.7_(3+b1))
wflipclang -mcpu=native -O3 -fwrapv -Qunused-arguments -fPIC -fPIE -gdwarf-4 -Wall (Debian_Clang_19.1.7_(3+b1))
wflipgcc -march=native -mtune=native -O2 -fwrapv -fPIC -fPIE -gdwarf-4 -Wall (14.2.0)
wflipgcc -march=native -mtune=native -O3 -fwrapv -fPIC -fPIE -gdwarf-4 -Wall (14.2.0)
wflipgcc -march=native -mtune=native -O -fwrapv -fPIC -fPIE -gdwarf-4 -Wall (14.2.0)
wflipgcc -march=native -mtune=native -Os -fwrapv -fPIC -fPIE -gdwarf-4 -Wall (14.2.0)