Test results for amd64, meteor,little, crypto_kem/titaniumccamed
[Page version: 20261015 12:43:32]
Measurements for amd64, meteor,little, crypto_kem
Test results for amd64, meteor,little, crypto_kem
Test results for crypto_kem/titaniumccamed
Computer: meteor,little
Microarchitecture: amd64; Crestmont (a06a4-20)
Architecture: amd64
CPU ID: GenuineIntel-000a06a4-20-bfebfbff
SUPERCOP version: 20261004
Operation: crypto_kem
Primitive: titaniumccamed
| Time | Object size | Test size | Implementation | Compiler | Benchmark date | SUPERCOP version |
| 4500176 | 134514 0 36 | 341067 1264 2456 | T:avx2 | clang -march=native -O3 -fwrapv -Qunused-arguments -fPIC -fPIE -gdwarf-4 -Wall | 20260719 | 20260627 |
| 4500343 | 87120 0 36 | 293843 1264 2456 | T:avx2 | clang -march=native -O2 -fwrapv -Qunused-arguments -fPIC -fPIE -gdwarf-4 -Wall | 20260719 | 20260627 |
| 4541404 | 80217 0 36 | 283373 1256 2456 | T:avx2 | clang -march=native -Os -fwrapv -Qunused-arguments -fPIC -fPIE -gdwarf-4 -Wall | 20260719 | 20260627 |
| 4546475 | 81693 0 36 | 284275 1264 2360 | T:avx2 | clang -march=native -O -fwrapv -Qunused-arguments -fPIC -fPIE -gdwarf-4 -Wall | 20260719 | 20260627 |
| 4647788 | 86427 0 64 | 290303 1224 2456 | T:avx2 | gcc -march=native -mtune=native -O2 -fwrapv -fPIC -fPIE -gdwarf-4 -Wall | 20260719 | 20260627 |
| 4654231 | 84929 0 64 | 288399 1224 2456 | T:avx2 | gcc -march=native -mtune=native -O -fwrapv -fPIC -fPIE -gdwarf-4 -Wall | 20260719 | 20260627 |
| 4677406 | 87741 0 64 | 294047 1224 2456 | T:avx2 | gcc -march=native -mtune=native -O3 -fwrapv -fPIC -fPIE -gdwarf-4 -Wall | 20260719 | 20260627 |
| 5266644 | 70939 0 36 | 275987 1264 2360 | T:opt | clang -mcpu=native -O3 -fwrapv -Qunused-arguments -fPIC -fPIE -gdwarf-4 -Wall | 20260719 | 20260627 |
| 5275074 | 93267 0 36 | 298411 1264 2456 | T:opt | clang -march=native -O2 -fwrapv -Qunused-arguments -fPIC -fPIE -gdwarf-4 -Wall | 20260719 | 20260627 |
| 5374425 | 46493 0 36 | 249821 1256 2456 | T:opt | clang -march=native -Os -fwrapv -Qunused-arguments -fPIC -fPIE -gdwarf-4 -Wall | 20260719 | 20260627 |
| 5402222 | 103681 0 36 | 308771 1264 2456 | T:opt | clang -march=native -O3 -fwrapv -Qunused-arguments -fPIC -fPIE -gdwarf-4 -Wall | 20260719 | 20260627 |
| 5501335 | 45059 0 36 | 247955 1264 2360 | T:opt | clang -march=native -O -fwrapv -Qunused-arguments -fPIC -fPIE -gdwarf-4 -Wall | 20260719 | 20260627 |
| 6009288 | 77567 0 64 | 283623 1224 2456 | T:opt | gcc -march=native -mtune=native -O3 -fwrapv -fPIC -fPIE -gdwarf-4 -Wall | 20260719 | 20260627 |
| 6173804 | 50751 0 64 | 254735 1224 2456 | T:opt | gcc -march=native -mtune=native -O2 -fwrapv -fPIC -fPIE -gdwarf-4 -Wall | 20260719 | 20260627 |
| 6246841 | 47196 0 64 | 250719 1224 2456 | T:opt | gcc -march=native -mtune=native -O -fwrapv -fPIC -fPIE -gdwarf-4 -Wall | 20260719 | 20260627 |
| 524141908 | 57856 0 36 | 264459 1264 2456 | T:ref | clang -march=native -O2 -fwrapv -Qunused-arguments -fPIC -fPIE -gdwarf-4 -Wall | 20260719 | 20260627 |
| 524256474 | 106574 0 36 | 313099 1264 2456 | T:ref | clang -march=native -O3 -fwrapv -Qunused-arguments -fPIC -fPIE -gdwarf-4 -Wall | 20260719 | 20260627 |
| 548122915 | 62746 0 36 | 268179 1264 2360 | T:ref | clang -mcpu=native -O3 -fwrapv -Qunused-arguments -fPIC -fPIE -gdwarf-4 -Wall | 20260719 | 20260627 |
| 559843433 | 39099 0 36 | 242325 1256 2456 | T:ref | clang -march=native -Os -fwrapv -Qunused-arguments -fPIC -fPIE -gdwarf-4 -Wall | 20260719 | 20260627 |
| 570459052 | 36365 0 36 | 239259 1264 2360 | T:ref | clang -march=native -O -fwrapv -Qunused-arguments -fPIC -fPIE -gdwarf-4 -Wall | 20260719 | 20260627 |
| 602894699 | 57787 0 64 | 264175 1224 2456 | T:ref | gcc -march=native -mtune=native -O3 -fwrapv -fPIC -fPIE -gdwarf-4 -Wall | 20260719 | 20260627 |
| 602934386 | 36086 0 64 | 239575 1224 2456 | T:ref | gcc -march=native -mtune=native -O -fwrapv -fPIC -fPIE -gdwarf-4 -Wall | 20260719 | 20260627 |
| 604006810 | 36736 0 64 | 240567 1224 2456 | T:ref | gcc -march=native -mtune=native -O2 -fwrapv -fPIC -fPIE -gdwarf-4 -Wall | 20260719 | 20260627 |
| 792971701 | 34261 0 64 | 236074 1216 2424 | T:ref | gcc -march=native -mtune=native -Os -fwrapv -fPIC -fPIE -gdwarf-4 -Wall | 20260719 | 20260627 |
Compiler output
encrypt.c: encrypt.c:63:8: error: always_inline function '_mm256_loadu_si256' requires target feature 'avx', but would be inlined into function 'crypto_encrypt_keypair' that is compiled without support for 'avx'
encrypt.c: 63 | u = _mm256_loadu_si256((__m256i *)(a[i] + j));
encrypt.c: | ^
encrypt.c: encrypt.c:63:8: error: AVX vector return of type '__m256i' (vector of 4 'long long' values) without 'avx' enabled changes the ABI
encrypt.c: encrypt.c:64:8: error: always_inline function '_mm256_loadu_si256' requires target feature 'avx', but would be inlined into function 'crypto_encrypt_keypair' that is compiled without support for 'avx'
encrypt.c: 64 | v = _mm256_loadu_si256((__m256i *)(s + j));
encrypt.c: | ^
encrypt.c: encrypt.c:64:8: error: AVX vector return of type '__m256i' (vector of 4 'long long' values) without 'avx' enabled changes the ABI
encrypt.c: encrypt.c:65:8: error: always_inline function '_mm256_mul_epu32' requires target feature 'avx2', but would be inlined into function 'crypto_encrypt_keypair' that is compiled without support for 'avx2'
encrypt.c: 65 | t = _mm256_mul_epu32(u, v);
encrypt.c: | ^
encrypt.c: encrypt.c:65:8: error: AVX vector argument of type '__m256i' (vector of 4 'long long' values) without 'avx' enabled changes the ABI
encrypt.c: encrypt.c:66:4: error: always_inline function '_mm256_storeu_si256' requires target feature 'avx', but would be inlined into function 'crypto_encrypt_keypair' that is compiled without support for 'avx'
encrypt.c: 66 | _mm256_storeu_si256((__m256i *)(a[i] + j), t);
encrypt.c: | ^
encrypt.c: encrypt.c:66:4: error: AVX vector argument of type '__m256i' (vector of 4 'long long' values) without 'avx' enabled changes the ABI
encrypt.c: encrypt.c:78:8: error: always_inline function '_mm256_loadu_si256' requires target feature 'avx', but would be inlined into function 'crypto_encrypt_keypair' that is compiled without support for 'avx'
encrypt.c: 78 | u = _mm256_loadu_si256((__m256i *)(a[i] + j));
encrypt.c: | ^
encrypt.c: encrypt.c:78:8: error: AVX vector return of type '__m256i' (vector of 4 'long long' values) without 'avx' enabled changes the ABI
encrypt.c: encrypt.c:79:8: error: always_inline function '_mm256_loadu_si256' requires target feature 'avx', but would be inlined into function 'crypto_encrypt_keypair' that is compiled without support for 'avx'
encrypt.c: 79 | v = _mm256_loadu_si256((__m256i *)(e[i] + j));
encrypt.c: | ^
encrypt.c: encrypt.c:79:8: error: AVX vector return of type '__m256i' (vector of 4 'long long' values) without 'avx' enabled changes the ABI
encrypt.c: encrypt.c:80:8: error: always_inline function '_mm256_add_epi64' requires target feature 'avx2', but would be inlined into function 'crypto_encrypt_keypair' that is compiled without support for 'avx2'
encrypt.c: ...
Number of similar (implementation,compiler) pairs: 1, namely:
| Implementation | Compiler |
| T:avx2 | clang -mcpu=native -O3 -fwrapv -Qunused-arguments -fPIC -fPIE -gdwarf-4 -Wall (Debian_Clang_19.1.7_(3+b1)) |
Compiler output
try.c: /usr/bin/ld: libcrypto_kem_titaniumccamed.a(sampler.o): in function `sampler_zq':
try.c: .../supercop-data/meteor,little/amd64/try/c/gcc_-march=native_-mtune=native_-Os_-fwrapv_-fPIC_-fPIE_-gdwarf-4_-Wall/timingleaks/crypto_kem/titaniumccamed/avx2/work/sampler.c:160:(.text+0x...): undefined reference to `barrett_zq'
try.c: collect2: error: ld returned 1 exit status
Number of similar (implementation,compiler) pairs: 1, namely:
| Implementation | Compiler |
| T:avx2 | gcc -march=native -mtune=native -Os -fwrapv -fPIC -fPIE -gdwarf-4 -Wall (14.2.0) |
Compiler output
try.c: /usr/bin/ld: libcrypto_kem_titaniumccamed.a(encrypt.o): in function `crypto_encrypt_keypair':
try.c: .../supercop-data/meteor,little/amd64/try/c/gcc_-march=native_-mtune=native_-Os_-fwrapv_-fPIC_-fPIE_-gdwarf-4_-Wall/timingleaks/crypto_kem/titaniumccamed/opt/work/encrypt.c:55:(.text+0x...): undefined reference to `barrett_4q2'
try.c: /usr/bin/ld: .../supercop-data/meteor,little/amd64/try/c/gcc_-march=native_-mtune=native_-Os_-fwrapv_-fPIC_-fPIE_-gdwarf-4_-Wall/timingleaks/crypto_kem/titaniumccamed/opt/work/encrypt.c:63:(.text+0x...): undefined reference to `barrett_4q'
try.c: /usr/bin/ld: libcrypto_kem_titaniumccamed.a(encrypt.o): in function `crypto_encrypt':
try.c: .../supercop-data/meteor,little/amd64/try/c/gcc_-march=native_-mtune=native_-Os_-fwrapv_-fPIC_-fPIE_-gdwarf-4_-Wall/timingleaks/crypto_kem/titaniumccamed/opt/work/encrypt.c:140:(.text+0x...): undefined reference to `barrett_4q2'
try.c: /usr/bin/ld: .../supercop-data/meteor,little/amd64/try/c/gcc_-march=native_-mtune=native_-Os_-fwrapv_-fPIC_-fPIE_-gdwarf-4_-Wall/timingleaks/crypto_kem/titaniumccamed/opt/work/encrypt.c:150:(.text+0x...): undefined reference to `barrett_4q2'
try.c: /usr/bin/ld: libcrypto_kem_titaniumccamed.a(encrypt.o): in function `crypto_encrypt_open':
try.c: .../supercop-data/meteor,little/amd64/try/c/gcc_-march=native_-mtune=native_-Os_-fwrapv_-fPIC_-fPIE_-gdwarf-4_-Wall/timingleaks/crypto_kem/titaniumccamed/opt/work/encrypt.c:194:(.text+0x...): undefined reference to `barrett_4q2'
try.c: /usr/bin/ld: libcrypto_kem_titaniumccamed.a(ntt.o): in function `ntt_butterfly_1280_2048':
try.c: .../supercop-data/meteor,little/amd64/try/c/gcc_-march=native_-mtune=native_-Os_-fwrapv_-fPIC_-fPIE_-gdwarf-4_-Wall/timingleaks/crypto_kem/titaniumccamed/opt/work/ntt.c:350:(.text+0x...): undefined reference to `barrett_16q'
try.c: /usr/bin/ld: libcrypto_kem_titaniumccamed.a(ntt.o): in function `ntt_butterfly_2048_768':
try.c: .../supercop-data/meteor,little/amd64/try/c/gcc_-march=native_-mtune=native_-Os_-fwrapv_-fPIC_-fPIE_-gdwarf-4_-Wall/timingleaks/crypto_kem/titaniumccamed/opt/work/ntt.c:374:(.text+0x...): undefined reference to `barrett_16q'
try.c: /usr/bin/ld: libcrypto_kem_titaniumccamed.a(ntt.o): in function `ntt_butterfly_512_1792':
try.c: .../supercop-data/meteor,little/amd64/try/c/gcc_-march=native_-mtune=native_-Os_-fwrapv_-fPIC_-fPIE_-gdwarf-4_-Wall/timingleaks/crypto_kem/titaniumccamed/opt/work/ntt.c:387:(.text+0x...): undefined reference to `barrett_4q'
try.c: /usr/bin/ld: libcrypto_kem_titaniumccamed.a(ntt.o): in function `ntt_butterfly_1280_1792':
try.c: .../supercop-data/meteor,little/amd64/try/c/gcc_-march=native_-mtune=native_-Os_-fwrapv_-fPIC_-fPIE_-gdwarf-4_-Wall/timingleaks/crypto_kem/titaniumccamed/opt/work/ntt.c:407:(.text+0x...): undefined reference to `barrett_16q'
try.c: /usr/bin/ld: libcrypto_kem_titaniumccamed.a(ntt.o): in function `ntt_butterfly_1792_1792_inv':
try.c: .../supercop-data/meteor,little/amd64/try/c/gcc_-march=native_-mtune=native_-Os_-fwrapv_-fPIC_-fPIE_-gdwarf-4_-Wall/timingleaks/crypto_kem/titaniumccamed/opt/work/ntt.c:429:(.text+0x...): undefined reference to `barrett_16q'
try.c: /usr/bin/ld: libcrypto_kem_titaniumccamed.a(ntt.o): in function `ntt_butterfly_768_768_inv':
try.c: .../supercop-data/meteor,little/amd64/try/c/gcc_-march=native_-mtune=native_-Os_-fwrapv_-fPIC_-fPIE_-gdwarf-4_-Wall/timingleaks/crypto_kem/titaniumccamed/opt/work/ntt.c:447:(.text+0x...): undefined reference to `barrett_8q'
try.c: /usr/bin/ld: libcrypto_kem_titaniumccamed.a(ntt.o): in function `ntt_butterfly_512_768':
try.c: .../supercop-data/meteor,little/amd64/try/c/gcc_-march=native_-mtune=native_-Os_-fwrapv_-fPIC_-fPIE_-gdwarf-4_-Wall/timingleaks/crypto_kem/titaniumccamed/opt/work/ntt.c:460:(.text+0x...): undefined reference to `barrett_4q'
try.c: /usr/bin/ld: libcrypto_kem_titaniumccamed.a(ntt.o): in function `ntt_butterfly_768_256':
try.c: .../supercop-data/meteor,little/amd64/try/c/gcc_-march=native_-mtune=native_-Os_-fwrapv_-fPIC_-fPIE_-gdwarf-4_-Wall/timingleaks/crypto_kem/titaniumccamed/opt/work/ntt.c:468:(.text+0x...): undefined reference to `barrett_8q'
try.c: /usr/bin/ld: libcrypto_kem_titaniumccamed.a(ntt.o): in function `ntt_butterfly_1792_2048':
try.c: ...
Number of similar (implementation,compiler) pairs: 1, namely:
| Implementation | Compiler |
| T:opt | gcc -march=native -mtune=native -Os -fwrapv -fPIC -fPIE -gdwarf-4 -Wall (14.2.0) |
Namespace violations
encrypt.o crypto_encrypt T
encrypt.o crypto_encrypt_keypair T
encrypt.o crypto_encrypt_open T
fastrandombytes.o fastrandombytes T
fastrandombytes.o fastrandombytes_setseed T
fastrandombytes.o iv B
fastrandombytes.o key B
ntt.o intt_1792_1792_inv T
ntt.o intt_2048_256 T
ntt.o intt_2048_768 T
ntt.o intt_768_256 T
ntt.o ntt_1280_1792 T
ntt.o ntt_1280_2048 T
ntt.o ntt_1792_2048 T
ntt.o ntt_512_1792 T
ntt.o ntt_512_768 T
ntt.o ntt_768_768_inv T
pack.o poly_decode T
pack.o poly_decode_c2 T
pack.o poly_encode T
pack.o poly_encode_c2 T
sampler.o sampler_binomial T
sampler.o sampler_zb T
sampler.o sampler_zq T
Number of similar (implementation,compiler) pairs: 15, namely:
| Implementation | Compiler |
| T:avx2 | clang -march=native -O2 -fwrapv -Qunused-arguments -fPIC -fPIE -gdwarf-4 -Wall (Debian_Clang_19.1.7_(3+b1)) |
| T:avx2 | clang -march=native -O3 -fwrapv -Qunused-arguments -fPIC -fPIE -gdwarf-4 -Wall (Debian_Clang_19.1.7_(3+b1)) |
| T:avx2 | clang -march=native -O -fwrapv -Qunused-arguments -fPIC -fPIE -gdwarf-4 -Wall (Debian_Clang_19.1.7_(3+b1)) |
| T:avx2 | clang -march=native -Os -fwrapv -Qunused-arguments -fPIC -fPIE -gdwarf-4 -Wall (Debian_Clang_19.1.7_(3+b1)) |
| T:avx2 | gcc -march=native -mtune=native -O2 -fwrapv -fPIC -fPIE -gdwarf-4 -Wall (14.2.0) |
| T:avx2 | gcc -march=native -mtune=native -O3 -fwrapv -fPIC -fPIE -gdwarf-4 -Wall (14.2.0) |
| T:avx2 | gcc -march=native -mtune=native -O -fwrapv -fPIC -fPIE -gdwarf-4 -Wall (14.2.0) |
| T:opt | clang -march=native -O2 -fwrapv -Qunused-arguments -fPIC -fPIE -gdwarf-4 -Wall (Debian_Clang_19.1.7_(3+b1)) |
| T:opt | clang -march=native -O3 -fwrapv -Qunused-arguments -fPIC -fPIE -gdwarf-4 -Wall (Debian_Clang_19.1.7_(3+b1)) |
| T:opt | clang -march=native -O -fwrapv -Qunused-arguments -fPIC -fPIE -gdwarf-4 -Wall (Debian_Clang_19.1.7_(3+b1)) |
| T:opt | clang -march=native -Os -fwrapv -Qunused-arguments -fPIC -fPIE -gdwarf-4 -Wall (Debian_Clang_19.1.7_(3+b1)) |
| T:opt | clang -mcpu=native -O3 -fwrapv -Qunused-arguments -fPIC -fPIE -gdwarf-4 -Wall (Debian_Clang_19.1.7_(3+b1)) |
| T:opt | gcc -march=native -mtune=native -O2 -fwrapv -fPIC -fPIE -gdwarf-4 -Wall (14.2.0) |
| T:opt | gcc -march=native -mtune=native -O3 -fwrapv -fPIC -fPIE -gdwarf-4 -Wall (14.2.0) |
| T:opt | gcc -march=native -mtune=native -O -fwrapv -fPIC -fPIE -gdwarf-4 -Wall (14.2.0) |
Namespace violations
encrypt.o crypto_encrypt T
encrypt.o crypto_encrypt_keypair T
encrypt.o crypto_encrypt_open T
fastrandombytes.o fastrandombytes T
fastrandombytes.o fastrandombytes_setseed T
fastrandombytes.o iv B
fastrandombytes.o key B
ntt.o intt_1792_1792_inv T
ntt.o intt_2048_2048 T
ntt.o intt_768_768 T
ntt.o ntt_1792_1792 T
ntt.o ntt_768_768_inv T
pack.o poly_decode T
pack.o poly_decode_c2 T
pack.o poly_encode T
pack.o poly_encode_c2 T
product.o mp T
product.o product T
sampler.o sampler_binomial T
sampler.o sampler_zb T
sampler.o sampler_zq T
Number of similar (implementation,compiler) pairs: 9, namely:
| Implementation | Compiler |
| T:ref | clang -march=native -O2 -fwrapv -Qunused-arguments -fPIC -fPIE -gdwarf-4 -Wall (Debian_Clang_19.1.7_(3+b1)) |
| T:ref | clang -march=native -O3 -fwrapv -Qunused-arguments -fPIC -fPIE -gdwarf-4 -Wall (Debian_Clang_19.1.7_(3+b1)) |
| T:ref | clang -march=native -O -fwrapv -Qunused-arguments -fPIC -fPIE -gdwarf-4 -Wall (Debian_Clang_19.1.7_(3+b1)) |
| T:ref | clang -march=native -Os -fwrapv -Qunused-arguments -fPIC -fPIE -gdwarf-4 -Wall (Debian_Clang_19.1.7_(3+b1)) |
| T:ref | clang -mcpu=native -O3 -fwrapv -Qunused-arguments -fPIC -fPIE -gdwarf-4 -Wall (Debian_Clang_19.1.7_(3+b1)) |
| T:ref | gcc -march=native -mtune=native -O2 -fwrapv -fPIC -fPIE -gdwarf-4 -Wall (14.2.0) |
| T:ref | gcc -march=native -mtune=native -O3 -fwrapv -fPIC -fPIE -gdwarf-4 -Wall (14.2.0) |
| T:ref | gcc -march=native -mtune=native -O -fwrapv -fPIC -fPIE -gdwarf-4 -Wall (14.2.0) |
| T:ref | gcc -march=native -mtune=native -Os -fwrapv -fPIC -fPIE -gdwarf-4 -Wall (14.2.0) |