Test results for amd64, meteor,little, crypto_kem/titaniumccalite

[Page version: 20261015 12:43:32]

Measurements for amd64, meteor,little, crypto_kem Test results for amd64, meteor,little, crypto_kem Test results for crypto_kem/titaniumccalite
Computer: meteor,little
Microarchitecture: amd64; Crestmont (a06a4-20)
Architecture: amd64
CPU ID: GenuineIntel-000a06a4-20-bfebfbff
SUPERCOP version: 20261004
Operation: crypto_kem
Primitive: titaniumccalite
TimeObject sizeTest sizeImplementationCompilerBenchmark dateSUPERCOP version
303201166757 0 36269355 1264 2360T:avx2clang -march=native -O -fwrapv -Qunused-arguments -fPIC -fPIE -gdwarf-4 -Wall2026071920260627
303502570685 0 36277451 1264 2456T:avx2clang -march=native -O2 -fwrapv -Qunused-arguments -fPIC -fPIE -gdwarf-4 -Wall2026071920260627
3045688121479 0 36328067 1264 2456T:avx2clang -march=native -O3 -fwrapv -Qunused-arguments -fPIC -fPIE -gdwarf-4 -Wall2026071920260627
306239065255 0 36268453 1256 2456T:avx2clang -march=native -Os -fwrapv -Qunused-arguments -fPIC -fPIE -gdwarf-4 -Wall2026071920260627
315019071230 0 64275103 1224 2456T:avx2gcc -march=native -mtune=native -O2 -fwrapv -fPIC -fPIE -gdwarf-4 -Wall2026071920260627
315452469811 0 64273271 1224 2456T:avx2gcc -march=native -mtune=native -O -fwrapv -fPIC -fPIE -gdwarf-4 -Wall2026071920260627
315613972837 0 64279143 1224 2456T:avx2gcc -march=native -mtune=native -O3 -fwrapv -fPIC -fPIE -gdwarf-4 -Wall2026071920260627
349023789215 0 36294659 1264 2456T:optclang -march=native -O3 -fwrapv -Qunused-arguments -fPIC -fPIE -gdwarf-4 -Wall2026071920260627
350134978701 0 36284171 1264 2456T:optclang -march=native -O2 -fwrapv -Qunused-arguments -fPIC -fPIE -gdwarf-4 -Wall2026071920260627
354971862875 0 36267891 1264 2360T:optclang -mcpu=native -O3 -fwrapv -Qunused-arguments -fPIC -fPIE -gdwarf-4 -Wall2026071920260627
360011638094 0 36241397 1256 2456T:optclang -march=native -Os -fwrapv -Qunused-arguments -fPIC -fPIE -gdwarf-4 -Wall2026071920260627
369162937827 0 36240739 1264 2360T:optclang -march=native -O -fwrapv -Qunused-arguments -fPIC -fPIE -gdwarf-4 -Wall2026071920260627
408022469977 0 64276071 1224 2456T:optgcc -march=native -mtune=native -O3 -fwrapv -fPIC -fPIE -gdwarf-4 -Wall2026071920260627
418528743383 0 64247367 1224 2456T:optgcc -march=native -mtune=native -O2 -fwrapv -fPIC -fPIE -gdwarf-4 -Wall2026071920260627
425933339767 0 64243287 1224 2456T:optgcc -march=native -mtune=native -O -fwrapv -fPIC -fPIE -gdwarf-4 -Wall2026071920260627
35890257552534 0 36259083 1264 2456T:refclang -march=native -O2 -fwrapv -Qunused-arguments -fPIC -fPIE -gdwarf-4 -Wall2026071920260627
35905740797544 0 36304011 1264 2456T:refclang -march=native -O3 -fwrapv -Qunused-arguments -fPIC -fPIE -gdwarf-4 -Wall2026071920260627
37260632356266 0 36261715 1264 2360T:refclang -mcpu=native -O3 -fwrapv -Qunused-arguments -fPIC -fPIE -gdwarf-4 -Wall2026071920260627
38245704131765 0 36234901 1256 2456T:refclang -march=native -Os -fwrapv -Qunused-arguments -fPIC -fPIE -gdwarf-4 -Wall2026071920260627
39028132030061 0 36232923 1264 2360T:refclang -march=native -O -fwrapv -Qunused-arguments -fPIC -fPIE -gdwarf-4 -Wall2026071920260627
40873117729814 0 64233303 1224 2456T:refgcc -march=native -mtune=native -O -fwrapv -fPIC -fPIE -gdwarf-4 -Wall2026071920260627
41111844350427 0 64256767 1224 2456T:refgcc -march=native -mtune=native -O3 -fwrapv -fPIC -fPIE -gdwarf-4 -Wall2026071920260627
41264528630336 0 64234167 1224 2456T:refgcc -march=native -mtune=native -O2 -fwrapv -fPIC -fPIE -gdwarf-4 -Wall2026071920260627
52186170528053 0 64229866 1216 2424T:refgcc -march=native -mtune=native -Os -fwrapv -fPIC -fPIE -gdwarf-4 -Wall2026071920260627

Compiler output


encrypt.c: encrypt.c:64:8: error: always_inline function '_mm256_loadu_si256' requires target feature 'avx', but would be inlined into function 'crypto_encrypt_keypair' that is compiled without support for 'avx'
encrypt.c:    64 |                         u = _mm256_loadu_si256((__m256i *)(a[i] + j));
encrypt.c:       |                             ^
encrypt.c: encrypt.c:64:8: error: AVX vector return of type '__m256i' (vector of 4 'long long' values) without 'avx' enabled changes the ABI
encrypt.c: encrypt.c:65:8: error: always_inline function '_mm256_loadu_si256' requires target feature 'avx', but would be inlined into function 'crypto_encrypt_keypair' that is compiled without support for 'avx'
encrypt.c:    65 |                         v = _mm256_loadu_si256((__m256i *)(s + j));
encrypt.c:       |                             ^
encrypt.c: encrypt.c:65:8: error: AVX vector return of type '__m256i' (vector of 4 'long long' values) without 'avx' enabled changes the ABI
encrypt.c: encrypt.c:66:8: error: always_inline function '_mm256_mul_epu32' requires target feature 'avx2', but would be inlined into function 'crypto_encrypt_keypair' that is compiled without support for 'avx2'
encrypt.c:    66 |                         t = _mm256_mul_epu32(u, v);
encrypt.c:       |                             ^
encrypt.c: encrypt.c:66:8: error: AVX vector argument of type '__m256i' (vector of 4 'long long' values) without 'avx' enabled changes the ABI
encrypt.c: encrypt.c:67:4: error: always_inline function '_mm256_storeu_si256' requires target feature 'avx', but would be inlined into function 'crypto_encrypt_keypair' that is compiled without support for 'avx'
encrypt.c:    67 |                         _mm256_storeu_si256((__m256i *)(a[i] + j), t);
encrypt.c:       |                         ^
encrypt.c: encrypt.c:67:4: error: AVX vector argument of type '__m256i' (vector of 4 'long long' values) without 'avx' enabled changes the ABI
encrypt.c: encrypt.c:79:8: error: always_inline function '_mm256_loadu_si256' requires target feature 'avx', but would be inlined into function 'crypto_encrypt_keypair' that is compiled without support for 'avx'
encrypt.c:    79 |                         u = _mm256_loadu_si256((__m256i *)(a[i] + j));
encrypt.c:       |                             ^
encrypt.c: encrypt.c:79:8: error: AVX vector return of type '__m256i' (vector of 4 'long long' values) without 'avx' enabled changes the ABI
encrypt.c: encrypt.c:80:8: error: always_inline function '_mm256_loadu_si256' requires target feature 'avx', but would be inlined into function 'crypto_encrypt_keypair' that is compiled without support for 'avx'
encrypt.c:    80 |                         v = _mm256_loadu_si256((__m256i *)(e[i] + j));
encrypt.c:       |                             ^
encrypt.c: encrypt.c:80:8: error: AVX vector return of type '__m256i' (vector of 4 'long long' values) without 'avx' enabled changes the ABI
encrypt.c: encrypt.c:81:8: error: always_inline function '_mm256_add_epi64' requires target feature 'avx2', but would be inlined into function 'crypto_encrypt_keypair' that is compiled without support for 'avx2'
encrypt.c: ...

Number of similar (implementation,compiler) pairs: 1, namely:
ImplementationCompiler
T:avx2clang -mcpu=native -O3 -fwrapv -Qunused-arguments -fPIC -fPIE -gdwarf-4 -Wall (Debian_Clang_19.1.7_(3+b1))

Compiler output


try.c: /usr/bin/ld: libcrypto_kem_titaniumccalite.a(sampler.o): in function `sampler_zq':
try.c: .../supercop-data/meteor,little/amd64/try/c/gcc_-march=native_-mtune=native_-Os_-fwrapv_-fPIC_-fPIE_-gdwarf-4_-Wall/timingleaks/crypto_kem/titaniumccalite/avx2/work/sampler.c:160:(.text+0x...): undefined reference to `barrett_zq'
try.c: collect2: error: ld returned 1 exit status

Number of similar (implementation,compiler) pairs: 1, namely:
ImplementationCompiler
T:avx2gcc -march=native -mtune=native -Os -fwrapv -fPIC -fPIE -gdwarf-4 -Wall (14.2.0)

Compiler output


try.c: /usr/bin/ld: libcrypto_kem_titaniumccalite.a(encrypt.o): in function `crypto_encrypt_keypair':
try.c: .../supercop-data/meteor,little/amd64/try/c/gcc_-march=native_-mtune=native_-Os_-fwrapv_-fPIC_-fPIE_-gdwarf-4_-Wall/timingleaks/crypto_kem/titaniumccalite/opt/work/encrypt.c:56:(.text+0x...): undefined reference to `barrett_4q2'
try.c: /usr/bin/ld: .../supercop-data/meteor,little/amd64/try/c/gcc_-march=native_-mtune=native_-Os_-fwrapv_-fPIC_-fPIE_-gdwarf-4_-Wall/timingleaks/crypto_kem/titaniumccalite/opt/work/encrypt.c:64:(.text+0x...): undefined reference to `barrett_4q'
try.c: /usr/bin/ld: libcrypto_kem_titaniumccalite.a(encrypt.o): in function `crypto_encrypt':
try.c: .../supercop-data/meteor,little/amd64/try/c/gcc_-march=native_-mtune=native_-Os_-fwrapv_-fPIC_-fPIE_-gdwarf-4_-Wall/timingleaks/crypto_kem/titaniumccalite/opt/work/encrypt.c:146:(.text+0x...): undefined reference to `barrett_4q2'
try.c: /usr/bin/ld: .../supercop-data/meteor,little/amd64/try/c/gcc_-march=native_-mtune=native_-Os_-fwrapv_-fPIC_-fPIE_-gdwarf-4_-Wall/timingleaks/crypto_kem/titaniumccalite/opt/work/encrypt.c:156:(.text+0x...): undefined reference to `barrett_4q2'
try.c: /usr/bin/ld: libcrypto_kem_titaniumccalite.a(encrypt.o): in function `crypto_encrypt_open':
try.c: .../supercop-data/meteor,little/amd64/try/c/gcc_-march=native_-mtune=native_-Os_-fwrapv_-fPIC_-fPIE_-gdwarf-4_-Wall/timingleaks/crypto_kem/titaniumccalite/opt/work/encrypt.c:200:(.text+0x...): undefined reference to `barrett_4q2'
try.c: /usr/bin/ld: libcrypto_kem_titaniumccalite.a(ntt.o): in function `ntt_butterfly_1024_1536':
try.c: .../supercop-data/meteor,little/amd64/try/c/gcc_-march=native_-mtune=native_-Os_-fwrapv_-fPIC_-fPIE_-gdwarf-4_-Wall/timingleaks/crypto_kem/titaniumccalite/opt/work/ntt.c:342:(.text+0x...): undefined reference to `barrett_8q'
try.c: /usr/bin/ld: libcrypto_kem_titaniumccalite.a(ntt.o): in function `ntt_butterfly_1536_768':
try.c: .../supercop-data/meteor,little/amd64/try/c/gcc_-march=native_-mtune=native_-Os_-fwrapv_-fPIC_-fPIE_-gdwarf-4_-Wall/timingleaks/crypto_kem/titaniumccalite/opt/work/ntt.c:362:(.text+0x...): undefined reference to `barrett_16q'
try.c: /usr/bin/ld: libcrypto_kem_titaniumccalite.a(ntt.o): in function `ntt_butterfly_512_1280':
try.c: .../supercop-data/meteor,little/amd64/try/c/gcc_-march=native_-mtune=native_-Os_-fwrapv_-fPIC_-fPIE_-gdwarf-4_-Wall/timingleaks/crypto_kem/titaniumccalite/opt/work/ntt.c:375:(.text+0x...): undefined reference to `barrett_4q'
try.c: /usr/bin/ld: libcrypto_kem_titaniumccalite.a(ntt.o): in function `ntt_butterfly_1024_1280':
try.c: .../supercop-data/meteor,little/amd64/try/c/gcc_-march=native_-mtune=native_-Os_-fwrapv_-fPIC_-fPIE_-gdwarf-4_-Wall/timingleaks/crypto_kem/titaniumccalite/opt/work/ntt.c:392:(.text+0x...): undefined reference to `barrett_8q'
try.c: /usr/bin/ld: libcrypto_kem_titaniumccalite.a(ntt.o): in function `ntt_butterfly_1280_1280_inv':
try.c: .../supercop-data/meteor,little/amd64/try/c/gcc_-march=native_-mtune=native_-Os_-fwrapv_-fPIC_-fPIE_-gdwarf-4_-Wall/timingleaks/crypto_kem/titaniumccalite/opt/work/ntt.c:410:(.text+0x...): undefined reference to `barrett_16q'
try.c: /usr/bin/ld: libcrypto_kem_titaniumccalite.a(ntt.o): in function `ntt_butterfly_768_768_inv':
try.c: .../supercop-data/meteor,little/amd64/try/c/gcc_-march=native_-mtune=native_-Os_-fwrapv_-fPIC_-fPIE_-gdwarf-4_-Wall/timingleaks/crypto_kem/titaniumccalite/opt/work/ntt.c:426:(.text+0x...): undefined reference to `barrett_8q'
try.c: /usr/bin/ld: libcrypto_kem_titaniumccalite.a(ntt.o): in function `ntt_butterfly_512_768':
try.c: .../supercop-data/meteor,little/amd64/try/c/gcc_-march=native_-mtune=native_-Os_-fwrapv_-fPIC_-fPIE_-gdwarf-4_-Wall/timingleaks/crypto_kem/titaniumccalite/opt/work/ntt.c:439:(.text+0x...): undefined reference to `barrett_4q'
try.c: /usr/bin/ld: libcrypto_kem_titaniumccalite.a(ntt.o): in function `ntt_butterfly_768_256':
try.c: .../supercop-data/meteor,little/amd64/try/c/gcc_-march=native_-mtune=native_-Os_-fwrapv_-fPIC_-fPIE_-gdwarf-4_-Wall/timingleaks/crypto_kem/titaniumccalite/opt/work/ntt.c:447:(.text+0x...): undefined reference to `barrett_8q'
try.c: /usr/bin/ld: libcrypto_kem_titaniumccalite.a(ntt.o): in function `ntt_butterfly_1280_1536':
try.c: ...

Number of similar (implementation,compiler) pairs: 1, namely:
ImplementationCompiler
T:optgcc -march=native -mtune=native -Os -fwrapv -fPIC -fPIE -gdwarf-4 -Wall (14.2.0)

Namespace violations


encrypt.o crypto_encrypt T
encrypt.o crypto_encrypt_keypair T
encrypt.o crypto_encrypt_open T
fastrandombytes.o fastrandombytes T
fastrandombytes.o fastrandombytes_setseed T
fastrandombytes.o iv B
fastrandombytes.o key B
ntt.o intt_1280_1280_inv T
ntt.o intt_1536_256 T
ntt.o intt_1536_768 T
ntt.o intt_768_256 T
ntt.o ntt_1024_1280 T
ntt.o ntt_1024_1536 T
ntt.o ntt_1280_1536 T
ntt.o ntt_512_1280 T
ntt.o ntt_512_768 T
ntt.o ntt_768_768_inv T
pack.o poly_decode T
pack.o poly_decode_c2 T
pack.o poly_encode T
pack.o poly_encode_c2 T
sampler.o sampler_binomial T
sampler.o sampler_zb T
sampler.o sampler_zq T

Number of similar (implementation,compiler) pairs: 15, namely:
ImplementationCompiler
T:avx2clang -march=native -O2 -fwrapv -Qunused-arguments -fPIC -fPIE -gdwarf-4 -Wall (Debian_Clang_19.1.7_(3+b1))
T:avx2clang -march=native -O3 -fwrapv -Qunused-arguments -fPIC -fPIE -gdwarf-4 -Wall (Debian_Clang_19.1.7_(3+b1))
T:avx2clang -march=native -O -fwrapv -Qunused-arguments -fPIC -fPIE -gdwarf-4 -Wall (Debian_Clang_19.1.7_(3+b1))
T:avx2clang -march=native -Os -fwrapv -Qunused-arguments -fPIC -fPIE -gdwarf-4 -Wall (Debian_Clang_19.1.7_(3+b1))
T:avx2gcc -march=native -mtune=native -O2 -fwrapv -fPIC -fPIE -gdwarf-4 -Wall (14.2.0)
T:avx2gcc -march=native -mtune=native -O3 -fwrapv -fPIC -fPIE -gdwarf-4 -Wall (14.2.0)
T:avx2gcc -march=native -mtune=native -O -fwrapv -fPIC -fPIE -gdwarf-4 -Wall (14.2.0)
T:optclang -march=native -O2 -fwrapv -Qunused-arguments -fPIC -fPIE -gdwarf-4 -Wall (Debian_Clang_19.1.7_(3+b1))
T:optclang -march=native -O3 -fwrapv -Qunused-arguments -fPIC -fPIE -gdwarf-4 -Wall (Debian_Clang_19.1.7_(3+b1))
T:optclang -march=native -O -fwrapv -Qunused-arguments -fPIC -fPIE -gdwarf-4 -Wall (Debian_Clang_19.1.7_(3+b1))
T:optclang -march=native -Os -fwrapv -Qunused-arguments -fPIC -fPIE -gdwarf-4 -Wall (Debian_Clang_19.1.7_(3+b1))
T:optclang -mcpu=native -O3 -fwrapv -Qunused-arguments -fPIC -fPIE -gdwarf-4 -Wall (Debian_Clang_19.1.7_(3+b1))
T:optgcc -march=native -mtune=native -O2 -fwrapv -fPIC -fPIE -gdwarf-4 -Wall (14.2.0)
T:optgcc -march=native -mtune=native -O3 -fwrapv -fPIC -fPIE -gdwarf-4 -Wall (14.2.0)
T:optgcc -march=native -mtune=native -O -fwrapv -fPIC -fPIE -gdwarf-4 -Wall (14.2.0)

Namespace violations


encrypt.o crypto_encrypt T
encrypt.o crypto_encrypt_keypair T
encrypt.o crypto_encrypt_open T
fastrandombytes.o fastrandombytes T
fastrandombytes.o fastrandombytes_setseed T
fastrandombytes.o iv B
fastrandombytes.o key B
ntt.o intt_1280_1280_inv T
ntt.o intt_1536_1536 T
ntt.o intt_768_768 T
ntt.o ntt_1280_1280 T
ntt.o ntt_768_768_inv T
pack.o poly_decode T
pack.o poly_decode_c2 T
pack.o poly_encode T
pack.o poly_encode_c2 T
product.o mp T
product.o product T
sampler.o sampler_binomial T
sampler.o sampler_zb T
sampler.o sampler_zq T

Number of similar (implementation,compiler) pairs: 9, namely:
ImplementationCompiler
T:refclang -march=native -O2 -fwrapv -Qunused-arguments -fPIC -fPIE -gdwarf-4 -Wall (Debian_Clang_19.1.7_(3+b1))
T:refclang -march=native -O3 -fwrapv -Qunused-arguments -fPIC -fPIE -gdwarf-4 -Wall (Debian_Clang_19.1.7_(3+b1))
T:refclang -march=native -O -fwrapv -Qunused-arguments -fPIC -fPIE -gdwarf-4 -Wall (Debian_Clang_19.1.7_(3+b1))
T:refclang -march=native -Os -fwrapv -Qunused-arguments -fPIC -fPIE -gdwarf-4 -Wall (Debian_Clang_19.1.7_(3+b1))
T:refclang -mcpu=native -O3 -fwrapv -Qunused-arguments -fPIC -fPIE -gdwarf-4 -Wall (Debian_Clang_19.1.7_(3+b1))
T:refgcc -march=native -mtune=native -O2 -fwrapv -fPIC -fPIE -gdwarf-4 -Wall (14.2.0)
T:refgcc -march=native -mtune=native -O3 -fwrapv -fPIC -fPIE -gdwarf-4 -Wall (14.2.0)
T:refgcc -march=native -mtune=native -O -fwrapv -fPIC -fPIE -gdwarf-4 -Wall (14.2.0)
T:refgcc -march=native -mtune=native -Os -fwrapv -fPIC -fPIE -gdwarf-4 -Wall (14.2.0)