Test results for amd64, meteor,little, crypto_hash/sha512

[Page version: 20261015 12:43:32]

Measurements for amd64, meteor,little, crypto_hash Test results for amd64, meteor,little, crypto_hash Test results for crypto_hash/sha512
Computer: meteor,little
Microarchitecture: amd64; Crestmont (a06a4-20)
Architecture: amd64
CPU ID: GenuineIntel-000a06a4-20-bfebfbff
SUPERCOP version: 20261004
Operation: crypto_hash
Primitive: sha512
TimeObject sizeTest sizeImplementationCompilerBenchmark dateSUPERCOP version
7373720 0 027373 1248 1560refclang -march=native -Os -fwrapv -Qunused-arguments -fPIC -fPIE -gdwarf-4 -Wall2026071320260627
7378905 0 029632 1256 1496refclang -mcpu=native -O3 -fwrapv -Qunused-arguments -fPIC -fPIE -gdwarf-4 -Wall2026071320260627
7381698 0 026704 1256 1496refclang -march=native -O -fwrapv -Qunused-arguments -fPIC -fPIE -gdwarf-4 -Wall2026071320260627
7381975 0 027615 1216 1592refgcc -march=native -mtune=native -O2 -fwrapv -fPIC -fPIE -gdwarf-4 -Wall2026071320260627
7387715 0 027070 1208 1592blocksplusavxgcc -march=native -mtune=native -O -fwrapv -fPIC -fPIE -gdwarf-4 -Wall2026071320260627
7387975 0 030087 1216 1592refgcc -march=native -mtune=native -O3 -fwrapv -fPIC -fPIE -gdwarf-4 -Wall2026071320260627
7391748 0 030819 1256 1560blocksplusavxclang -march=native -O3 -fwrapv -Qunused-arguments -fPIC -fPIE -gdwarf-4 -Wall2026071320260627
7392988 0 027647 1216 1592blocksplusavxgcc -march=native -mtune=native -O2 -fwrapv -fPIC -fPIE -gdwarf-4 -Wall2026071320260627
7392467 0 025333 1192 1560blocksplusavxgcc -march=native -mtune=native -Os -fwrapv -fPIC -fPIE -gdwarf-4 -Wall2026071320260627
7395988 0 030119 1216 1592blocksplusavxgcc -march=native -mtune=native -O3 -fwrapv -fPIC -fPIE -gdwarf-4 -Wall2026071320260627
7396748 0 026819 1256 1496blocksplusavxclang -march=native -O -fwrapv -Qunused-arguments -fPIC -fPIE -gdwarf-4 -Wall2026071320260627
7396819 0 030947 1256 1560refclang -march=native -O3 -fwrapv -Qunused-arguments -fPIC -fPIE -gdwarf-4 -Wall2026071320260627
7397748 0 030899 1256 1560blocksplusavxclang -march=native -O2 -fwrapv -Qunused-arguments -fPIC -fPIE -gdwarf-4 -Wall2026071320260627
7401819 0 031027 1256 1560refclang -march=native -O2 -fwrapv -Qunused-arguments -fPIC -fPIE -gdwarf-4 -Wall2026071320260627
7414711 0 027373 1248 1560blocksplusavxclang -march=native -Os -fwrapv -Qunused-arguments -fPIC -fPIE -gdwarf-4 -Wall2026071320260627
7438604 0 025557 1192 1560refgcc -march=native -mtune=native -Os -fwrapv -fPIC -fPIE -gdwarf-4 -Wall2026071320260627
7645694 0 026918 1208 1592refgcc -march=native -mtune=native -O -fwrapv -fPIC -fPIE -gdwarf-4 -Wall2026071320260627
906879 0 021596 1248 1592opensslgcc -march=native -mtune=native -O -fwrapv -fPIC -fPIE -gdwarf-4 -Wall2026100620261004
908276 0 024389 1256 1592opensslgcc -march=native -mtune=native -O3 -fwrapv -fPIC -fPIE -gdwarf-4 -Wall2026100620261004
908870 0 025371 1280 1560opensslclang -march=native -O3 -fwrapv -Qunused-arguments -fPIC -fPIE -gdwarf-4 -Wall2026100620261004
909770 0 023983 1280 1496opensslclang -mcpu=native -O3 -fwrapv -Qunused-arguments -fPIC -fPIE -gdwarf-4 -Wall2026100620261004
912870 0 021343 1280 1496opensslclang -march=native -O -fwrapv -Qunused-arguments -fPIC -fPIE -gdwarf-4 -Wall2026100620261004
914170 0 021925 1272 1560opensslclang -march=native -Os -fwrapv -Qunused-arguments -fPIC -fPIE -gdwarf-4 -Wall2026100620261004
916176 0 021949 1256 1592opensslgcc -march=native -mtune=native -O2 -fwrapv -fPIC -fPIE -gdwarf-4 -Wall2026100620261004
916870 0 025451 1280 1560opensslclang -march=native -O2 -fwrapv -Qunused-arguments -fPIC -fPIE -gdwarf-4 -Wall2026100620261004
924170 0 020192 1232 1560opensslgcc -march=native -mtune=native -Os -fwrapv -fPIC -fPIE -gdwarf-4 -Wall2026100620261004
103563912 704 01778952 147760 10904cryptoppclang++ -march=native -Os -fwrapv -Qunused-arguments -fPIC -fPIE -gdwarf-4 -Wall2026071320260627
103593741 704 01781379 147768 10904cryptoppclang++ -march=native -O2 -fwrapv -Qunused-arguments -fPIC -fPIE -gdwarf-4 -Wall2026071320260627
103834685 704 01778319 147704 10968cryptoppg++ -march=native -mtune=native -O2 -fwrapv -fPIC -fPIE -gdwarf-4 -Wall2026071320260627
103893754 704 01781883 147768 10904cryptoppclang++ -march=native -O3 -fwrapv -Qunused-arguments -fPIC -fPIE -gdwarf-4 -Wall2026071320260627
103965366 992 01779155 147768 10840cryptoppclang++ -march=native -O -fwrapv -Qunused-arguments -fPIC -fPIE -gdwarf-4 -Wall2026071320260627
103964752 704 01780351 147704 10968cryptoppg++ -march=native -mtune=native -O3 -fwrapv -fPIC -fPIE -gdwarf-4 -Wall2026071320260627
104343970 768 01775491 147712 10936cryptoppg++ -march=native -mtune=native -Os -fwrapv -fPIC -fPIE -gdwarf-4 -Wall2026071320260627
106064426 704 01777469 147704 10968cryptoppg++ -march=native -mtune=native -O -fwrapv -fPIC -fPIE -gdwarf-4 -Wall2026071320260627
121295889 0 030619 1256 1560sphlibclang -march=native -O3 -fwrapv -Qunused-arguments -fPIC -fPIE -gdwarf-4 -Wall2026071320260627
121355889 0 030699 1256 1560sphlib-smallclang -march=native -O2 -fwrapv -Qunused-arguments -fPIC -fPIE -gdwarf-4 -Wall2026071320260627
121435889 0 030619 1256 1560sphlib-smallclang -march=native -O3 -fwrapv -Qunused-arguments -fPIC -fPIE -gdwarf-4 -Wall2026071320260627
121555889 0 030699 1256 1560sphlibclang -march=native -O2 -fwrapv -Qunused-arguments -fPIC -fPIE -gdwarf-4 -Wall2026071320260627
122147366 0 031079 1216 1592sphlib-smallgcc -march=native -mtune=native -O3 -fwrapv -fPIC -fPIE -gdwarf-4 -Wall2026071320260627
122237366 0 031079 1216 1592sphlibgcc -march=native -mtune=native -O3 -fwrapv -fPIC -fPIE -gdwarf-4 -Wall2026071320260627
124365566 0 026855 1216 1592sphlibgcc -march=native -mtune=native -O2 -fwrapv -fPIC -fPIE -gdwarf-4 -Wall2026071320260627
124575566 0 026855 1216 1592sphlib-smallgcc -march=native -mtune=native -O2 -fwrapv -fPIC -fPIE -gdwarf-4 -Wall2026071320260627
125722469 0 027179 1256 1560compactclang -march=native -O3 -fwrapv -Qunused-arguments -fPIC -fPIE -gdwarf-4 -Wall2026071320260627
126522952 0 027723 1256 1560compactclang -march=native -O2 -fwrapv -Qunused-arguments -fPIC -fPIE -gdwarf-4 -Wall2026071320260627
129165249 0 028935 1216 1592compactgcc -march=native -mtune=native -O3 -fwrapv -fPIC -fPIE -gdwarf-4 -Wall2026071320260627
131415075 0 026014 1208 1592sphlibgcc -march=native -mtune=native -O -fwrapv -fPIC -fPIE -gdwarf-4 -Wall2026071320260627
131485075 0 026014 1208 1592sphlib-smallgcc -march=native -mtune=native -O -fwrapv -fPIC -fPIE -gdwarf-4 -Wall2026071320260627
131491985 0 023157 1248 1560compactclang -march=native -Os -fwrapv -Qunused-arguments -fPIC -fPIE -gdwarf-4 -Wall2026071320260627
133494725 0 026045 1248 1560sphlibclang -march=native -Os -fwrapv -Qunused-arguments -fPIC -fPIE -gdwarf-4 -Wall2026071320260627
134564725 0 026045 1248 1560sphlib-smallclang -march=native -Os -fwrapv -Qunused-arguments -fPIC -fPIE -gdwarf-4 -Wall2026071320260627
136355369 0 026080 1256 1496sphlibclang -march=native -O -fwrapv -Qunused-arguments -fPIC -fPIE -gdwarf-4 -Wall2026071320260627
136635369 0 026080 1256 1496sphlib-smallclang -march=native -O -fwrapv -Qunused-arguments -fPIC -fPIE -gdwarf-4 -Wall2026071320260627
147132479 0 025800 1256 1496compactclang -mcpu=native -O3 -fwrapv -Qunused-arguments -fPIC -fPIE -gdwarf-4 -Wall2026071320260627
151202278 0 023519 1216 1592compactgcc -march=native -mtune=native -O2 -fwrapv -fPIC -fPIE -gdwarf-4 -Wall2026071320260627
154524665 0 024213 1192 1560sphlib-smallgcc -march=native -mtune=native -Os -fwrapv -fPIC -fPIE -gdwarf-4 -Wall2026071320260627
154834665 0 024213 1192 1560sphlibgcc -march=native -mtune=native -Os -fwrapv -fPIC -fPIE -gdwarf-4 -Wall2026071320260627
170426121 0 029496 1256 1496sphlibclang -mcpu=native -O3 -fwrapv -Qunused-arguments -fPIC -fPIE -gdwarf-4 -Wall2026071320260627
170506121 0 029496 1256 1496sphlib-smallclang -mcpu=native -O3 -fwrapv -Qunused-arguments -fPIC -fPIE -gdwarf-4 -Wall2026071320260627
171531745 0 022408 1256 1496compactclang -march=native -O -fwrapv -Qunused-arguments -fPIC -fPIE -gdwarf-4 -Wall2026071320260627
173381818 0 022702 1208 1592compactgcc -march=native -mtune=native -O -fwrapv -fPIC -fPIE -gdwarf-4 -Wall2026071320260627
201331609 0 021125 1192 1560compactgcc -march=native -mtune=native -Os -fwrapv -fPIC -fPIE -gdwarf-4 -Wall2026071320260627

Compiler output


hash.c: hash.c:36:8: error: always_inline function '_mm256_loadu_si256' requires target feature 'avx', but would be inlined into function 'crypto_hash_sha512_blocksplusavx_constbranchindex' that is compiled without support for 'avx'
hash.c:    36 |   X0 = load256(iv);
hash.c:       |        ^
hash.c: hash.c:25:21: note: expanded from macro 'load256'
hash.c:    25 | #define load256(x) (_mm256_loadu_si256((void *) (x)))
hash.c:       |                     ^
hash.c: hash.c:36:8: error: AVX vector return of type '__m256i' (vector of 4 'long long' values) without 'avx' enabled changes the ABI
hash.c: hash.c:25:21: note: expanded from macro 'load256'
hash.c:    25 | #define load256(x) (_mm256_loadu_si256((void *) (x)))
hash.c:       |                     ^
hash.c: hash.c:37:8: error: always_inline function '_mm256_loadu_si256' requires target feature 'avx', but would be inlined into function 'crypto_hash_sha512_blocksplusavx_constbranchindex' that is compiled without support for 'avx'
hash.c:    37 |   X1 = load256(iv + 32);
hash.c:       |        ^
hash.c: hash.c:25:21: note: expanded from macro 'load256'
hash.c:    25 | #define load256(x) (_mm256_loadu_si256((void *) (x)))
hash.c:       |                     ^
hash.c: hash.c:37:8: error: AVX vector return of type '__m256i' (vector of 4 'long long' values) without 'avx' enabled changes the ABI
hash.c: hash.c:25:21: note: expanded from macro 'load256'
hash.c:    25 | #define load256(x) (_mm256_loadu_si256((void *) (x)))
hash.c:       |                     ^
hash.c: hash.c:39:3: error: always_inline function '_mm256_storeu_si256' requires target feature 'avx', but would be inlined into function 'crypto_hash_sha512_blocksplusavx_constbranchindex' that is compiled without support for 'avx'
hash.c:    39 |   store256(h,X0);
hash.c:       |   ^
hash.c: hash.c:26:24: note: expanded from macro 'store256'
hash.c:    26 | #define store256(x,y) (_mm256_storeu_si256((void *) (x),y))
hash.c: ...

Number of similar (implementation,compiler) pairs: 1, namely:
ImplementationCompiler
blocksplusavxclang -mcpu=native -O3 -fwrapv -Qunused-arguments -fPIC -fPIE -gdwarf-4 -Wall (Debian_Clang_19.1.7_(3+b1))

Compiler output


try.c: error[E0310]: the parameter type `T` may not live long enough
try.c:     --> /home/supercop/.cargo/registry/src/index.crates.io-1949cf8c6b5b557f/rustc-serialize-0.3.24/src/serialize.rs:1155:5
try.c:      |
try.c: 1155 |     fn decode<D: Decoder>(d: &mut D) -> Result<Cow<'static, T>, D::Error> {
try.c:      |     ^^^^^^^^^^^^^^^^^^^^^^^^^^^^^^^^^^^^^^^^^^^^^^^^^^^^^^^^^^^^^^^^^^^^^
try.c:      |     |
try.c:      |     the parameter type `T` must be valid for the static lifetime...
try.c:      |     ...so that the type `T` will meet its required lifetime bounds...
try.c:      |
try.c: note: ...that is required by this bound
try.c:     --> /usr/src/rustc-1.85.0/library/alloc/src/borrow.rs:179:30
try.c: help: consider adding an explicit lifetime bound
try.c:      |
try.c: 1151 | impl<'a, T: ?Sized + 'static> Decodable for Cow<'a, T>
try.c:      |                    +++++++++
try.c:
try.c: For more information about this error, try `rustc --explain E0310`.
try.c: error: could not compile `rustc-serialize` (lib) due to 1 previous error

Number of similar (implementation,compiler) pairs: 9, namely:
ImplementationCompiler
rust_cryptoclang -march=native -O2 -fwrapv -Qunused-arguments -fPIC -fPIE -gdwarf-4 -Wall (Debian_Clang_19.1.7_(3+b1))
rust_cryptoclang -march=native -O3 -fwrapv -Qunused-arguments -fPIC -fPIE -gdwarf-4 -Wall (Debian_Clang_19.1.7_(3+b1))
rust_cryptoclang -march=native -O -fwrapv -Qunused-arguments -fPIC -fPIE -gdwarf-4 -Wall (Debian_Clang_19.1.7_(3+b1))
rust_cryptoclang -march=native -Os -fwrapv -Qunused-arguments -fPIC -fPIE -gdwarf-4 -Wall (Debian_Clang_19.1.7_(3+b1))
rust_cryptoclang -mcpu=native -O3 -fwrapv -Qunused-arguments -fPIC -fPIE -gdwarf-4 -Wall (Debian_Clang_19.1.7_(3+b1))
rust_cryptogcc -march=native -mtune=native -O2 -fwrapv -fPIC -fPIE -gdwarf-4 -Wall (14.2.0)
rust_cryptogcc -march=native -mtune=native -O3 -fwrapv -fPIC -fPIE -gdwarf-4 -Wall (14.2.0)
rust_cryptogcc -march=native -mtune=native -O -fwrapv -fPIC -fPIE -gdwarf-4 -Wall (14.2.0)
rust_cryptogcc -march=native -mtune=native -Os -fwrapv -fPIC -fPIE -gdwarf-4 -Wall (14.2.0)

Compiler output


try.c: error: linking with `cc` failed: exit status: 1
try.c:   |
try.c:   = note: LC_ALL="C" PATH="/usr/lib/rustlib/x86_64-unknown-linux-gnu/bin:/usr/lib/lib/rustlib/x86_64-unknown-linux-gnu/bin:.../supercop-data/meteor,little/checksum/bin:.../supercop-data/meteor,little/sinceepoch/bin:.../supercop-data/meteor,little/compiledinfo/bin:.../supercop-data/meteor,little/killafter/bin:.../supercop-data/meteor,little/okcompilers/bin:.../supercop-data/meteor,little/scripts:/usr/sfw/bin:/usr/local/bin:/usr/local/bin:/usr/bin:/bin:/usr/games" VSLANG="1033" "cc" "-m64" "/tmp/rustcuawdB7/symbols.o" "<2 object files omitted>" "-Wl,--as-needed" "-Wl,-Bdynamic" "-ltry-anything" "-ltry-small" "-lsupercop" "-lkernelrandombytes" "-lcpucycles" "-lcrypto" "-lm" "-Wl,-Bstatic" ".../supercop-data/meteor,little/amd64/try/c/clang_-march=native_-O2_-fwrapv_-Qunused-arguments_-fPIC_-fPIE_-gdwarf-4_-Wall/constbranchindex/crypto_hash/sha512/rust_sha2/work/target/release/deps/{libcrypto_hash_sha512-e3904e1be4b56823.rlib,libsha2-d9fe3e64ab7a35b5.rlib,libcpuid_bool-a4038e1fb04f065f.rlib,libcfg_if-52860a7ddc158427.rlib,libopaque_debug-851f5dc4fc7cb701.rlib,libdigest-1689fddb67a4db6c.rlib,libblock_buffer-15129c7af7775380.rlib,libgeneric_array-abd9aca6363faef4.rlib,libtypenum-9bd82fdfda23287d.rlib}" "/usr/lib/rustlib/x86_64-unknown-linux-gnu/lib/{libstd-735cce14533b4b14.rlib,libpanic_unwind-b6737e136067c5af.rlib,libobject-1303c4fadc744db1.rlib,libmemchr-4307c8d3168c78e3.rlib,libaddr2line-78c32e4a87333dbd.rlib,libgimli-0fc0e49acceead35.rlib,librustc_demangle-a0b9c22792c85e39.rlib,libstd_detect-83f7e4a793b39811.rlib,libhashbrown-0d7f81c4b968ca96.rlib,librustc_std_workspace_alloc-6a65191895fd580e.rlib,libminiz_oxide-357876da66360401.rlib,libadler-0c1d85aa00dff5fa.rlib,libunwind-d8e6262062f0cd85.rlib,libcfg_if-2424c0e00d5dc157.rlib,liblibc-d9b6e8d963ea0be1.rlib,liballoc-ecc6700de60a5b56.rlib,librustc_std_workspace_core-6129c8f9aed81c8b.rlib,libcore-2d4b9a0883bc3ecf.rlib,libcompiler_builtins-bdfb7378ad19badb.rlib}" "-Wl,-Bdynamic" "-lgcc_s" "-lutil" "-lrt" "-lpthread" "-lm" "-ldl" "-lc" "-Wl,--eh-frame-hdr" "-Wl,-z,noexecstack" "-L" ".../supercop-data/meteor,little/amd64/lib" "-L" ".../supercop-data/meteor,little/amd64/try/c/clang_-march=native_-O2_-fwrapv_-Qunused-arguments_-fPIC_-fPIE_-gdwarf-4_-Wall/constbranchindex/crypto_hash/sha512/rust_sha2/work/target/release/build/crypto_hash_sha512-839752891230725c/out" "-L" "/usr/lib/rustlib/x86_64-unknown-linux-gnu/lib" "-o" ".../supercop-data/meteor,little/amd64/try/c/clang_-march=native_-O2_-fwrapv_-Qunused-arguments_-fPIC_-fPIE_-gdwarf-4_-Wall/constbranchindex/crypto_hash/sha512/rust_sha2/work/target/release/deps/try_small-a30103899c1cc7ad" "-Wl,--gc-sections" "-pie" "-Wl,-z,relro,-z,now" "-Wl,-O1" "-Wl,--strip-debug" "-nodefaultlibs"
try.c:   = note: some arguments are omitted. use `--verbose` to show all linker arguments
try.c:   = note: /usr/bin/ld: cannot find -lcpucycles: No such file or directory
try.c:           collect2: error: ld returned 1 exit status
try.c:
try.c:
try.c: error: could not compile `crypto_hash_sha512` (bin "try-small") due to 1 previous error

Number of similar (implementation,compiler) pairs: 1, namely:
ImplementationCompiler
rust_sha2clang -march=native -O2 -fwrapv -Qunused-arguments -fPIC -fPIE -gdwarf-4 -Wall (Debian_Clang_19.1.7_(3+b1))

Compiler output


try.c: error: linking with `cc` failed: exit status: 1
try.c:   |
try.c:   = note: LC_ALL="C" PATH="/usr/lib/rustlib/x86_64-unknown-linux-gnu/bin:/usr/lib/lib/rustlib/x86_64-unknown-linux-gnu/bin:.../supercop-data/meteor,little/checksum/bin:.../supercop-data/meteor,little/sinceepoch/bin:.../supercop-data/meteor,little/compiledinfo/bin:.../supercop-data/meteor,little/killafter/bin:.../supercop-data/meteor,little/okcompilers/bin:.../supercop-data/meteor,little/scripts:/usr/sfw/bin:/usr/local/bin:/usr/local/bin:/usr/bin:/bin:/usr/games" VSLANG="1033" "cc" "-m64" "/tmp/rustcG0ype9/symbols.o" "<2 object files omitted>" "-Wl,--as-needed" "-Wl,-Bdynamic" "-ltry-anything" "-ltry-small" "-lsupercop" "-lkernelrandombytes" "-lcpucycles" "-lcrypto" "-lm" "-Wl,-Bstatic" ".../supercop-data/meteor,little/amd64/try/c/clang_-march=native_-O3_-fwrapv_-Qunused-arguments_-fPIC_-fPIE_-gdwarf-4_-Wall/constbranchindex/crypto_hash/sha512/rust_sha2/work/target/release/deps/{libcrypto_hash_sha512-e3904e1be4b56823.rlib,libsha2-d9fe3e64ab7a35b5.rlib,libcpuid_bool-a4038e1fb04f065f.rlib,libcfg_if-52860a7ddc158427.rlib,libopaque_debug-851f5dc4fc7cb701.rlib,libdigest-1689fddb67a4db6c.rlib,libblock_buffer-15129c7af7775380.rlib,libgeneric_array-abd9aca6363faef4.rlib,libtypenum-9bd82fdfda23287d.rlib}" "/usr/lib/rustlib/x86_64-unknown-linux-gnu/lib/{libstd-735cce14533b4b14.rlib,libpanic_unwind-b6737e136067c5af.rlib,libobject-1303c4fadc744db1.rlib,libmemchr-4307c8d3168c78e3.rlib,libaddr2line-78c32e4a87333dbd.rlib,libgimli-0fc0e49acceead35.rlib,librustc_demangle-a0b9c22792c85e39.rlib,libstd_detect-83f7e4a793b39811.rlib,libhashbrown-0d7f81c4b968ca96.rlib,librustc_std_workspace_alloc-6a65191895fd580e.rlib,libminiz_oxide-357876da66360401.rlib,libadler-0c1d85aa00dff5fa.rlib,libunwind-d8e6262062f0cd85.rlib,libcfg_if-2424c0e00d5dc157.rlib,liblibc-d9b6e8d963ea0be1.rlib,liballoc-ecc6700de60a5b56.rlib,librustc_std_workspace_core-6129c8f9aed81c8b.rlib,libcore-2d4b9a0883bc3ecf.rlib,libcompiler_builtins-bdfb7378ad19badb.rlib}" "-Wl,-Bdynamic" "-lgcc_s" "-lutil" "-lrt" "-lpthread" "-lm" "-ldl" "-lc" "-Wl,--eh-frame-hdr" "-Wl,-z,noexecstack" "-L" ".../supercop-data/meteor,little/amd64/lib" "-L" ".../supercop-data/meteor,little/amd64/try/c/clang_-march=native_-O3_-fwrapv_-Qunused-arguments_-fPIC_-fPIE_-gdwarf-4_-Wall/constbranchindex/crypto_hash/sha512/rust_sha2/work/target/release/build/crypto_hash_sha512-839752891230725c/out" "-L" "/usr/lib/rustlib/x86_64-unknown-linux-gnu/lib" "-o" ".../supercop-data/meteor,little/amd64/try/c/clang_-march=native_-O3_-fwrapv_-Qunused-arguments_-fPIC_-fPIE_-gdwarf-4_-Wall/constbranchindex/crypto_hash/sha512/rust_sha2/work/target/release/deps/try_small-a30103899c1cc7ad" "-Wl,--gc-sections" "-pie" "-Wl,-z,relro,-z,now" "-Wl,-O1" "-Wl,--strip-debug" "-nodefaultlibs"
try.c:   = note: some arguments are omitted. use `--verbose` to show all linker arguments
try.c:   = note: /usr/bin/ld: cannot find -lcpucycles: No such file or directory
try.c:           collect2: error: ld returned 1 exit status
try.c:
try.c:
try.c: error: could not compile `crypto_hash_sha512` (bin "try-small") due to 1 previous error

Number of similar (implementation,compiler) pairs: 1, namely:
ImplementationCompiler
rust_sha2clang -march=native -O3 -fwrapv -Qunused-arguments -fPIC -fPIE -gdwarf-4 -Wall (Debian_Clang_19.1.7_(3+b1))

Compiler output


try.c: error: linking with `cc` failed: exit status: 1
try.c:   |
try.c:   = note: LC_ALL="C" PATH="/usr/lib/rustlib/x86_64-unknown-linux-gnu/bin:/usr/lib/lib/rustlib/x86_64-unknown-linux-gnu/bin:.../supercop-data/meteor,little/checksum/bin:.../supercop-data/meteor,little/sinceepoch/bin:.../supercop-data/meteor,little/compiledinfo/bin:.../supercop-data/meteor,little/killafter/bin:.../supercop-data/meteor,little/okcompilers/bin:.../supercop-data/meteor,little/scripts:/usr/sfw/bin:/usr/local/bin:/usr/local/bin:/usr/bin:/bin:/usr/games" VSLANG="1033" "cc" "-m64" "/tmp/rustcllgEXr/symbols.o" "<2 object files omitted>" "-Wl,--as-needed" "-Wl,-Bdynamic" "-lmeasure-anything" "-lmeasure" "-lsupercop" "-lkernelrandombytes" "-lcpucycles" "-lcrypto" "-lm" "-Wl,-Bstatic" ".../supercop-data/meteor,little/amd64/try/c/clang_-march=native_-O_-fwrapv_-Qunused-arguments_-fPIC_-fPIE_-gdwarf-4_-Wall/constbranchindex/crypto_hash/sha512/rust_sha2/work/target/release/deps/{libcrypto_hash_sha512-e3904e1be4b56823.rlib,libsha2-d9fe3e64ab7a35b5.rlib,libcpuid_bool-a4038e1fb04f065f.rlib,libcfg_if-52860a7ddc158427.rlib,libopaque_debug-851f5dc4fc7cb701.rlib,libdigest-1689fddb67a4db6c.rlib,libblock_buffer-15129c7af7775380.rlib,libgeneric_array-abd9aca6363faef4.rlib,libtypenum-9bd82fdfda23287d.rlib}" "/usr/lib/rustlib/x86_64-unknown-linux-gnu/lib/{libstd-735cce14533b4b14.rlib,libpanic_unwind-b6737e136067c5af.rlib,libobject-1303c4fadc744db1.rlib,libmemchr-4307c8d3168c78e3.rlib,libaddr2line-78c32e4a87333dbd.rlib,libgimli-0fc0e49acceead35.rlib,librustc_demangle-a0b9c22792c85e39.rlib,libstd_detect-83f7e4a793b39811.rlib,libhashbrown-0d7f81c4b968ca96.rlib,librustc_std_workspace_alloc-6a65191895fd580e.rlib,libminiz_oxide-357876da66360401.rlib,libadler-0c1d85aa00dff5fa.rlib,libunwind-d8e6262062f0cd85.rlib,libcfg_if-2424c0e00d5dc157.rlib,liblibc-d9b6e8d963ea0be1.rlib,liballoc-ecc6700de60a5b56.rlib,librustc_std_workspace_core-6129c8f9aed81c8b.rlib,libcore-2d4b9a0883bc3ecf.rlib,libcompiler_builtins-bdfb7378ad19badb.rlib}" "-Wl,-Bdynamic" "-lgcc_s" "-lutil" "-lrt" "-lpthread" "-lm" "-ldl" "-lc" "-Wl,--eh-frame-hdr" "-Wl,-z,noexecstack" "-L" ".../supercop-data/meteor,little/amd64/lib" "-L" ".../supercop-data/meteor,little/amd64/try/c/clang_-march=native_-O_-fwrapv_-Qunused-arguments_-fPIC_-fPIE_-gdwarf-4_-Wall/constbranchindex/crypto_hash/sha512/rust_sha2/work/target/release/build/crypto_hash_sha512-839752891230725c/out" "-L" "/usr/lib/rustlib/x86_64-unknown-linux-gnu/lib" "-o" ".../supercop-data/meteor,little/amd64/try/c/clang_-march=native_-O_-fwrapv_-Qunused-arguments_-fPIC_-fPIE_-gdwarf-4_-Wall/constbranchindex/crypto_hash/sha512/rust_sha2/work/target/release/deps/measure-ce928f382713bb06" "-Wl,--gc-sections" "-pie" "-Wl,-z,relro,-z,now" "-Wl,-O1" "-Wl,--strip-debug" "-nodefaultlibs"
try.c:   = note: some arguments are omitted. use `--verbose` to show all linker arguments
try.c:   = note: /usr/bin/ld: cannot find -lcpucycles: No such file or directory
try.c:           collect2: error: ld returned 1 exit status
try.c:
try.c:
try.c: error: could not compile `crypto_hash_sha512` (bin "measure") due to 1 previous error

Number of similar (implementation,compiler) pairs: 1, namely:
ImplementationCompiler
rust_sha2clang -march=native -O -fwrapv -Qunused-arguments -fPIC -fPIE -gdwarf-4 -Wall (Debian_Clang_19.1.7_(3+b1))

Compiler output


try.c: error: linking with `cc` failed: exit status: 1
try.c:   |
try.c:   = note: LC_ALL="C" PATH="/usr/lib/rustlib/x86_64-unknown-linux-gnu/bin:/usr/lib/lib/rustlib/x86_64-unknown-linux-gnu/bin:.../supercop-data/meteor,little/checksum/bin:.../supercop-data/meteor,little/sinceepoch/bin:.../supercop-data/meteor,little/compiledinfo/bin:.../supercop-data/meteor,little/killafter/bin:.../supercop-data/meteor,little/okcompilers/bin:.../supercop-data/meteor,little/scripts:/usr/sfw/bin:/usr/local/bin:/usr/local/bin:/usr/bin:/bin:/usr/games" VSLANG="1033" "cc" "-m64" "/tmp/rustcLq9p8p/symbols.o" "<2 object files omitted>" "-Wl,--as-needed" "-Wl,-Bdynamic" "-ltry-anything" "-ltry-small" "-lsupercop" "-lkernelrandombytes" "-lcpucycles" "-lcrypto" "-lm" "-Wl,-Bstatic" ".../supercop-data/meteor,little/amd64/try/c/clang_-march=native_-Os_-fwrapv_-Qunused-arguments_-fPIC_-fPIE_-gdwarf-4_-Wall/constbranchindex/crypto_hash/sha512/rust_sha2/work/target/release/deps/{libcrypto_hash_sha512-e3904e1be4b56823.rlib,libsha2-d9fe3e64ab7a35b5.rlib,libcpuid_bool-a4038e1fb04f065f.rlib,libcfg_if-52860a7ddc158427.rlib,libopaque_debug-851f5dc4fc7cb701.rlib,libdigest-1689fddb67a4db6c.rlib,libblock_buffer-15129c7af7775380.rlib,libgeneric_array-abd9aca6363faef4.rlib,libtypenum-9bd82fdfda23287d.rlib}" "/usr/lib/rustlib/x86_64-unknown-linux-gnu/lib/{libstd-735cce14533b4b14.rlib,libpanic_unwind-b6737e136067c5af.rlib,libobject-1303c4fadc744db1.rlib,libmemchr-4307c8d3168c78e3.rlib,libaddr2line-78c32e4a87333dbd.rlib,libgimli-0fc0e49acceead35.rlib,librustc_demangle-a0b9c22792c85e39.rlib,libstd_detect-83f7e4a793b39811.rlib,libhashbrown-0d7f81c4b968ca96.rlib,librustc_std_workspace_alloc-6a65191895fd580e.rlib,libminiz_oxide-357876da66360401.rlib,libadler-0c1d85aa00dff5fa.rlib,libunwind-d8e6262062f0cd85.rlib,libcfg_if-2424c0e00d5dc157.rlib,liblibc-d9b6e8d963ea0be1.rlib,liballoc-ecc6700de60a5b56.rlib,librustc_std_workspace_core-6129c8f9aed81c8b.rlib,libcore-2d4b9a0883bc3ecf.rlib,libcompiler_builtins-bdfb7378ad19badb.rlib}" "-Wl,-Bdynamic" "-lgcc_s" "-lutil" "-lrt" "-lpthread" "-lm" "-ldl" "-lc" "-Wl,--eh-frame-hdr" "-Wl,-z,noexecstack" "-L" ".../supercop-data/meteor,little/amd64/lib" "-L" ".../supercop-data/meteor,little/amd64/try/c/clang_-march=native_-Os_-fwrapv_-Qunused-arguments_-fPIC_-fPIE_-gdwarf-4_-Wall/constbranchindex/crypto_hash/sha512/rust_sha2/work/target/release/build/crypto_hash_sha512-839752891230725c/out" "-L" "/usr/lib/rustlib/x86_64-unknown-linux-gnu/lib" "-o" ".../supercop-data/meteor,little/amd64/try/c/clang_-march=native_-Os_-fwrapv_-Qunused-arguments_-fPIC_-fPIE_-gdwarf-4_-Wall/constbranchindex/crypto_hash/sha512/rust_sha2/work/target/release/deps/try_small-a30103899c1cc7ad" "-Wl,--gc-sections" "-pie" "-Wl,-z,relro,-z,now" "-Wl,-O1" "-Wl,--strip-debug" "-nodefaultlibs"
try.c:   = note: some arguments are omitted. use `--verbose` to show all linker arguments
try.c:   = note: /usr/bin/ld: cannot find -lcpucycles: No such file or directory
try.c:           collect2: error: ld returned 1 exit status
try.c:
try.c:
try.c: error: could not compile `crypto_hash_sha512` (bin "try-small") due to 1 previous error

Number of similar (implementation,compiler) pairs: 1, namely:
ImplementationCompiler
rust_sha2clang -march=native -Os -fwrapv -Qunused-arguments -fPIC -fPIE -gdwarf-4 -Wall (Debian_Clang_19.1.7_(3+b1))

Compiler output


try.c: error: linking with `cc` failed: exit status: 1
try.c:   |
try.c:   = note: LC_ALL="C" PATH="/usr/lib/rustlib/x86_64-unknown-linux-gnu/bin:/usr/lib/lib/rustlib/x86_64-unknown-linux-gnu/bin:.../supercop-data/meteor,little/checksum/bin:.../supercop-data/meteor,little/sinceepoch/bin:.../supercop-data/meteor,little/compiledinfo/bin:.../supercop-data/meteor,little/killafter/bin:.../supercop-data/meteor,little/okcompilers/bin:.../supercop-data/meteor,little/scripts:/usr/sfw/bin:/usr/local/bin:/usr/local/bin:/usr/bin:/bin:/usr/games" VSLANG="1033" "cc" "-m64" "/tmp/rustcQyKFVT/symbols.o" "<2 object files omitted>" "-Wl,--as-needed" "-Wl,-Bdynamic" "-ltry-anything" "-ltry" "-lsupercop" "-lkernelrandombytes" "-lcpucycles" "-lcrypto" "-lm" "-Wl,-Bstatic" ".../supercop-data/meteor,little/amd64/try/c/clang_-mcpu=native_-O3_-fwrapv_-Qunused-arguments_-fPIC_-fPIE_-gdwarf-4_-Wall/constbranchindex/crypto_hash/sha512/rust_sha2/work/target/release/deps/{libcrypto_hash_sha512-e3904e1be4b56823.rlib,libsha2-d9fe3e64ab7a35b5.rlib,libcpuid_bool-a4038e1fb04f065f.rlib,libcfg_if-52860a7ddc158427.rlib,libopaque_debug-851f5dc4fc7cb701.rlib,libdigest-1689fddb67a4db6c.rlib,libblock_buffer-15129c7af7775380.rlib,libgeneric_array-abd9aca6363faef4.rlib,libtypenum-9bd82fdfda23287d.rlib}" "/usr/lib/rustlib/x86_64-unknown-linux-gnu/lib/{libstd-735cce14533b4b14.rlib,libpanic_unwind-b6737e136067c5af.rlib,libobject-1303c4fadc744db1.rlib,libmemchr-4307c8d3168c78e3.rlib,libaddr2line-78c32e4a87333dbd.rlib,libgimli-0fc0e49acceead35.rlib,librustc_demangle-a0b9c22792c85e39.rlib,libstd_detect-83f7e4a793b39811.rlib,libhashbrown-0d7f81c4b968ca96.rlib,librustc_std_workspace_alloc-6a65191895fd580e.rlib,libminiz_oxide-357876da66360401.rlib,libadler-0c1d85aa00dff5fa.rlib,libunwind-d8e6262062f0cd85.rlib,libcfg_if-2424c0e00d5dc157.rlib,liblibc-d9b6e8d963ea0be1.rlib,liballoc-ecc6700de60a5b56.rlib,librustc_std_workspace_core-6129c8f9aed81c8b.rlib,libcore-2d4b9a0883bc3ecf.rlib,libcompiler_builtins-bdfb7378ad19badb.rlib}" "-Wl,-Bdynamic" "-lgcc_s" "-lutil" "-lrt" "-lpthread" "-lm" "-ldl" "-lc" "-Wl,--eh-frame-hdr" "-Wl,-z,noexecstack" "-L" ".../supercop-data/meteor,little/amd64/lib" "-L" ".../supercop-data/meteor,little/amd64/try/c/clang_-mcpu=native_-O3_-fwrapv_-Qunused-arguments_-fPIC_-fPIE_-gdwarf-4_-Wall/constbranchindex/crypto_hash/sha512/rust_sha2/work/target/release/build/crypto_hash_sha512-839752891230725c/out" "-L" "/usr/lib/rustlib/x86_64-unknown-linux-gnu/lib" "-o" ".../supercop-data/meteor,little/amd64/try/c/clang_-mcpu=native_-O3_-fwrapv_-Qunused-arguments_-fPIC_-fPIE_-gdwarf-4_-Wall/constbranchindex/crypto_hash/sha512/rust_sha2/work/target/release/deps/try-9b204b3b2fd8b804" "-Wl,--gc-sections" "-pie" "-Wl,-z,relro,-z,now" "-Wl,-O1" "-Wl,--strip-debug" "-nodefaultlibs"
try.c:   = note: some arguments are omitted. use `--verbose` to show all linker arguments
try.c:   = note: /usr/bin/ld: cannot find -lcpucycles: No such file or directory
try.c:           collect2: error: ld returned 1 exit status
try.c:
try.c:
try.c: error: could not compile `crypto_hash_sha512` (bin "try") due to 1 previous error

Number of similar (implementation,compiler) pairs: 1, namely:
ImplementationCompiler
rust_sha2clang -mcpu=native -O3 -fwrapv -Qunused-arguments -fPIC -fPIE -gdwarf-4 -Wall (Debian_Clang_19.1.7_(3+b1))

Compiler output


try.c: error: linking with `cc` failed: exit status: 1
try.c:   |
try.c:   = note: LC_ALL="C" PATH="/usr/lib/rustlib/x86_64-unknown-linux-gnu/bin:/usr/lib/lib/rustlib/x86_64-unknown-linux-gnu/bin:.../supercop-data/meteor,little/checksum/bin:.../supercop-data/meteor,little/sinceepoch/bin:.../supercop-data/meteor,little/compiledinfo/bin:.../supercop-data/meteor,little/killafter/bin:.../supercop-data/meteor,little/okcompilers/bin:.../supercop-data/meteor,little/scripts:/usr/sfw/bin:/usr/local/bin:/usr/local/bin:/usr/bin:/bin:/usr/games" VSLANG="1033" "cc" "-m64" "/tmp/rustcJBTkQG/symbols.o" "<2 object files omitted>" "-Wl,--as-needed" "-Wl,-Bdynamic" "-lmeasure-anything" "-lmeasure" "-lsupercop" "-lkernelrandombytes" "-lcpucycles" "-lcrypto" "-lm" "-Wl,-Bstatic" ".../supercop-data/meteor,little/amd64/try/c/gcc_-march=native_-mtune=native_-O2_-fwrapv_-fPIC_-fPIE_-gdwarf-4_-Wall/constbranchindex/crypto_hash/sha512/rust_sha2/work/target/release/deps/{libcrypto_hash_sha512-e3904e1be4b56823.rlib,libsha2-d9fe3e64ab7a35b5.rlib,libcpuid_bool-a4038e1fb04f065f.rlib,libcfg_if-52860a7ddc158427.rlib,libopaque_debug-851f5dc4fc7cb701.rlib,libdigest-1689fddb67a4db6c.rlib,libblock_buffer-15129c7af7775380.rlib,libgeneric_array-abd9aca6363faef4.rlib,libtypenum-9bd82fdfda23287d.rlib}" "/usr/lib/rustlib/x86_64-unknown-linux-gnu/lib/{libstd-735cce14533b4b14.rlib,libpanic_unwind-b6737e136067c5af.rlib,libobject-1303c4fadc744db1.rlib,libmemchr-4307c8d3168c78e3.rlib,libaddr2line-78c32e4a87333dbd.rlib,libgimli-0fc0e49acceead35.rlib,librustc_demangle-a0b9c22792c85e39.rlib,libstd_detect-83f7e4a793b39811.rlib,libhashbrown-0d7f81c4b968ca96.rlib,librustc_std_workspace_alloc-6a65191895fd580e.rlib,libminiz_oxide-357876da66360401.rlib,libadler-0c1d85aa00dff5fa.rlib,libunwind-d8e6262062f0cd85.rlib,libcfg_if-2424c0e00d5dc157.rlib,liblibc-d9b6e8d963ea0be1.rlib,liballoc-ecc6700de60a5b56.rlib,librustc_std_workspace_core-6129c8f9aed81c8b.rlib,libcore-2d4b9a0883bc3ecf.rlib,libcompiler_builtins-bdfb7378ad19badb.rlib}" "-Wl,-Bdynamic" "-lgcc_s" "-lutil" "-lrt" "-lpthread" "-lm" "-ldl" "-lc" "-Wl,--eh-frame-hdr" "-Wl,-z,noexecstack" "-L" ".../supercop-data/meteor,little/amd64/lib" "-L" ".../supercop-data/meteor,little/amd64/try/c/gcc_-march=native_-mtune=native_-O2_-fwrapv_-fPIC_-fPIE_-gdwarf-4_-Wall/constbranchindex/crypto_hash/sha512/rust_sha2/work/target/release/build/crypto_hash_sha512-839752891230725c/out" "-L" "/usr/lib/rustlib/x86_64-unknown-linux-gnu/lib" "-o" ".../supercop-data/meteor,little/amd64/try/c/gcc_-march=native_-mtune=native_-O2_-fwrapv_-fPIC_-fPIE_-gdwarf-4_-Wall/constbranchindex/crypto_hash/sha512/rust_sha2/work/target/release/deps/measure-ce928f382713bb06" "-Wl,--gc-sections" "-pie" "-Wl,-z,relro,-z,now" "-Wl,-O1" "-Wl,--strip-debug" "-nodefaultlibs"
try.c:   = note: some arguments are omitted. use `--verbose` to show all linker arguments
try.c:   = note: /usr/bin/ld: cannot find -lcpucycles: No such file or directory
try.c:           collect2: error: ld returned 1 exit status
try.c:
try.c:
try.c: error: could not compile `crypto_hash_sha512` (bin "measure") due to 1 previous error

Number of similar (implementation,compiler) pairs: 1, namely:
ImplementationCompiler
rust_sha2gcc -march=native -mtune=native -O2 -fwrapv -fPIC -fPIE -gdwarf-4 -Wall (14.2.0)

Compiler output


try.c: error: linking with `cc` failed: exit status: 1
try.c:   |
try.c:   = note: LC_ALL="C" PATH="/usr/lib/rustlib/x86_64-unknown-linux-gnu/bin:/usr/lib/lib/rustlib/x86_64-unknown-linux-gnu/bin:.../supercop-data/meteor,little/checksum/bin:.../supercop-data/meteor,little/sinceepoch/bin:.../supercop-data/meteor,little/compiledinfo/bin:.../supercop-data/meteor,little/killafter/bin:.../supercop-data/meteor,little/okcompilers/bin:.../supercop-data/meteor,little/scripts:/usr/sfw/bin:/usr/local/bin:/usr/local/bin:/usr/bin:/bin:/usr/games" VSLANG="1033" "cc" "-m64" "/tmp/rustcVh5B98/symbols.o" "<2 object files omitted>" "-Wl,--as-needed" "-Wl,-Bdynamic" "-ltry-anything" "-ltry" "-lsupercop" "-lkernelrandombytes" "-lcpucycles" "-lcrypto" "-lm" "-Wl,-Bstatic" ".../supercop-data/meteor,little/amd64/try/c/gcc_-march=native_-mtune=native_-O3_-fwrapv_-fPIC_-fPIE_-gdwarf-4_-Wall/constbranchindex/crypto_hash/sha512/rust_sha2/work/target/release/deps/{libcrypto_hash_sha512-e3904e1be4b56823.rlib,libsha2-d9fe3e64ab7a35b5.rlib,libcpuid_bool-a4038e1fb04f065f.rlib,libcfg_if-52860a7ddc158427.rlib,libopaque_debug-851f5dc4fc7cb701.rlib,libdigest-1689fddb67a4db6c.rlib,libblock_buffer-15129c7af7775380.rlib,libgeneric_array-abd9aca6363faef4.rlib,libtypenum-9bd82fdfda23287d.rlib}" "/usr/lib/rustlib/x86_64-unknown-linux-gnu/lib/{libstd-735cce14533b4b14.rlib,libpanic_unwind-b6737e136067c5af.rlib,libobject-1303c4fadc744db1.rlib,libmemchr-4307c8d3168c78e3.rlib,libaddr2line-78c32e4a87333dbd.rlib,libgimli-0fc0e49acceead35.rlib,librustc_demangle-a0b9c22792c85e39.rlib,libstd_detect-83f7e4a793b39811.rlib,libhashbrown-0d7f81c4b968ca96.rlib,librustc_std_workspace_alloc-6a65191895fd580e.rlib,libminiz_oxide-357876da66360401.rlib,libadler-0c1d85aa00dff5fa.rlib,libunwind-d8e6262062f0cd85.rlib,libcfg_if-2424c0e00d5dc157.rlib,liblibc-d9b6e8d963ea0be1.rlib,liballoc-ecc6700de60a5b56.rlib,librustc_std_workspace_core-6129c8f9aed81c8b.rlib,libcore-2d4b9a0883bc3ecf.rlib,libcompiler_builtins-bdfb7378ad19badb.rlib}" "-Wl,-Bdynamic" "-lgcc_s" "-lutil" "-lrt" "-lpthread" "-lm" "-ldl" "-lc" "-Wl,--eh-frame-hdr" "-Wl,-z,noexecstack" "-L" ".../supercop-data/meteor,little/amd64/lib" "-L" ".../supercop-data/meteor,little/amd64/try/c/gcc_-march=native_-mtune=native_-O3_-fwrapv_-fPIC_-fPIE_-gdwarf-4_-Wall/constbranchindex/crypto_hash/sha512/rust_sha2/work/target/release/build/crypto_hash_sha512-839752891230725c/out" "-L" "/usr/lib/rustlib/x86_64-unknown-linux-gnu/lib" "-o" ".../supercop-data/meteor,little/amd64/try/c/gcc_-march=native_-mtune=native_-O3_-fwrapv_-fPIC_-fPIE_-gdwarf-4_-Wall/constbranchindex/crypto_hash/sha512/rust_sha2/work/target/release/deps/try-9b204b3b2fd8b804" "-Wl,--gc-sections" "-pie" "-Wl,-z,relro,-z,now" "-Wl,-O1" "-Wl,--strip-debug" "-nodefaultlibs"
try.c:   = note: some arguments are omitted. use `--verbose` to show all linker arguments
try.c:   = note: /usr/bin/ld: cannot find -lcpucycles: No such file or directory
try.c:           collect2: error: ld returned 1 exit status
try.c:
try.c:
try.c: error: could not compile `crypto_hash_sha512` (bin "try") due to 1 previous error

Number of similar (implementation,compiler) pairs: 1, namely:
ImplementationCompiler
rust_sha2gcc -march=native -mtune=native -O3 -fwrapv -fPIC -fPIE -gdwarf-4 -Wall (14.2.0)

Compiler output


try.c: error: linking with `cc` failed: exit status: 1
try.c:   |
try.c:   = note: LC_ALL="C" PATH="/usr/lib/rustlib/x86_64-unknown-linux-gnu/bin:/usr/lib/lib/rustlib/x86_64-unknown-linux-gnu/bin:.../supercop-data/meteor,little/checksum/bin:.../supercop-data/meteor,little/sinceepoch/bin:.../supercop-data/meteor,little/compiledinfo/bin:.../supercop-data/meteor,little/killafter/bin:.../supercop-data/meteor,little/okcompilers/bin:.../supercop-data/meteor,little/scripts:/usr/sfw/bin:/usr/local/bin:/usr/local/bin:/usr/bin:/bin:/usr/games" VSLANG="1033" "cc" "-m64" "/tmp/rustc7YjQZv/symbols.o" "<2 object files omitted>" "-Wl,--as-needed" "-Wl,-Bdynamic" "-ltry-anything" "-ltry-small" "-lsupercop" "-lkernelrandombytes" "-lcpucycles" "-lcrypto" "-lm" "-Wl,-Bstatic" ".../supercop-data/meteor,little/amd64/try/c/gcc_-march=native_-mtune=native_-O_-fwrapv_-fPIC_-fPIE_-gdwarf-4_-Wall/constbranchindex/crypto_hash/sha512/rust_sha2/work/target/release/deps/{libcrypto_hash_sha512-e3904e1be4b56823.rlib,libsha2-d9fe3e64ab7a35b5.rlib,libcpuid_bool-a4038e1fb04f065f.rlib,libcfg_if-52860a7ddc158427.rlib,libopaque_debug-851f5dc4fc7cb701.rlib,libdigest-1689fddb67a4db6c.rlib,libblock_buffer-15129c7af7775380.rlib,libgeneric_array-abd9aca6363faef4.rlib,libtypenum-9bd82fdfda23287d.rlib}" "/usr/lib/rustlib/x86_64-unknown-linux-gnu/lib/{libstd-735cce14533b4b14.rlib,libpanic_unwind-b6737e136067c5af.rlib,libobject-1303c4fadc744db1.rlib,libmemchr-4307c8d3168c78e3.rlib,libaddr2line-78c32e4a87333dbd.rlib,libgimli-0fc0e49acceead35.rlib,librustc_demangle-a0b9c22792c85e39.rlib,libstd_detect-83f7e4a793b39811.rlib,libhashbrown-0d7f81c4b968ca96.rlib,librustc_std_workspace_alloc-6a65191895fd580e.rlib,libminiz_oxide-357876da66360401.rlib,libadler-0c1d85aa00dff5fa.rlib,libunwind-d8e6262062f0cd85.rlib,libcfg_if-2424c0e00d5dc157.rlib,liblibc-d9b6e8d963ea0be1.rlib,liballoc-ecc6700de60a5b56.rlib,librustc_std_workspace_core-6129c8f9aed81c8b.rlib,libcore-2d4b9a0883bc3ecf.rlib,libcompiler_builtins-bdfb7378ad19badb.rlib}" "-Wl,-Bdynamic" "-lgcc_s" "-lutil" "-lrt" "-lpthread" "-lm" "-ldl" "-lc" "-Wl,--eh-frame-hdr" "-Wl,-z,noexecstack" "-L" ".../supercop-data/meteor,little/amd64/lib" "-L" ".../supercop-data/meteor,little/amd64/try/c/gcc_-march=native_-mtune=native_-O_-fwrapv_-fPIC_-fPIE_-gdwarf-4_-Wall/constbranchindex/crypto_hash/sha512/rust_sha2/work/target/release/build/crypto_hash_sha512-839752891230725c/out" "-L" "/usr/lib/rustlib/x86_64-unknown-linux-gnu/lib" "-o" ".../supercop-data/meteor,little/amd64/try/c/gcc_-march=native_-mtune=native_-O_-fwrapv_-fPIC_-fPIE_-gdwarf-4_-Wall/constbranchindex/crypto_hash/sha512/rust_sha2/work/target/release/deps/try_small-a30103899c1cc7ad" "-Wl,--gc-sections" "-pie" "-Wl,-z,relro,-z,now" "-Wl,-O1" "-Wl,--strip-debug" "-nodefaultlibs"
try.c:   = note: some arguments are omitted. use `--verbose` to show all linker arguments
try.c:   = note: /usr/bin/ld: cannot find -lcpucycles: No such file or directory
try.c:           collect2: error: ld returned 1 exit status
try.c:
try.c:
try.c: error: could not compile `crypto_hash_sha512` (bin "try-small") due to 1 previous error

Number of similar (implementation,compiler) pairs: 1, namely:
ImplementationCompiler
rust_sha2gcc -march=native -mtune=native -O -fwrapv -fPIC -fPIE -gdwarf-4 -Wall (14.2.0)

Compiler output


try.c: error: linking with `cc` failed: exit status: 1
try.c:   |
try.c:   = note: LC_ALL="C" PATH="/usr/lib/rustlib/x86_64-unknown-linux-gnu/bin:/usr/lib/lib/rustlib/x86_64-unknown-linux-gnu/bin:.../supercop-data/meteor,little/checksum/bin:.../supercop-data/meteor,little/sinceepoch/bin:.../supercop-data/meteor,little/compiledinfo/bin:.../supercop-data/meteor,little/killafter/bin:.../supercop-data/meteor,little/okcompilers/bin:.../supercop-data/meteor,little/scripts:/usr/sfw/bin:/usr/local/bin:/usr/local/bin:/usr/bin:/bin:/usr/games" VSLANG="1033" "cc" "-m64" "/tmp/rustcxmSHdk/symbols.o" "<2 object files omitted>" "-Wl,--as-needed" "-Wl,-Bdynamic" "-ltry-anything" "-ltry-small" "-lsupercop" "-lkernelrandombytes" "-lcpucycles" "-lcrypto" "-lm" "-Wl,-Bstatic" ".../supercop-data/meteor,little/amd64/try/c/gcc_-march=native_-mtune=native_-Os_-fwrapv_-fPIC_-fPIE_-gdwarf-4_-Wall/constbranchindex/crypto_hash/sha512/rust_sha2/work/target/release/deps/{libcrypto_hash_sha512-e3904e1be4b56823.rlib,libsha2-d9fe3e64ab7a35b5.rlib,libcpuid_bool-a4038e1fb04f065f.rlib,libcfg_if-52860a7ddc158427.rlib,libopaque_debug-851f5dc4fc7cb701.rlib,libdigest-1689fddb67a4db6c.rlib,libblock_buffer-15129c7af7775380.rlib,libgeneric_array-abd9aca6363faef4.rlib,libtypenum-9bd82fdfda23287d.rlib}" "/usr/lib/rustlib/x86_64-unknown-linux-gnu/lib/{libstd-735cce14533b4b14.rlib,libpanic_unwind-b6737e136067c5af.rlib,libobject-1303c4fadc744db1.rlib,libmemchr-4307c8d3168c78e3.rlib,libaddr2line-78c32e4a87333dbd.rlib,libgimli-0fc0e49acceead35.rlib,librustc_demangle-a0b9c22792c85e39.rlib,libstd_detect-83f7e4a793b39811.rlib,libhashbrown-0d7f81c4b968ca96.rlib,librustc_std_workspace_alloc-6a65191895fd580e.rlib,libminiz_oxide-357876da66360401.rlib,libadler-0c1d85aa00dff5fa.rlib,libunwind-d8e6262062f0cd85.rlib,libcfg_if-2424c0e00d5dc157.rlib,liblibc-d9b6e8d963ea0be1.rlib,liballoc-ecc6700de60a5b56.rlib,librustc_std_workspace_core-6129c8f9aed81c8b.rlib,libcore-2d4b9a0883bc3ecf.rlib,libcompiler_builtins-bdfb7378ad19badb.rlib}" "-Wl,-Bdynamic" "-lgcc_s" "-lutil" "-lrt" "-lpthread" "-lm" "-ldl" "-lc" "-Wl,--eh-frame-hdr" "-Wl,-z,noexecstack" "-L" ".../supercop-data/meteor,little/amd64/lib" "-L" ".../supercop-data/meteor,little/amd64/try/c/gcc_-march=native_-mtune=native_-Os_-fwrapv_-fPIC_-fPIE_-gdwarf-4_-Wall/constbranchindex/crypto_hash/sha512/rust_sha2/work/target/release/build/crypto_hash_sha512-839752891230725c/out" "-L" "/usr/lib/rustlib/x86_64-unknown-linux-gnu/lib" "-o" ".../supercop-data/meteor,little/amd64/try/c/gcc_-march=native_-mtune=native_-Os_-fwrapv_-fPIC_-fPIE_-gdwarf-4_-Wall/constbranchindex/crypto_hash/sha512/rust_sha2/work/target/release/deps/try_small-a30103899c1cc7ad" "-Wl,--gc-sections" "-pie" "-Wl,-z,relro,-z,now" "-Wl,-O1" "-Wl,--strip-debug" "-nodefaultlibs"
try.c:   = note: some arguments are omitted. use `--verbose` to show all linker arguments
try.c:   = note: /usr/bin/ld: cannot find -lcpucycles: No such file or directory
try.c:           collect2: error: ld returned 1 exit status
try.c:
try.c:
try.c: error: could not compile `crypto_hash_sha512` (bin "try-small") due to 1 previous error

Number of similar (implementation,compiler) pairs: 1, namely:
ImplementationCompiler
rust_sha2gcc -march=native -mtune=native -Os -fwrapv -fPIC -fPIE -gdwarf-4 -Wall (14.2.0)

TIMECOP error (can be valgrind bug)


error 132

Process terminating with default action of signal 4 (SIGILL)
 Illegal opcode at address 0x10B5A7
   at 0x...: main (try-anything.c:362)
Illegal instruction

Number of similar (implementation,compiler) pairs: 2, namely:
ImplementationCompiler
blocksplusavxclang -march=native -O2 -fwrapv -Qunused-arguments -fPIC -fPIE -gdwarf-4 -Wall (Debian_Clang_19.1.7_(3+b1))
refclang -march=native -O2 -fwrapv -Qunused-arguments -fPIC -fPIE -gdwarf-4 -Wall (Debian_Clang_19.1.7_(3+b1))

TIMECOP error (can be valgrind bug)


error 132

Process terminating with default action of signal 4 (SIGILL)
 Illegal opcode at address 0x10B5B7
   at 0x...: main (try-anything.c:362)
Illegal instruction

Number of similar (implementation,compiler) pairs: 2, namely:
ImplementationCompiler
blocksplusavxclang -march=native -O3 -fwrapv -Qunused-arguments -fPIC -fPIE -gdwarf-4 -Wall (Debian_Clang_19.1.7_(3+b1))
refclang -march=native -O3 -fwrapv -Qunused-arguments -fPIC -fPIE -gdwarf-4 -Wall (Debian_Clang_19.1.7_(3+b1))

TIMECOP error (can be valgrind bug)


error 132

Process terminating with default action of signal 4 (SIGILL)
 Illegal opcode at address 0x10AEEF
   at 0x...: main (try-anything.c:362)
Illegal instruction

Number of similar (implementation,compiler) pairs: 2, namely:
ImplementationCompiler
blocksplusavxclang -march=native -Os -fwrapv -Qunused-arguments -fPIC -fPIE -gdwarf-4 -Wall (Debian_Clang_19.1.7_(3+b1))
refclang -march=native -Os -fwrapv -Qunused-arguments -fPIC -fPIE -gdwarf-4 -Wall (Debian_Clang_19.1.7_(3+b1))

TIMECOP error (can be valgrind bug)


error 132

Process terminating with default action of signal 4 (SIGILL)
 Illegal opcode at address 0x10B547
   at 0x...: main (try-anything.c:362)
Illegal instruction

Number of similar (implementation,compiler) pairs: 4, namely:
ImplementationCompiler
compactclang -march=native -O2 -fwrapv -Qunused-arguments -fPIC -fPIE -gdwarf-4 -Wall (Debian_Clang_19.1.7_(3+b1))
opensslclang -march=native -O2 -fwrapv -Qunused-arguments -fPIC -fPIE -gdwarf-4 -Wall (Debian_Clang_19.1.7_(3+b1))
sphlibclang -march=native -O2 -fwrapv -Qunused-arguments -fPIC -fPIE -gdwarf-4 -Wall (Debian_Clang_19.1.7_(3+b1))
sphlib-smallclang -march=native -O2 -fwrapv -Qunused-arguments -fPIC -fPIE -gdwarf-4 -Wall (Debian_Clang_19.1.7_(3+b1))

TIMECOP error (can be valgrind bug)


error 132

Process terminating with default action of signal 4 (SIGILL)
 Illegal opcode at address 0x10B557
   at 0x...: main (try-anything.c:362)
Illegal instruction

Number of similar (implementation,compiler) pairs: 4, namely:
ImplementationCompiler
compactclang -march=native -O3 -fwrapv -Qunused-arguments -fPIC -fPIE -gdwarf-4 -Wall (Debian_Clang_19.1.7_(3+b1))
opensslclang -march=native -O3 -fwrapv -Qunused-arguments -fPIC -fPIE -gdwarf-4 -Wall (Debian_Clang_19.1.7_(3+b1))
sphlibclang -march=native -O3 -fwrapv -Qunused-arguments -fPIC -fPIE -gdwarf-4 -Wall (Debian_Clang_19.1.7_(3+b1))
sphlib-smallclang -march=native -O3 -fwrapv -Qunused-arguments -fPIC -fPIE -gdwarf-4 -Wall (Debian_Clang_19.1.7_(3+b1))

TIMECOP error (can be valgrind bug)


error 132

Process terminating with default action of signal 4 (SIGILL)
 Illegal opcode at address 0x10AE8F
   at 0x...: main (try-anything.c:362)
Illegal instruction

Number of similar (implementation,compiler) pairs: 4, namely:
ImplementationCompiler
compactclang -march=native -Os -fwrapv -Qunused-arguments -fPIC -fPIE -gdwarf-4 -Wall (Debian_Clang_19.1.7_(3+b1))
opensslclang -march=native -Os -fwrapv -Qunused-arguments -fPIC -fPIE -gdwarf-4 -Wall (Debian_Clang_19.1.7_(3+b1))
sphlibclang -march=native -Os -fwrapv -Qunused-arguments -fPIC -fPIE -gdwarf-4 -Wall (Debian_Clang_19.1.7_(3+b1))
sphlib-smallclang -march=native -Os -fwrapv -Qunused-arguments -fPIC -fPIE -gdwarf-4 -Wall (Debian_Clang_19.1.7_(3+b1))

TIMECOP error (can be valgrind bug)


error 132

Process terminating with default action of signal 4 (SIGILL)
 Illegal opcode at address 0x17B091
   at 0x...: main (try-anything.cpp:362)
Illegal instruction

Number of similar (implementation,compiler) pairs: 1, namely:
ImplementationCompiler
cryptoppclang++ -march=native -O2 -fwrapv -Qunused-arguments -fPIC -fPIE -gdwarf-4 -Wall (Debian_Clang_19.1.7_(3+b1))

TIMECOP error (can be valgrind bug)


error 132

Process terminating with default action of signal 4 (SIGILL)
 Illegal opcode at address 0x17B0A1
   at 0x...: main (try-anything.cpp:362)
Illegal instruction

Number of similar (implementation,compiler) pairs: 1, namely:
ImplementationCompiler
cryptoppclang++ -march=native -O3 -fwrapv -Qunused-arguments -fPIC -fPIE -gdwarf-4 -Wall (Debian_Clang_19.1.7_(3+b1))

TIMECOP error (can be valgrind bug)


error 132

Process terminating with default action of signal 4 (SIGILL)
 Illegal opcode at address 0x17AA0F
   at 0x...: main (try-anything.cpp:362)
Illegal instruction

Number of similar (implementation,compiler) pairs: 1, namely:
ImplementationCompiler
cryptoppclang++ -march=native -Os -fwrapv -Qunused-arguments -fPIC -fPIE -gdwarf-4 -Wall (Debian_Clang_19.1.7_(3+b1))

Passed TIMECOP


TIMECOP iterations: 10

Number of similar (implementation,compiler) pairs: 40, namely:
ImplementationCompiler
blocksplusavxclang -march=native -O -fwrapv -Qunused-arguments -fPIC -fPIE -gdwarf-4 -Wall (Debian_Clang_19.1.7_(3+b1))
blocksplusavxgcc -march=native -mtune=native -O2 -fwrapv -fPIC -fPIE -gdwarf-4 -Wall (14.2.0)
blocksplusavxgcc -march=native -mtune=native -O3 -fwrapv -fPIC -fPIE -gdwarf-4 -Wall (14.2.0)
blocksplusavxgcc -march=native -mtune=native -O -fwrapv -fPIC -fPIE -gdwarf-4 -Wall (14.2.0)
blocksplusavxgcc -march=native -mtune=native -Os -fwrapv -fPIC -fPIE -gdwarf-4 -Wall (14.2.0)
compactclang -march=native -O -fwrapv -Qunused-arguments -fPIC -fPIE -gdwarf-4 -Wall (Debian_Clang_19.1.7_(3+b1))
compactclang -mcpu=native -O3 -fwrapv -Qunused-arguments -fPIC -fPIE -gdwarf-4 -Wall (Debian_Clang_19.1.7_(3+b1))
compactgcc -march=native -mtune=native -O2 -fwrapv -fPIC -fPIE -gdwarf-4 -Wall (14.2.0)
compactgcc -march=native -mtune=native -O3 -fwrapv -fPIC -fPIE -gdwarf-4 -Wall (14.2.0)
compactgcc -march=native -mtune=native -O -fwrapv -fPIC -fPIE -gdwarf-4 -Wall (14.2.0)
compactgcc -march=native -mtune=native -Os -fwrapv -fPIC -fPIE -gdwarf-4 -Wall (14.2.0)
cryptoppclang++ -march=native -O -fwrapv -Qunused-arguments -fPIC -fPIE -gdwarf-4 -Wall (Debian_Clang_19.1.7_(3+b1))
cryptoppg++ -march=native -mtune=native -O2 -fwrapv -fPIC -fPIE -gdwarf-4 -Wall (14.2.0)
cryptoppg++ -march=native -mtune=native -O3 -fwrapv -fPIC -fPIE -gdwarf-4 -Wall (14.2.0)
cryptoppg++ -march=native -mtune=native -O -fwrapv -fPIC -fPIE -gdwarf-4 -Wall (14.2.0)
cryptoppg++ -march=native -mtune=native -Os -fwrapv -fPIC -fPIE -gdwarf-4 -Wall (14.2.0)
opensslclang -march=native -O -fwrapv -Qunused-arguments -fPIC -fPIE -gdwarf-4 -Wall (Debian_Clang_19.1.7_(3+b1))
opensslclang -mcpu=native -O3 -fwrapv -Qunused-arguments -fPIC -fPIE -gdwarf-4 -Wall (Debian_Clang_19.1.7_(3+b1))
opensslgcc -march=native -mtune=native -O2 -fwrapv -fPIC -fPIE -gdwarf-4 -Wall (14.2.0)
opensslgcc -march=native -mtune=native -O3 -fwrapv -fPIC -fPIE -gdwarf-4 -Wall (14.2.0)
opensslgcc -march=native -mtune=native -O -fwrapv -fPIC -fPIE -gdwarf-4 -Wall (14.2.0)
opensslgcc -march=native -mtune=native -Os -fwrapv -fPIC -fPIE -gdwarf-4 -Wall (14.2.0)
refclang -march=native -O -fwrapv -Qunused-arguments -fPIC -fPIE -gdwarf-4 -Wall (Debian_Clang_19.1.7_(3+b1))
refclang -mcpu=native -O3 -fwrapv -Qunused-arguments -fPIC -fPIE -gdwarf-4 -Wall (Debian_Clang_19.1.7_(3+b1))
refgcc -march=native -mtune=native -O2 -fwrapv -fPIC -fPIE -gdwarf-4 -Wall (14.2.0)
refgcc -march=native -mtune=native -O3 -fwrapv -fPIC -fPIE -gdwarf-4 -Wall (14.2.0)
refgcc -march=native -mtune=native -O -fwrapv -fPIC -fPIE -gdwarf-4 -Wall (14.2.0)
refgcc -march=native -mtune=native -Os -fwrapv -fPIC -fPIE -gdwarf-4 -Wall (14.2.0)
sphlibclang -march=native -O -fwrapv -Qunused-arguments -fPIC -fPIE -gdwarf-4 -Wall (Debian_Clang_19.1.7_(3+b1))
sphlibclang -mcpu=native -O3 -fwrapv -Qunused-arguments -fPIC -fPIE -gdwarf-4 -Wall (Debian_Clang_19.1.7_(3+b1))
sphlibgcc -march=native -mtune=native -O2 -fwrapv -fPIC -fPIE -gdwarf-4 -Wall (14.2.0)
sphlibgcc -march=native -mtune=native -O3 -fwrapv -fPIC -fPIE -gdwarf-4 -Wall (14.2.0)
sphlibgcc -march=native -mtune=native -O -fwrapv -fPIC -fPIE -gdwarf-4 -Wall (14.2.0)
sphlibgcc -march=native -mtune=native -Os -fwrapv -fPIC -fPIE -gdwarf-4 -Wall (14.2.0)
sphlib-smallclang -march=native -O -fwrapv -Qunused-arguments -fPIC -fPIE -gdwarf-4 -Wall (Debian_Clang_19.1.7_(3+b1))
sphlib-smallclang -mcpu=native -O3 -fwrapv -Qunused-arguments -fPIC -fPIE -gdwarf-4 -Wall (Debian_Clang_19.1.7_(3+b1))
sphlib-smallgcc -march=native -mtune=native -O2 -fwrapv -fPIC -fPIE -gdwarf-4 -Wall (14.2.0)
sphlib-smallgcc -march=native -mtune=native -O3 -fwrapv -fPIC -fPIE -gdwarf-4 -Wall (14.2.0)
sphlib-smallgcc -march=native -mtune=native -O -fwrapv -fPIC -fPIE -gdwarf-4 -Wall (14.2.0)
sphlib-smallgcc -march=native -mtune=native -Os -fwrapv -fPIC -fPIE -gdwarf-4 -Wall (14.2.0)