Implementation notes: amd64, margaux, crypto_kem/titaniumccahi

Computer: margaux
Architecture: amd64
CPU ID: GenuineIntel-000006fb-bfebfbff
SUPERCOP version: 20210604
Operation: crypto_kem
Primitive: titaniumccahi
TimeObject sizeTest sizeImplementationCompilerBenchmark dateSUPERCOP version
871182469239 0 0255222 828 1752T:optclang_-march=native_-O_-fomit-frame-pointer_-fwrapv_-Qunused-arguments_-fPIC_-fPIE2021051120210423
871998456777 0 0242671 828 1800T:optgcc_-march=native_-mtune=native_-O2_-fomit-frame-pointer_-fwrapv_-fPIC_-fPIE2021051120210423
873258574890 0 0262038 828 1752T:optclang_-mcpu=native_-O3_-fomit-frame-pointer_-fwrapv_-Qunused-arguments_-fPIC_-fPIE2021051120210423
875445669239 0 0255222 828 1752T:optclang_-march=native_-O2_-fomit-frame-pointer_-fwrapv_-Qunused-arguments_-fPIC_-fPIE2021051120210423
875458974634 0 0261990 828 1752T:optclang_-march=native_-O3_-fomit-frame-pointer_-fwrapv_-Qunused-arguments_-fPIC_-fPIE2021051120210423
889013355201 0 0239364 820 1752T:optclang_-march=native_-Os_-fomit-frame-pointer_-fwrapv_-Qunused-arguments_-fPIC_-fPIE2021051120210423
891019395846 0 0283695 828 1800T:optgcc_-march=native_-mtune=native_-O3_-fomit-frame-pointer_-fwrapv_-fPIC_-fPIE2021051120210423
957720857047 0 0242551 828 1800T:optgcc_-march=native_-mtune=native_-O_-fomit-frame-pointer_-fwrapv_-fPIC_-fPIE2021051120210423
137336167254222 0 0240182 828 1752T:refclang_-march=native_-O_-fomit-frame-pointer_-fwrapv_-Qunused-arguments_-fPIC_-fPIE2021051120210423
137338692854222 0 0240182 828 1752T:refclang_-march=native_-O2_-fomit-frame-pointer_-fwrapv_-Qunused-arguments_-fPIC_-fPIE2021051120210423
137352756467907 0 0255214 828 1752T:refclang_-march=native_-O3_-fomit-frame-pointer_-fwrapv_-Qunused-arguments_-fPIC_-fPIE2021051120210423
137363381068195 0 0255326 828 1752T:refclang_-mcpu=native_-O3_-fomit-frame-pointer_-fwrapv_-Qunused-arguments_-fPIC_-fPIE2021051120210423
140560787144800 0 0228756 820 1752T:refclang_-march=native_-Os_-fomit-frame-pointer_-fwrapv_-Qunused-arguments_-fPIC_-fPIE2021051120210423
155339849857619 0 0245479 828 1800T:refgcc_-march=native_-mtune=native_-O3_-fomit-frame-pointer_-fwrapv_-fPIC_-fPIE2021051120210423
162480071043556 0 0229287 828 1800T:refgcc_-march=native_-mtune=native_-O2_-fomit-frame-pointer_-fwrapv_-fPIC_-fPIE2021051120210423
169320695743730 0 0229103 828 1800T:refgcc_-march=native_-mtune=native_-O_-fomit-frame-pointer_-fwrapv_-fPIC_-fPIE2021051120210423

Compiler output

Implementation: T:avx2
Security model: timingleaks
Compiler: clang -march=native -O2 -fomit-frame-pointer -fwrapv -Qunused-arguments -fPIC -fPIE
encrypt.c: encrypt.c:63:8: error: always_inline function '_mm256_loadu_si256' requires target feature 'xsave', but would be inlined into function 'crypto_encrypt_keypair' that is compiled without support for 'xsave'
encrypt.c: u = _mm256_loadu_si256((__m256i *)(a[i] + j));
encrypt.c: ^
encrypt.c: encrypt.c:64:8: error: always_inline function '_mm256_loadu_si256' requires target feature 'xsave', but would be inlined into function 'crypto_encrypt_keypair' that is compiled without support for 'xsave'
encrypt.c: v = _mm256_loadu_si256((__m256i *)(s + j));
encrypt.c: ^
encrypt.c: encrypt.c:65:8: error: always_inline function '_mm256_mul_epu32' requires target feature 'xsave', but would be inlined into function 'crypto_encrypt_keypair' that is compiled without support for 'xsave'
encrypt.c: t = _mm256_mul_epu32(u, v);
encrypt.c: ^
encrypt.c: encrypt.c:66:4: error: always_inline function '_mm256_storeu_si256' requires target feature 'xsave', but would be inlined into function 'crypto_encrypt_keypair' that is compiled without support for 'xsave'
encrypt.c: _mm256_storeu_si256((__m256i *)(a[i] + j), t);
encrypt.c: ^
encrypt.c: encrypt.c:78:8: error: always_inline function '_mm256_loadu_si256' requires target feature 'xsave', but would be inlined into function 'crypto_encrypt_keypair' that is compiled without support for 'xsave'
encrypt.c: u = _mm256_loadu_si256((__m256i *)(a[i] + j));
encrypt.c: ^
encrypt.c: encrypt.c:79:8: error: always_inline function '_mm256_loadu_si256' requires target feature 'xsave', but would be inlined into function 'crypto_encrypt_keypair' that is compiled without support for 'xsave'
encrypt.c: v = _mm256_loadu_si256((__m256i *)(e[i] + j));
encrypt.c: ^
encrypt.c: encrypt.c:80:8: error: always_inline function '_mm256_add_epi64' requires target feature 'xsave', but would be inlined into function 'crypto_encrypt_keypair' that is compiled without support for 'xsave'
encrypt.c: t = _mm256_add_epi64(u, v);
encrypt.c: ^
encrypt.c: encrypt.c:81:9: error: always_inline function '_mm256_mul_epu32' requires target feature 'xsave', but would be inlined into function 'crypto_encrypt_keypair' that is compiled without support for 'xsave'
encrypt.c: t1 = _mm256_mul_epu32(t, V_B4Q_B4Q_B4Q_B4Q);
encrypt.c: ^
encrypt.c: encrypt.c:82:9: error: always_inline function '_mm256_srli_epi64' requires target feature 'xsave', but would be inlined into function 'crypto_encrypt_keypair' that is compiled without support for 'xsave'
encrypt.c: ...

Number of similar (compiler,implementation) pairs: 4, namely:
CompilerImplementations
clang -march=native -O2 -fomit-frame-pointer -fwrapv -Qunused-arguments -fPIC -fPIE T:avx2
clang -march=native -O3 -fomit-frame-pointer -fwrapv -Qunused-arguments -fPIC -fPIE T:avx2
clang -march=native -O -fomit-frame-pointer -fwrapv -Qunused-arguments -fPIC -fPIE T:avx2
clang -march=native -Os -fomit-frame-pointer -fwrapv -Qunused-arguments -fPIC -fPIE T:avx2

Compiler output

Implementation: T:avx2
Security model: timingleaks
Compiler: clang -mcpu=native -O3 -fomit-frame-pointer -fwrapv -Qunused-arguments -fPIC -fPIE
encrypt.c: encrypt.c:63:8: error: always_inline function '_mm256_loadu_si256' requires target feature 'sse4.2', but would be inlined into function 'crypto_encrypt_keypair' that is compiled without support for 'sse4.2'
encrypt.c: u = _mm256_loadu_si256((__m256i *)(a[i] + j));
encrypt.c: ^
encrypt.c: encrypt.c:64:8: error: always_inline function '_mm256_loadu_si256' requires target feature 'sse4.2', but would be inlined into function 'crypto_encrypt_keypair' that is compiled without support for 'sse4.2'
encrypt.c: v = _mm256_loadu_si256((__m256i *)(s + j));
encrypt.c: ^
encrypt.c: encrypt.c:65:8: error: always_inline function '_mm256_mul_epu32' requires target feature 'avx2', but would be inlined into function 'crypto_encrypt_keypair' that is compiled without support for 'avx2'
encrypt.c: t = _mm256_mul_epu32(u, v);
encrypt.c: ^
encrypt.c: encrypt.c:66:4: error: always_inline function '_mm256_storeu_si256' requires target feature 'sse4.2', but would be inlined into function 'crypto_encrypt_keypair' that is compiled without support for 'sse4.2'
encrypt.c: _mm256_storeu_si256((__m256i *)(a[i] + j), t);
encrypt.c: ^
encrypt.c: encrypt.c:78:8: error: always_inline function '_mm256_loadu_si256' requires target feature 'sse4.2', but would be inlined into function 'crypto_encrypt_keypair' that is compiled without support for 'sse4.2'
encrypt.c: u = _mm256_loadu_si256((__m256i *)(a[i] + j));
encrypt.c: ^
encrypt.c: encrypt.c:79:8: error: always_inline function '_mm256_loadu_si256' requires target feature 'sse4.2', but would be inlined into function 'crypto_encrypt_keypair' that is compiled without support for 'sse4.2'
encrypt.c: v = _mm256_loadu_si256((__m256i *)(e[i] + j));
encrypt.c: ^
encrypt.c: encrypt.c:80:8: error: always_inline function '_mm256_add_epi64' requires target feature 'avx2', but would be inlined into function 'crypto_encrypt_keypair' that is compiled without support for 'avx2'
encrypt.c: t = _mm256_add_epi64(u, v);
encrypt.c: ^
encrypt.c: encrypt.c:81:9: error: always_inline function '_mm256_mul_epu32' requires target feature 'avx2', but would be inlined into function 'crypto_encrypt_keypair' that is compiled without support for 'avx2'
encrypt.c: t1 = _mm256_mul_epu32(t, V_B4Q_B4Q_B4Q_B4Q);
encrypt.c: ^
encrypt.c: encrypt.c:82:9: error: always_inline function '_mm256_srli_epi64' requires target feature 'avx2', but would be inlined into function 'crypto_encrypt_keypair' that is compiled without support for 'avx2'
encrypt.c: ...

Number of similar (compiler,implementation) pairs: 1, namely:
CompilerImplementations
clang -mcpu=native -O3 -fomit-frame-pointer -fwrapv -Qunused-arguments -fPIC -fPIE T:avx2

Compiler output

Implementation: T:avx2
Security model: timingleaks
Compiler: gcc -march=native -mtune=native -O2 -fomit-frame-pointer -fwrapv -fPIC -fPIE
encrypt.c: encrypt.c: In function 'crypto_encrypt_keypair':
encrypt.c: encrypt.c:63:6: warning: AVX vector return without AVX enabled changes the ABI [-Wpsabi]
encrypt.c: u = _mm256_loadu_si256((__m256i *)(a[i] + j));
encrypt.c: ~~^~~~~~~~~~~~~~~~~~~~~~~~~~~~~~~~~~~~~~~~~~~
encrypt.c: In file included from /usr/lib/gcc/x86_64-linux-gnu/7/include/immintrin.h:41:0,
encrypt.c: from /usr/lib/gcc/x86_64-linux-gnu/7/include/x86intrin.h:48,
encrypt.c: from encrypt.c:18:
encrypt.c: /usr/lib/gcc/x86_64-linux-gnu/7/include/avxintrin.h:926:1: error: inlining failed in call to always_inline '_mm256_storeu_si256': target specific option mismatch
encrypt.c: _mm256_storeu_si256 (__m256i_u *__P, __m256i __A)
encrypt.c: ^~~~~~~~~~~~~~~~~~~
encrypt.c: encrypt.c:66:4: note: called from here
encrypt.c: _mm256_storeu_si256((__m256i *)(a[i] + j), t);
encrypt.c: ^~~~~~~~~~~~~~~~~~~~~~~~~~~~~~~~~~~~~~~~~~~~~
encrypt.c: In file included from /usr/lib/gcc/x86_64-linux-gnu/7/include/immintrin.h:43:0,
encrypt.c: from /usr/lib/gcc/x86_64-linux-gnu/7/include/x86intrin.h:48,
encrypt.c: from encrypt.c:18:
encrypt.c: /usr/lib/gcc/x86_64-linux-gnu/7/include/avx2intrin.h:567:1: error: inlining failed in call to always_inline '_mm256_mul_epu32': target specific option mismatch
encrypt.c: _mm256_mul_epu32 (__m256i __A, __m256i __B)
encrypt.c: ^~~~~~~~~~~~~~~~
encrypt.c: encrypt.c:65:6: note: called from here
encrypt.c: t = _mm256_mul_epu32(u, v);
encrypt.c: ~~^~~~~~~~~~~~~~~~~~~~~~~~
encrypt.c: In file included from /usr/lib/gcc/x86_64-linux-gnu/7/include/immintrin.h:41:0,
encrypt.c: from /usr/lib/gcc/x86_64-linux-gnu/7/include/x86intrin.h:48,
encrypt.c: from encrypt.c:18:
encrypt.c: ...

Number of similar (compiler,implementation) pairs: 4, namely:
CompilerImplementations
gcc -march=native -mtune=native -O2 -fomit-frame-pointer -fwrapv -fPIC -fPIE T:avx2
gcc -march=native -mtune=native -O3 -fomit-frame-pointer -fwrapv -fPIC -fPIE T:avx2
gcc -march=native -mtune=native -O -fomit-frame-pointer -fwrapv -fPIC -fPIE T:avx2
gcc -march=native -mtune=native -Os -fomit-frame-pointer -fwrapv -fPIC -fPIE T:avx2

Compiler output

Implementation: T:opt
Security model: timingleaks
Compiler: gcc -march=native -mtune=native -Os -fomit-frame-pointer -fwrapv -fPIC -fPIE
try.c: libcrypto_kem_titaniumccahi.a(encrypt.o): In function `crypto_encrypt_keypair':
try.c: encrypt.c:(.text+0x...): undefined reference to `barrett_4q2'
try.c: encrypt.c:(.text+0x...): undefined reference to `barrett_4q'
try.c: libcrypto_kem_titaniumccahi.a(encrypt.o): In function `crypto_encrypt':
try.c: encrypt.c:(.text+0x...): undefined reference to `barrett_4q2'
try.c: encrypt.c:(.text+0x...): undefined reference to `barrett_4q2'
try.c: libcrypto_kem_titaniumccahi.a(encrypt.o): In function `crypto_encrypt_open':
try.c: encrypt.c:(.text+0x...): undefined reference to `barrett_4q2'
try.c: libcrypto_kem_titaniumccahi.a(fastrandombytes.o): In function `fastrandombytes':
try.c: fastrandombytes.c:(.text+0x...): undefined reference to `load_32'
try.c: fastrandombytes.c:(.text+0x...): undefined reference to `store_32'
try.c: libcrypto_kem_titaniumccahi.a(ntt.o): In function `ntt_butterfly_1536_2560':
try.c: ntt.c:(.text+0x...): undefined reference to `barrett_16q'
try.c: libcrypto_kem_titaniumccahi.a(ntt.o): In function `ntt_butterfly_2560_1024':
try.c: ntt.c:(.text+0x...): undefined reference to `barrett_32q'
try.c: libcrypto_kem_titaniumccahi.a(ntt.o): In function `ntt_butterfly_768_2304':
try.c: ntt.c:(.text+0x...): undefined reference to `barrett_8q'
try.c: libcrypto_kem_titaniumccahi.a(ntt.o): In function `ntt_butterfly_1536_2304':
try.c: ntt.c:(.text+0x...): undefined reference to `barrett_16q'
try.c: libcrypto_kem_titaniumccahi.a(ntt.o): In function `ntt_butterfly_2304_2304_inv':
try.c: ntt.c:(.text+0x...): undefined reference to `barrett_32q'
try.c: libcrypto_kem_titaniumccahi.a(ntt.o): In function `ntt_butterfly_1024_1024_inv':
try.c: ntt.c:(.text+0x...): undefined reference to `barrett_8q'
try.c: libcrypto_kem_titaniumccahi.a(ntt.o): In function `ntt_butterfly_768_1024':
try.c: ntt.c:(.text+0x...): undefined reference to `barrett_8q'
try.c: ...

Number of similar (compiler,implementation) pairs: 1, namely:
CompilerImplementations
gcc -march=native -mtune=native -Os -fomit-frame-pointer -fwrapv -fPIC -fPIE T:opt

Compiler output

Implementation: T:ref
Security model: timingleaks
Compiler: gcc -march=native -mtune=native -Os -fomit-frame-pointer -fwrapv -fPIC -fPIE
try.c: libcrypto_kem_titaniumccahi.a(fastrandombytes.o): In function `fastrandombytes':
try.c: fastrandombytes.c:(.text+0x...): undefined reference to `load_32'
try.c: fastrandombytes.c:(.text+0x...): undefined reference to `store_32'
try.c: libcrypto_kem_titaniumccahi.a(sampler.o): In function `sampler_zq':
try.c: sampler.c:(.text+0x...): undefined reference to `load_24'
try.c: collect2: error: ld returned 1 exit status

Number of similar (compiler,implementation) pairs: 1, namely:
CompilerImplementations
gcc -march=native -mtune=native -Os -fomit-frame-pointer -fwrapv -fPIC -fPIE T:ref

Namespace violations

Implementation: T:opt
Security model: timingleaks
Compiler: clang -march=native -O2 -fomit-frame-pointer -fwrapv -Qunused-arguments -fPIC -fPIE
encrypt.o crypto_encrypt T
encrypt.o crypto_encrypt_keypair T
encrypt.o crypto_encrypt_open T
fastrandombytes.o fastrandombytes T
fastrandombytes.o fastrandombytes_setseed T
fastrandombytes.o iv C
fastrandombytes.o key C
ntt.o intt_1024_256 T
ntt.o intt_2304_2304_inv T
ntt.o intt_2560_1024 T
ntt.o intt_2560_256 T
ntt.o ntt_1024_1024_inv T
ntt.o ntt_1536_2304 T
ntt.o ntt_1536_2560 T
ntt.o ntt_2304_2560 T
ntt.o ntt_768_1024 T
ntt.o ntt_768_2304 T
pack.o poly_decode T
pack.o poly_decode_c2 T
pack.o poly_encode T
pack.o poly_encode_c2 T
sampler.o sampler_binomial T
sampler.o sampler_zb T
sampler.o sampler_zq T

Number of similar (compiler,implementation) pairs: 8, namely:
CompilerImplementations
clang -march=native -O2 -fomit-frame-pointer -fwrapv -Qunused-arguments -fPIC -fPIE T:opt
clang -march=native -O3 -fomit-frame-pointer -fwrapv -Qunused-arguments -fPIC -fPIE T:opt
clang -march=native -O -fomit-frame-pointer -fwrapv -Qunused-arguments -fPIC -fPIE T:opt
clang -march=native -Os -fomit-frame-pointer -fwrapv -Qunused-arguments -fPIC -fPIE T:opt
clang -mcpu=native -O3 -fomit-frame-pointer -fwrapv -Qunused-arguments -fPIC -fPIE T:opt
gcc -march=native -mtune=native -O2 -fomit-frame-pointer -fwrapv -fPIC -fPIE T:opt
gcc -march=native -mtune=native -O3 -fomit-frame-pointer -fwrapv -fPIC -fPIE T:opt
gcc -march=native -mtune=native -O -fomit-frame-pointer -fwrapv -fPIC -fPIE T:opt

Namespace violations

Implementation: T:ref
Security model: timingleaks
Compiler: clang -march=native -O2 -fomit-frame-pointer -fwrapv -Qunused-arguments -fPIC -fPIE
encrypt.o crypto_encrypt T
encrypt.o crypto_encrypt_keypair T
encrypt.o crypto_encrypt_open T
fastrandombytes.o fastrandombytes T
fastrandombytes.o fastrandombytes_setseed T
fastrandombytes.o iv C
fastrandombytes.o key C
ntt.o intt_1024_1024 T
ntt.o intt_2304_2304_inv T
ntt.o intt_2560_2560 T
ntt.o ntt_1024_1024_inv T
ntt.o ntt_2304_2304 T
pack.o poly_decode T
pack.o poly_decode_c2 T
pack.o poly_encode T
pack.o poly_encode_c2 T
product.o mp T
product.o product T
sampler.o sampler_binomial T
sampler.o sampler_zb T
sampler.o sampler_zq T

Number of similar (compiler,implementation) pairs: 8, namely:
CompilerImplementations
clang -march=native -O2 -fomit-frame-pointer -fwrapv -Qunused-arguments -fPIC -fPIE T:ref
clang -march=native -O3 -fomit-frame-pointer -fwrapv -Qunused-arguments -fPIC -fPIE T:ref
clang -march=native -O -fomit-frame-pointer -fwrapv -Qunused-arguments -fPIC -fPIE T:ref
clang -march=native -Os -fomit-frame-pointer -fwrapv -Qunused-arguments -fPIC -fPIE T:ref
clang -mcpu=native -O3 -fomit-frame-pointer -fwrapv -Qunused-arguments -fPIC -fPIE T:ref
gcc -march=native -mtune=native -O2 -fomit-frame-pointer -fwrapv -fPIC -fPIE T:ref
gcc -march=native -mtune=native -O3 -fomit-frame-pointer -fwrapv -fPIC -fPIE T:ref
gcc -march=native -mtune=native -O -fomit-frame-pointer -fwrapv -fPIC -fPIE T:ref