Implementation notes: amd64, margaux, crypto_hash/groestl256

Computer: margaux
Microarchitecture: amd64; Core 2 65nm (6fb)
Architecture: amd64
CPU ID: GenuineIntel-000006fb-bfebfbff
SUPERCOP version: 20240425
Operation: crypto_hash
Primitive: groestl256
TimeObject sizeTest sizeImplementationCompilerBenchmark dateSUPERCOP version
5278748883 0 060419 804 960T:sphlib-adaptedgcc_-march=native_-mtune=native_-O_-fomit-frame-pointer_-fwrapv_-fPIC_-fPIE2024042720240425
5450545738 0 057796 812 960T:sphlibgcc_-march=native_-mtune=native_-O2_-fomit-frame-pointer_-fwrapv_-fPIC_-fPIE2024042720240425
5518448474 0 061692 812 960T:sphlib-adaptedgcc_-march=native_-mtune=native_-O3_-fomit-frame-pointer_-fwrapv_-fPIC_-fPIE2024042720240425
5615048321 0 061339 844 896T:sphlibclang_-mcpu=native_-O3_-fomit-frame-pointer_-fwrapv_-Qunused-arguments_-fPIC_-fPIE2024042720240425
5626248753 0 061979 844 896T:sphlibclang_-march=native_-O3_-fomit-frame-pointer_-fwrapv_-Qunused-arguments_-fPIC_-fPIE2024042720240425
5629748753 0 060867 844 896T:sphlibclang_-march=native_-O2_-fomit-frame-pointer_-fwrapv_-Qunused-arguments_-fPIC_-fPIE2024042720240425
5655845402 0 056931 804 960T:sphlibgcc_-march=native_-mtune=native_-O_-fomit-frame-pointer_-fwrapv_-fPIC_-fPIE2024042720240425
5693745610 0 058828 812 960T:sphlibgcc_-march=native_-mtune=native_-O3_-fomit-frame-pointer_-fwrapv_-fPIC_-fPIE2024042720240425
5781550436 0 061259 844 896T:sphlibclang_-march=native_-O_-fomit-frame-pointer_-fwrapv_-Qunused-arguments_-fPIC_-fPIE2024042720240425
5782323290 0 036508 812 960T:sphlib-smallgcc_-march=native_-mtune=native_-O3_-fomit-frame-pointer_-fwrapv_-fPIC_-fPIE2024042720240425
5832820634 0 032163 804 960T:sphlib-smallgcc_-march=native_-mtune=native_-O_-fomit-frame-pointer_-fwrapv_-fPIC_-fPIE2024042720240425
5892222122 0 034180 812 960T:sphlib-smallgcc_-march=native_-mtune=native_-O2_-fomit-frame-pointer_-fwrapv_-fPIC_-fPIE2024042720240425
5927651098 0 063156 812 960T:sphlib-adaptedgcc_-march=native_-mtune=native_-O2_-fomit-frame-pointer_-fwrapv_-fPIC_-fPIE2024042720240425
5955651825 0 065067 844 896T:sphlib-adaptedclang_-march=native_-O3_-fomit-frame-pointer_-fwrapv_-Qunused-arguments_-fPIC_-fPIE2024042720240425
5960151409 0 064443 844 896T:sphlib-adaptedclang_-mcpu=native_-O3_-fomit-frame-pointer_-fwrapv_-Qunused-arguments_-fPIC_-fPIE2024042720240425
5964751825 0 063955 844 896T:sphlib-adaptedclang_-march=native_-O2_-fomit-frame-pointer_-fwrapv_-Qunused-arguments_-fPIC_-fPIE2024042720240425
6006754324 0 065163 844 896T:sphlib-adaptedclang_-march=native_-O_-fomit-frame-pointer_-fwrapv_-Qunused-arguments_-fPIC_-fPIE2024042720240425
6202051126 0 061189 836 896T:sphlib-adaptedclang_-march=native_-Os_-fomit-frame-pointer_-fwrapv_-Qunused-arguments_-fPIC_-fPIE2024042720240425
6276348376 0 058421 836 896T:sphlibclang_-march=native_-Os_-fomit-frame-pointer_-fwrapv_-Qunused-arguments_-fPIC_-fPIE2024042720240425
6300018261 0 028727 788 928T:sphlib-smallgcc_-march=native_-mtune=native_-Os_-fomit-frame-pointer_-fwrapv_-fPIC_-fPIE2024042720240425
6497041870 0 052343 788 928T:sphlibgcc_-march=native_-mtune=native_-Os_-fomit-frame-pointer_-fwrapv_-fPIC_-fPIE2024042720240425
6568269107 0 081381 868 896T:mmxclang_-march=native_-O2_-fomit-frame-pointer_-fwrapv_-Qunused-arguments_-fPIC_-fPIE2024042720240425
6638969867 0 083045 868 896T:mmxclang_-mcpu=native_-O3_-fomit-frame-pointer_-fwrapv_-Qunused-arguments_-fPIC_-fPIE2024042720240425
6651069867 0 083253 868 896T:mmxclang_-march=native_-O3_-fomit-frame-pointer_-fwrapv_-Qunused-arguments_-fPIC_-fPIE2024042720240425
6716164343 0 074469 852 896T:mmxclang_-march=native_-Os_-fomit-frame-pointer_-fwrapv_-Qunused-arguments_-fPIC_-fPIE2024042720240425
6784244705 0 055175 788 928T:sphlib-adaptedgcc_-march=native_-mtune=native_-Os_-fomit-frame-pointer_-fwrapv_-fPIC_-fPIE2024042720240425
6838169078 0 080077 868 896T:mmxclang_-march=native_-O_-fomit-frame-pointer_-fwrapv_-Qunused-arguments_-fPIC_-fPIE2024042720240425
6964672091 0 083700 812 960T:mmxgcc_-march=native_-mtune=native_-O_-fomit-frame-pointer_-fwrapv_-fPIC_-fPIE2024042720240425
7187375197 0 088517 820 960T:mmxgcc_-march=native_-mtune=native_-O3_-fomit-frame-pointer_-fwrapv_-fPIC_-fPIE2024042720240425
7322319089 0 028917 836 896T:sphlib-smallclang_-march=native_-Os_-fomit-frame-pointer_-fwrapv_-Qunused-arguments_-fPIC_-fPIE2024042720240425
7404421716 0 032555 844 896T:sphlib-smallclang_-march=native_-O_-fomit-frame-pointer_-fwrapv_-Qunused-arguments_-fPIC_-fPIE2024042720240425
7429773738 0 084280 796 928T:mmxgcc_-march=native_-mtune=native_-Os_-fomit-frame-pointer_-fwrapv_-fPIC_-fPIE2024042720240425
7560843633 0 126454047 788 2208T:vperm-intrgcc_-march=native_-mtune=native_-Os_-fomit-frame-pointer_-fwrapv_-fPIC_-fPIE2024042720240425
7683121905 0 034715 844 896T:sphlib-smallclang_-mcpu=native_-O3_-fomit-frame-pointer_-fwrapv_-Qunused-arguments_-fPIC_-fPIE2024042720240425
7701422353 0 035371 844 896T:sphlib-smallclang_-march=native_-O3_-fomit-frame-pointer_-fwrapv_-Qunused-arguments_-fPIC_-fPIE2024042720240425
7707622353 0 034259 844 896T:sphlib-smallclang_-march=native_-O2_-fomit-frame-pointer_-fwrapv_-Qunused-arguments_-fPIC_-fPIE2024042720240425
7804556905 0 219268298 852 3104T:vperm-intrclang_-march=native_-O2_-fomit-frame-pointer_-fwrapv_-Qunused-arguments_-fPIC_-fPIE2024042720240425
7810556905 0 219269410 852 3104T:vperm-intrclang_-march=native_-O3_-fomit-frame-pointer_-fwrapv_-Qunused-arguments_-fPIC_-fPIE2024042720240425
7880054571 0 219264636 844 3104T:vperm-intrclang_-march=native_-Os_-fomit-frame-pointer_-fwrapv_-Qunused-arguments_-fPIC_-fPIE2024042720240425
7997255427 0 126467428 812 2240T:vperm-intrgcc_-march=native_-mtune=native_-O2_-fomit-frame-pointer_-fwrapv_-fPIC_-fPIE2024042720240425
7998055848 0 126469036 812 2240T:vperm-intrgcc_-march=native_-mtune=native_-O3_-fomit-frame-pointer_-fwrapv_-fPIC_-fPIE2024042720240425
8101354071 0 126465547 804 2240T:vperm-intrgcc_-march=native_-mtune=native_-O_-fomit-frame-pointer_-fwrapv_-fPIC_-fPIE2024042720240425
11291975310 0 087453 820 960T:mmxgcc_-march=native_-mtune=native_-O2_-fomit-frame-pointer_-fwrapv_-fPIC_-fPIE2024042720240425
1323459206 0 022179 844 896T:32bit-2ktableclang_-mcpu=native_-O3_-fomit-frame-pointer_-fwrapv_-Qunused-arguments_-fPIC_-fPIE2024042720240425
1324659281 0 021355 844 896T:32bit-2ktableclang_-march=native_-O2_-fomit-frame-pointer_-fwrapv_-Qunused-arguments_-fPIC_-fPIE2024042720240425
1324859393 0 022579 844 896T:32bit-2ktableclang_-march=native_-O3_-fomit-frame-pointer_-fwrapv_-Qunused-arguments_-fPIC_-fPIE2024042720240425
1333338433 0 018429 836 896T:32bit-2ktableclang_-march=native_-Os_-fomit-frame-pointer_-fwrapv_-Qunused-arguments_-fPIC_-fPIE2024042720240425
1371008942 0 019723 844 896T:32bit-2ktableclang_-march=native_-O_-fomit-frame-pointer_-fwrapv_-Qunused-arguments_-fPIC_-fPIE2024042720240425
13993127334 0 040789 868 896T:opt32clang_-march=native_-O3_-fomit-frame-pointer_-fwrapv_-Qunused-arguments_-fPIC_-fPIE2024042720240425
13994727302 0 039645 868 896T:opt32clang_-march=native_-O2_-fomit-frame-pointer_-fwrapv_-Qunused-arguments_-fPIC_-fPIE2024042720240425
14018727398 0 040645 868 896T:opt32clang_-mcpu=native_-O3_-fomit-frame-pointer_-fwrapv_-Qunused-arguments_-fPIC_-fPIE2024042720240425
14127825709 0 036741 868 896T:opt32clang_-march=native_-O_-fomit-frame-pointer_-fwrapv_-Qunused-arguments_-fPIC_-fPIE2024042720240425
14152421262 0 032908 812 960T:opt32gcc_-march=native_-mtune=native_-O_-fomit-frame-pointer_-fwrapv_-fPIC_-fPIE2024042720240425
14183124729 0 034893 852 896T:opt32clang_-march=native_-Os_-fomit-frame-pointer_-fwrapv_-Qunused-arguments_-fPIC_-fPIE2024042720240425
14189622110 0 034245 820 960T:opt32gcc_-march=native_-mtune=native_-O2_-fomit-frame-pointer_-fwrapv_-fPIC_-fPIE2024042720240425
14302322173 0 032752 796 928T:opt32gcc_-march=native_-mtune=native_-Os_-fomit-frame-pointer_-fwrapv_-fPIC_-fPIE2024042720240425
14538023806 0 037141 820 960T:opt32gcc_-march=native_-mtune=native_-O3_-fomit-frame-pointer_-fwrapv_-fPIC_-fPIE2024042720240425
14634911189 0 024285 804 960T:32bit-2ktablegcc_-march=native_-mtune=native_-O3_-fomit-frame-pointer_-fwrapv_-fPIC_-fPIE2024042720240425
16939511804 0 023733 804 960T:32bit-2ktablegcc_-march=native_-mtune=native_-O2_-fomit-frame-pointer_-fwrapv_-fPIC_-fPIE2024042720240425
18180612083 0 022432 780 928T:32bit-2ktablegcc_-march=native_-mtune=native_-Os_-fomit-frame-pointer_-fwrapv_-fPIC_-fPIE2024042720240425
18699111021 0 022420 796 960T:32bit-2ktablegcc_-march=native_-mtune=native_-O_-fomit-frame-pointer_-fwrapv_-fPIC_-fPIE2024042720240425
2001255616 0 018803 844 896T:32bit-bytesliced-c-fastclang_-march=native_-O3_-fomit-frame-pointer_-fwrapv_-Qunused-arguments_-fPIC_-fPIE2024042720240425
2002815473 0 017547 844 896T:32bit-bytesliced-c-fastclang_-march=native_-O2_-fomit-frame-pointer_-fwrapv_-Qunused-arguments_-fPIC_-fPIE2024042720240425
2051255696 0 018675 844 896T:32bit-bytesliced-c-fastclang_-mcpu=native_-O3_-fomit-frame-pointer_-fwrapv_-Qunused-arguments_-fPIC_-fPIE2024042720240425
2637466169 0 019301 804 960T:32bit-bytesliced-c-fastgcc_-march=native_-mtune=native_-O3_-fomit-frame-pointer_-fwrapv_-fPIC_-fPIE2024042720240425
2651743741 0 015717 804 960T:32bit-bytesliced-c-fastgcc_-march=native_-mtune=native_-O2_-fomit-frame-pointer_-fwrapv_-fPIC_-fPIE2024042720240425
2670723151 0 013157 836 896T:32bit-bytesliced-c-fastclang_-march=native_-Os_-fomit-frame-pointer_-fwrapv_-Qunused-arguments_-fPIC_-fPIE2024042720240425
2712574294 0 015083 844 896T:32bit-bytesliced-c-fastclang_-march=native_-O_-fomit-frame-pointer_-fwrapv_-Qunused-arguments_-fPIC_-fPIE2024042720240425
2924612758 0 013112 780 928T:32bit-bytesliced-c-fastgcc_-march=native_-mtune=native_-Os_-fomit-frame-pointer_-fwrapv_-fPIC_-fPIE2024042720240425
3004143041 0 014484 796 960T:32bit-bytesliced-c-fastgcc_-march=native_-mtune=native_-O_-fomit-frame-pointer_-fwrapv_-fPIC_-fPIE2024042720240425
3142755876 0 019035 844 896T:32bit-bytesliced-c-smallclang_-march=native_-O3_-fomit-frame-pointer_-fwrapv_-Qunused-arguments_-fPIC_-fPIE2024042720240425
3155343680 0 015723 844 896T:32bit-bytesliced-c-smallclang_-march=native_-O2_-fomit-frame-pointer_-fwrapv_-Qunused-arguments_-fPIC_-fPIE2024042720240425
3191935892 0 018843 844 896T:32bit-bytesliced-c-smallclang_-mcpu=native_-O3_-fomit-frame-pointer_-fwrapv_-Qunused-arguments_-fPIC_-fPIE2024042720240425
365398110256 0 2272121114 852 3168T:vperm-intrclang_-march=native_-O_-fomit-frame-pointer_-fwrapv_-Qunused-arguments_-fPIC_-fPIE2024042720240425
3743164780 0 016764 812 960T:8bit_cgcc_-march=native_-mtune=native_-O2_-fomit-frame-pointer_-fwrapv_-fPIC_-fPIE2024042720240425
3891324852 0 017988 812 960T:8bit_cgcc_-march=native_-mtune=native_-O3_-fomit-frame-pointer_-fwrapv_-fPIC_-fPIE2024042720240425
4012972012 0 011965 836 896T:32bit-bytesliced-c-smallclang_-march=native_-Os_-fomit-frame-pointer_-fwrapv_-Qunused-arguments_-fPIC_-fPIE2024042720240425
4116053313 0 014043 844 896T:32bit-bytesliced-c-smallclang_-march=native_-O_-fomit-frame-pointer_-fwrapv_-Qunused-arguments_-fPIC_-fPIE2024042720240425
4293042333 0 014261 804 960T:32bit-bytesliced-c-smallgcc_-march=native_-mtune=native_-O2_-fomit-frame-pointer_-fwrapv_-fPIC_-fPIE2024042720240425
4320071853 0 012152 780 928T:32bit-bytesliced-c-smallgcc_-march=native_-mtune=native_-Os_-fomit-frame-pointer_-fwrapv_-fPIC_-fPIE2024042720240425
4567114565 0 016019 804 960T:8bit_cgcc_-march=native_-mtune=native_-O_-fomit-frame-pointer_-fwrapv_-fPIC_-fPIE2024042720240425
4986964408 0 017315 844 896T:8bit_cclang_-mcpu=native_-O3_-fomit-frame-pointer_-fwrapv_-Qunused-arguments_-fPIC_-fPIE2024042720240425
4988234429 0 016427 844 896T:8bit_cclang_-march=native_-O2_-fomit-frame-pointer_-fwrapv_-Qunused-arguments_-fPIC_-fPIE2024042720240425
4988334429 0 017539 844 896T:8bit_cclang_-march=native_-O3_-fomit-frame-pointer_-fwrapv_-Qunused-arguments_-fPIC_-fPIE2024042720240425
4989364009 0 013941 836 896T:8bit_cclang_-march=native_-Os_-fomit-frame-pointer_-fwrapv_-Qunused-arguments_-fPIC_-fPIE2024042720240425
5075564355 0 015075 844 896T:8bit_cclang_-march=native_-O_-fomit-frame-pointer_-fwrapv_-Qunused-arguments_-fPIC_-fPIE2024042720240425
5731914923 0 018013 804 960T:32bit-bytesliced-c-smallgcc_-march=native_-mtune=native_-O3_-fomit-frame-pointer_-fwrapv_-fPIC_-fPIE2024042720240425
5807502576 0 013972 796 960T:32bit-bytesliced-c-smallgcc_-march=native_-mtune=native_-O_-fomit-frame-pointer_-fwrapv_-fPIC_-fPIE2024042720240425
6073584155 0 014543 788 928T:8bit_cgcc_-march=native_-mtune=native_-Os_-fomit-frame-pointer_-fwrapv_-fPIC_-fPIE2024042720240425

Test failure

Implementation: T:aesni
Security model: timingleaks
Compiler: gcc -march=native -mtune=native -O2 -fomit-frame-pointer -fwrapv -fPIC -fPIE
error 111

Number of similar (compiler,implementation) pairs: 8, namely:
CompilerImplementations
gcc -march=native -mtune=native -O2 -fomit-frame-pointer -fwrapv -fPIC -fPIE T:aesni
gcc -march=native -mtune=native -O3 -fomit-frame-pointer -fwrapv -fPIC -fPIE T:aesni
gcc -march=native -mtune=native -O -fomit-frame-pointer -fwrapv -fPIC -fPIE T:aesni
gcc -march=native -mtune=native -Os -fomit-frame-pointer -fwrapv -fPIC -fPIE T:aesni
gcc -march=native -mtune=native -O2 -fomit-frame-pointer -fwrapv -fPIC -fPIE T:avx
gcc -march=native -mtune=native -O3 -fomit-frame-pointer -fwrapv -fPIC -fPIE T:avx
gcc -march=native -mtune=native -O -fomit-frame-pointer -fwrapv -fPIC -fPIE T:avx
gcc -march=native -mtune=native -Os -fomit-frame-pointer -fwrapv -fPIC -fPIE T:avx

Compiler output

Implementation: T:aesni
Security model: timingleaks
Compiler: clang -march=native -O2 -fomit-frame-pointer -fwrapv -Qunused-arguments -fPIC -fPIE
hash.c: hash.c:104:12: warning: comparison of array 'ctx->chaining' equal to a null pointer is always false [-Wtautological-pointer-compare]
hash.c: if (ctx->chaining == NULL || ctx->buffer == NULL)
hash.c: ~~~~~^~~~~~~~ ~~~~
hash.c: hash.c:104:37: warning: comparison of array 'ctx->buffer' equal to a null pointer is always false [-Wtautological-pointer-compare]
hash.c: if (ctx->chaining == NULL || ctx->buffer == NULL)
hash.c: ~~~~~^~~~~~ ~~~~
hash.c: In file included from hash.c:13:
hash.c: ./groestl-asm-aes.h:389:8: error: invalid operand for instruction
hash.c: asm ("movaps xmm12, [rdi+0*16]");
hash.c: ^
hash.c: <inline asm>:1:16: note: instantiated into assembly here
hash.c: movaps xmm12, [rdi+0*16]
hash.c: ^~~~~~~~~~
hash.c: In file included from hash.c:13:
hash.c: ./groestl-asm-aes.h:390:8: error: invalid operand for instruction
hash.c: asm ("movaps xmm13, [rdi+1*16]");
hash.c: ^
hash.c: <inline asm>:1:16: note: instantiated into assembly here
hash.c: movaps xmm13, [rdi+1*16]
hash.c: ^~~~~~~~~~
hash.c: In file included from hash.c:13:
hash.c: ./groestl-asm-aes.h:391:8: error: invalid operand for instruction
hash.c: asm ("movaps xmm14, [rdi+2*16]");
hash.c: ^
hash.c: <inline asm>:1:16: note: instantiated into assembly here
hash.c: ...

Number of similar (compiler,implementation) pairs: 5, namely:
CompilerImplementations
clang -march=native -O2 -fomit-frame-pointer -fwrapv -Qunused-arguments -fPIC -fPIE T:aesni
clang -march=native -O3 -fomit-frame-pointer -fwrapv -Qunused-arguments -fPIC -fPIE T:aesni
clang -march=native -O -fomit-frame-pointer -fwrapv -Qunused-arguments -fPIC -fPIE T:aesni
clang -march=native -Os -fomit-frame-pointer -fwrapv -Qunused-arguments -fPIC -fPIE T:aesni
clang -mcpu=native -O3 -fomit-frame-pointer -fwrapv -Qunused-arguments -fPIC -fPIE T:aesni

Compiler output

Implementation: T:aesni-intr
Security model: timingleaks
Compiler: clang -march=native -O2 -fomit-frame-pointer -fwrapv -Qunused-arguments -fPIC -fPIE
hash.c: In file included from hash.c:28:
hash.c: ./groestl-intr-aes.h:423:3: error: always_inline function '_mm_aesenclast_si128' requires target feature 'aes', but would be inlined into function 'TF512' that is compiled without support for 'aes'
hash.c: ROUNDS_P_Q();
hash.c: ^
hash.c: ./groestl-intr-aes.h:220:3: note: expanded from macro 'ROUNDS_P_Q'
hash.c: ROUND(0, xmm8, xmm9, xmm10, xmm11, xmm12, xmm13, xmm14, xmm15, xmm0, xmm1, xmm2, xmm3, xmm4, xmm5, xmm6, xmm7);\
hash.c: ^
hash.c: ./groestl-intr-aes.h:197:8: note: expanded from macro 'ROUND'
hash.c: a0 = _mm_aesenclast_si128(a0, b0);\
hash.c: ^
hash.c: ./groestl-intr-aes.h:423:3: error: always_inline function '_mm_aesenclast_si128' requires target feature 'aes', but would be inlined into function 'TF512' that is compiled without support for 'aes'
hash.c: ./groestl-intr-aes.h:220:3: note: expanded from macro 'ROUNDS_P_Q'
hash.c: ROUND(0, xmm8, xmm9, xmm10, xmm11, xmm12, xmm13, xmm14, xmm15, xmm0, xmm1, xmm2, xmm3, xmm4, xmm5, xmm6, xmm7);\
hash.c: ^
hash.c: ./groestl-intr-aes.h:199:8: note: expanded from macro 'ROUND'
hash.c: a1 = _mm_aesenclast_si128(a1, b0);\
hash.c: ^
hash.c: ./groestl-intr-aes.h:423:3: error: always_inline function '_mm_aesenclast_si128' requires target feature 'aes', but would be inlined into function 'TF512' that is compiled without support for 'aes'
hash.c: ./groestl-intr-aes.h:220:3: note: expanded from macro 'ROUNDS_P_Q'
hash.c: ROUND(0, xmm8, xmm9, xmm10, xmm11, xmm12, xmm13, xmm14, xmm15, xmm0, xmm1, xmm2, xmm3, xmm4, xmm5, xmm6, xmm7);\
hash.c: ^
hash.c: ./groestl-intr-aes.h:201:8: note: expanded from macro 'ROUND'
hash.c: a2 = _mm_aesenclast_si128(a2, b0);\
hash.c: ^
hash.c: ./groestl-intr-aes.h:423:3: error: always_inline function '_mm_aesenclast_si128' requires target feature 'aes', but would be inlined into function 'TF512' that is compiled without support for 'aes'
hash.c: ...

Number of similar (compiler,implementation) pairs: 4, namely:
CompilerImplementations
clang -march=native -O2 -fomit-frame-pointer -fwrapv -Qunused-arguments -fPIC -fPIE T:aesni-intr
clang -march=native -O3 -fomit-frame-pointer -fwrapv -Qunused-arguments -fPIC -fPIE T:aesni-intr
clang -march=native -O -fomit-frame-pointer -fwrapv -Qunused-arguments -fPIC -fPIE T:aesni-intr
clang -march=native -Os -fomit-frame-pointer -fwrapv -Qunused-arguments -fPIC -fPIE T:aesni-intr

Compiler output

Implementation: T:aesni-intr
Security model: timingleaks
Compiler: clang -mcpu=native -O3 -fomit-frame-pointer -fwrapv -Qunused-arguments -fPIC -fPIE
hash.c: In file included from hash.c:28:
hash.c: ./groestl-intr-aes.h:370:3: error: always_inline function '_mm_shuffle_epi8' requires target feature 'ssse3', but would be inlined into function 'INIT' that is compiled without support for 'ssse3'
hash.c: Matrix_Transpose_A(xmm12, xmm13, xmm14, xmm15, xmm2, xmm6, xmm7, xmm0);
hash.c: ^
hash.c: ./groestl-intr-aes.h:242:8: note: expanded from macro 'Matrix_Transpose_A'
hash.c: i0 = _mm_shuffle_epi8(i0, t0);\
hash.c: ^
hash.c: ./groestl-intr-aes.h:370:3: error: always_inline function '_mm_shuffle_epi8' requires target feature 'ssse3', but would be inlined into function 'INIT' that is compiled without support for 'ssse3'
hash.c: ./groestl-intr-aes.h:243:8: note: expanded from macro 'Matrix_Transpose_A'
hash.c: i1 = _mm_shuffle_epi8(i1, t0);\
hash.c: ^
hash.c: ./groestl-intr-aes.h:370:3: error: always_inline function '_mm_shuffle_epi8' requires target feature 'ssse3', but would be inlined into function 'INIT' that is compiled without support for 'ssse3'
hash.c: ./groestl-intr-aes.h:244:8: note: expanded from macro 'Matrix_Transpose_A'
hash.c: i2 = _mm_shuffle_epi8(i2, t0);\
hash.c: ^
hash.c: ./groestl-intr-aes.h:370:3: error: always_inline function '_mm_shuffle_epi8' requires target feature 'ssse3', but would be inlined into function 'INIT' that is compiled without support for 'ssse3'
hash.c: ./groestl-intr-aes.h:245:8: note: expanded from macro 'Matrix_Transpose_A'
hash.c: i3 = _mm_shuffle_epi8(i3, t0);\
hash.c: ^
hash.c: hash.c:104:12: warning: comparison of array 'ctx->chaining' equal to a null pointer is always false [-Wtautological-pointer-compare]
hash.c: if (ctx->chaining == NULL || ctx->buffer == NULL)
hash.c: ~~~~~^~~~~~~~ ~~~~
hash.c: hash.c:104:37: warning: comparison of array 'ctx->buffer' equal to a null pointer is always false [-Wtautological-pointer-compare]
hash.c: if (ctx->chaining == NULL || ctx->buffer == NULL)
hash.c: ~~~~~^~~~~~ ~~~~
hash.c: ...

Number of similar (compiler,implementation) pairs: 1, namely:
CompilerImplementations
clang -mcpu=native -O3 -fomit-frame-pointer -fwrapv -Qunused-arguments -fPIC -fPIE T:aesni-intr

Compiler output

Implementation: T:aesni-intr
Security model: timingleaks
Compiler: gcc -march=native -mtune=native -O2 -fomit-frame-pointer -fwrapv -fPIC -fPIE
hash.c: In file included from groestl-intr-aes.h:11,
hash.c: from hash.c:28:
hash.c: groestl-intr-aes.h: In function 'TF512':
hash.c: /usr/lib/gcc/x86_64-linux-gnu/11/include/wmmintrin.h:69:1: error: inlining failed in call to 'always_inline' '_mm_aesenclast_si128': target specific option mismatch
hash.c: 69 | _mm_aesenclast_si128 (__m128i __X, __m128i __Y)
hash.c: | ^~~~~~~~~~~~~~~~~~~~
hash.c: In file included from hash.c:28:
hash.c: groestl-intr-aes.h:211:8: note: called from here
hash.c: 211 | a7 = _mm_aesenclast_si128(a7, b0);\
hash.c: | ^~~~~~~~~~~~~~~~~~~~~~~~~~~~
hash.c: groestl-intr-aes.h:229:3: note: in expansion of macro 'ROUND'
hash.c: 229 | ROUND(9, xmm0, xmm1, xmm2, xmm3, xmm4, xmm5, xmm6, xmm7, xmm8, xmm9, xmm10, xmm11, xmm12, xmm13, xmm14, xmm15);\
hash.c: | ^~~~~
hash.c: groestl-intr-aes.h:423:3: note: in expansion of macro 'ROUNDS_P_Q'
hash.c: 423 | ROUNDS_P_Q();
hash.c: | ^~~~~~~~~~
hash.c: In file included from groestl-intr-aes.h:11,
hash.c: from hash.c:28:
hash.c: /usr/lib/gcc/x86_64-linux-gnu/11/include/wmmintrin.h:69:1: error: inlining failed in call to 'always_inline' '_mm_aesenclast_si128': target specific option mismatch
hash.c: 69 | _mm_aesenclast_si128 (__m128i __X, __m128i __Y)
hash.c: | ^~~~~~~~~~~~~~~~~~~~
hash.c: In file included from hash.c:28:
hash.c: groestl-intr-aes.h:209:8: note: called from here
hash.c: 209 | a6 = _mm_aesenclast_si128(a6, b0);\
hash.c: | ^~~~~~~~~~~~~~~~~~~~~~~~~~~~
hash.c: ...

Number of similar (compiler,implementation) pairs: 4, namely:
CompilerImplementations
gcc -march=native -mtune=native -O2 -fomit-frame-pointer -fwrapv -fPIC -fPIE T:aesni-intr
gcc -march=native -mtune=native -O3 -fomit-frame-pointer -fwrapv -fPIC -fPIE T:aesni-intr
gcc -march=native -mtune=native -O -fomit-frame-pointer -fwrapv -fPIC -fPIE T:aesni-intr
gcc -march=native -mtune=native -Os -fomit-frame-pointer -fwrapv -fPIC -fPIE T:aesni-intr

Compiler output

Implementation: T:avx
Security model: timingleaks
Compiler: clang -march=native -O2 -fomit-frame-pointer -fwrapv -Qunused-arguments -fPIC -fPIE
hash.c: hash.c:69:12: warning: comparison of array 'ctx->chaining' equal to a null pointer is always false [-Wtautological-pointer-compare]
hash.c: if (ctx->chaining == NULL || ctx->buffer == NULL)
hash.c: ~~~~~^~~~~~~~ ~~~~
hash.c: hash.c:69:37: warning: comparison of array 'ctx->buffer' equal to a null pointer is always false [-Wtautological-pointer-compare]
hash.c: if (ctx->chaining == NULL || ctx->buffer == NULL)
hash.c: ~~~~~^~~~~~ ~~~~
hash.c: hash.c:62:3: warning: while loop has empty body [-Wempty-body]
hash.c: SET_CONSTANTS();
hash.c: ^
hash.c: ./groestl-asm-avx.h:62:10: note: expanded from macro 'SET_CONSTANTS'
hash.c: }while(0);
hash.c: ^
hash.c: hash.c:62:3: note: put the semicolon on a separate line to silence this warning
hash.c: ./groestl-asm-avx.h:62:10: note: expanded from macro 'SET_CONSTANTS'
hash.c: }while(0);
hash.c: ^
hash.c: ./groestl-asm-avx.h:377:8: error: invalid operand for instruction
hash.c: asm ("vmovdqa xmm12, [rdi+0*16]");
hash.c: ^
hash.c: <inline asm>:1:17: note: instantiated into assembly here
hash.c: vmovdqa xmm12, [rdi+0*16]
hash.c: ^~~~~~~~~~
hash.c: In file included from hash.c:9:
hash.c: ./groestl-asm-avx.h:378:8: error: invalid operand for instruction
hash.c: asm ("vmovdqa xmm13, [rdi+1*16]");
hash.c: ...

Number of similar (compiler,implementation) pairs: 5, namely:
CompilerImplementations
clang -march=native -O2 -fomit-frame-pointer -fwrapv -Qunused-arguments -fPIC -fPIE T:avx
clang -march=native -O3 -fomit-frame-pointer -fwrapv -Qunused-arguments -fPIC -fPIE T:avx
clang -march=native -O -fomit-frame-pointer -fwrapv -Qunused-arguments -fPIC -fPIE T:avx
clang -march=native -Os -fomit-frame-pointer -fwrapv -Qunused-arguments -fPIC -fPIE T:avx
clang -mcpu=native -O3 -fomit-frame-pointer -fwrapv -Qunused-arguments -fPIC -fPIE T:avx

Compiler output

Implementation: T:avx-intr
Security model: timingleaks
Compiler: clang -march=native -O2 -fomit-frame-pointer -fwrapv -Qunused-arguments -fPIC -fPIE
hash.c: In file included from hash.c:9:
hash.c: ./groestl-intr-avx.h:406:3: error: always_inline function '_mm_aesenclast_si128' requires target feature 'aes', but would be inlined into function 'TF512' that is compiled without support for 'aes'
hash.c: ROUNDS_P_Q();
hash.c: ^
hash.c: ./groestl-intr-avx.h:227:3: note: expanded from macro 'ROUNDS_P_Q'
hash.c: ROUND(0, xmm8, xmm9, xmm10, xmm11, xmm12, xmm13, xmm14, xmm15, xmm0, xmm1, xmm2, xmm3, xmm4, xmm5, xmm6, xmm7);\
hash.c: ^
hash.c: ./groestl-intr-avx.h:205:8: note: expanded from macro 'ROUND'
hash.c: a0 = _mm_aesenclast_si128(a0, b7);\
hash.c: ^
hash.c: ./groestl-intr-avx.h:406:3: error: always_inline function '_mm_aesenclast_si128' requires target feature 'aes', but would be inlined into function 'TF512' that is compiled without support for 'aes'
hash.c: ./groestl-intr-avx.h:227:3: note: expanded from macro 'ROUNDS_P_Q'
hash.c: ROUND(0, xmm8, xmm9, xmm10, xmm11, xmm12, xmm13, xmm14, xmm15, xmm0, xmm1, xmm2, xmm3, xmm4, xmm5, xmm6, xmm7);\
hash.c: ^
hash.c: ./groestl-intr-avx.h:207:8: note: expanded from macro 'ROUND'
hash.c: a1 = _mm_aesenclast_si128(a1, b7);\
hash.c: ^
hash.c: ./groestl-intr-avx.h:406:3: error: always_inline function '_mm_aesenclast_si128' requires target feature 'aes', but would be inlined into function 'TF512' that is compiled without support for 'aes'
hash.c: ./groestl-intr-avx.h:227:3: note: expanded from macro 'ROUNDS_P_Q'
hash.c: ROUND(0, xmm8, xmm9, xmm10, xmm11, xmm12, xmm13, xmm14, xmm15, xmm0, xmm1, xmm2, xmm3, xmm4, xmm5, xmm6, xmm7);\
hash.c: ^
hash.c: ./groestl-intr-avx.h:209:8: note: expanded from macro 'ROUND'
hash.c: a2 = _mm_aesenclast_si128(a2, b7);\
hash.c: ^
hash.c: ./groestl-intr-avx.h:406:3: error: always_inline function '_mm_aesenclast_si128' requires target feature 'aes', but would be inlined into function 'TF512' that is compiled without support for 'aes'
hash.c: ...

Number of similar (compiler,implementation) pairs: 4, namely:
CompilerImplementations
clang -march=native -O2 -fomit-frame-pointer -fwrapv -Qunused-arguments -fPIC -fPIE T:avx-intr
clang -march=native -O3 -fomit-frame-pointer -fwrapv -Qunused-arguments -fPIC -fPIE T:avx-intr
clang -march=native -O -fomit-frame-pointer -fwrapv -Qunused-arguments -fPIC -fPIE T:avx-intr
clang -march=native -Os -fomit-frame-pointer -fwrapv -Qunused-arguments -fPIC -fPIE T:avx-intr

Compiler output

Implementation: T:avx-intr
Security model: timingleaks
Compiler: clang -mcpu=native -O3 -fomit-frame-pointer -fwrapv -Qunused-arguments -fPIC -fPIE
hash.c: In file included from hash.c:9:
hash.c: ./groestl-intr-avx.h:356:3: error: always_inline function '_mm_shuffle_epi8' requires target feature 'ssse3', but would be inlined into function 'INIT' that is compiled without support for 'ssse3'
hash.c: Matrix_Transpose_A(xmm12, xmm13, xmm14, xmm15, xmm2, xmm6, xmm7, xmm0);
hash.c: ^
hash.c: ./groestl-intr-avx.h:249:8: note: expanded from macro 'Matrix_Transpose_A'
hash.c: i0 = _mm_shuffle_epi8(i0, t0);\
hash.c: ^
hash.c: ./groestl-intr-avx.h:356:3: error: always_inline function '_mm_shuffle_epi8' requires target feature 'ssse3', but would be inlined into function 'INIT' that is compiled without support for 'ssse3'
hash.c: ./groestl-intr-avx.h:250:8: note: expanded from macro 'Matrix_Transpose_A'
hash.c: i1 = _mm_shuffle_epi8(i1, t0);\
hash.c: ^
hash.c: ./groestl-intr-avx.h:356:3: error: always_inline function '_mm_shuffle_epi8' requires target feature 'ssse3', but would be inlined into function 'INIT' that is compiled without support for 'ssse3'
hash.c: ./groestl-intr-avx.h:251:8: note: expanded from macro 'Matrix_Transpose_A'
hash.c: i2 = _mm_shuffle_epi8(i2, t0);\
hash.c: ^
hash.c: ./groestl-intr-avx.h:356:3: error: always_inline function '_mm_shuffle_epi8' requires target feature 'ssse3', but would be inlined into function 'INIT' that is compiled without support for 'ssse3'
hash.c: ./groestl-intr-avx.h:252:8: note: expanded from macro 'Matrix_Transpose_A'
hash.c: i3 = _mm_shuffle_epi8(i3, t0);\
hash.c: ^
hash.c: hash.c:69:12: warning: comparison of array 'ctx->chaining' equal to a null pointer is always false [-Wtautological-pointer-compare]
hash.c: if (ctx->chaining == NULL || ctx->buffer == NULL)
hash.c: ~~~~~^~~~~~~~ ~~~~
hash.c: hash.c:69:37: warning: comparison of array 'ctx->buffer' equal to a null pointer is always false [-Wtautological-pointer-compare]
hash.c: if (ctx->chaining == NULL || ctx->buffer == NULL)
hash.c: ~~~~~^~~~~~ ~~~~
hash.c: ...

Number of similar (compiler,implementation) pairs: 1, namely:
CompilerImplementations
clang -mcpu=native -O3 -fomit-frame-pointer -fwrapv -Qunused-arguments -fPIC -fPIE T:avx-intr

Compiler output

Implementation: T:avx-intr
Security model: timingleaks
Compiler: gcc -march=native -mtune=native -O2 -fomit-frame-pointer -fwrapv -fPIC -fPIE
hash.c: In file included from groestl-intr-avx.h:11,
hash.c: from hash.c:9:
hash.c: groestl-intr-avx.h: In function 'TF512':
hash.c: /usr/lib/gcc/x86_64-linux-gnu/11/include/wmmintrin.h:69:1: error: inlining failed in call to 'always_inline' '_mm_aesenclast_si128': target specific option mismatch
hash.c: 69 | _mm_aesenclast_si128 (__m128i __X, __m128i __Y)
hash.c: | ^~~~~~~~~~~~~~~~~~~~
hash.c: In file included from hash.c:9:
hash.c: groestl-intr-avx.h:219:8: note: called from here
hash.c: 219 | a7 = _mm_aesenclast_si128(a7, b7);\
hash.c: | ^~~~~~~~~~~~~~~~~~~~~~~~~~~~
hash.c: groestl-intr-avx.h:236:3: note: in expansion of macro 'ROUND'
hash.c: 236 | ROUND(9, xmm8, xmm9, xmm10, xmm11, xmm12, xmm13, xmm14, xmm15, xmm0, xmm1, xmm2, xmm3, xmm4, xmm5, xmm6, xmm7);\
hash.c: | ^~~~~
hash.c: groestl-intr-avx.h:406:3: note: in expansion of macro 'ROUNDS_P_Q'
hash.c: 406 | ROUNDS_P_Q();
hash.c: | ^~~~~~~~~~
hash.c: In file included from groestl-intr-avx.h:11,
hash.c: from hash.c:9:
hash.c: /usr/lib/gcc/x86_64-linux-gnu/11/include/wmmintrin.h:69:1: error: inlining failed in call to 'always_inline' '_mm_aesenclast_si128': target specific option mismatch
hash.c: 69 | _mm_aesenclast_si128 (__m128i __X, __m128i __Y)
hash.c: | ^~~~~~~~~~~~~~~~~~~~
hash.c: In file included from hash.c:9:
hash.c: groestl-intr-avx.h:217:8: note: called from here
hash.c: 217 | a6 = _mm_aesenclast_si128(a6, b7);\
hash.c: | ^~~~~~~~~~~~~~~~~~~~~~~~~~~~
hash.c: ...

Number of similar (compiler,implementation) pairs: 4, namely:
CompilerImplementations
gcc -march=native -mtune=native -O2 -fomit-frame-pointer -fwrapv -fPIC -fPIE T:avx-intr
gcc -march=native -mtune=native -O3 -fomit-frame-pointer -fwrapv -fPIC -fPIE T:avx-intr
gcc -march=native -mtune=native -O -fomit-frame-pointer -fwrapv -fPIC -fPIE T:avx-intr
gcc -march=native -mtune=native -Os -fomit-frame-pointer -fwrapv -fPIC -fPIE T:avx-intr

Compiler output

Implementation: T:core2duo
Security model: timingleaks
Compiler: clang -march=native -O2 -fomit-frame-pointer -fwrapv -Qunused-arguments -fPIC -fPIE
try.c: /usr/bin/ld: libcrypto_hash_groestl256.a(hash.o): relocation R_X86_64_32S against symbol `T0' can not be used when making a PIE object; recompile with -fPIE
try.c: /usr/bin/ld: failed to set dynamic section sizes: bad value
try.c: clang: error: linker command failed with exit code 1 (use -v to see invocation)

Number of similar (compiler,implementation) pairs: 15, namely:
CompilerImplementations
clang -march=native -O2 -fomit-frame-pointer -fwrapv -Qunused-arguments -fPIC -fPIE T:core2duo
clang -march=native -O3 -fomit-frame-pointer -fwrapv -Qunused-arguments -fPIC -fPIE T:core2duo
clang -march=native -O -fomit-frame-pointer -fwrapv -Qunused-arguments -fPIC -fPIE T:core2duo
clang -march=native -Os -fomit-frame-pointer -fwrapv -Qunused-arguments -fPIC -fPIE T:core2duo
clang -mcpu=native -O3 -fomit-frame-pointer -fwrapv -Qunused-arguments -fPIC -fPIE T:core2duo
clang -march=native -O2 -fomit-frame-pointer -fwrapv -Qunused-arguments -fPIC -fPIE T:opteron
clang -march=native -O3 -fomit-frame-pointer -fwrapv -Qunused-arguments -fPIC -fPIE T:opteron
clang -march=native -O -fomit-frame-pointer -fwrapv -Qunused-arguments -fPIC -fPIE T:opteron
clang -march=native -Os -fomit-frame-pointer -fwrapv -Qunused-arguments -fPIC -fPIE T:opteron
clang -mcpu=native -O3 -fomit-frame-pointer -fwrapv -Qunused-arguments -fPIC -fPIE T:opteron
clang -march=native -O2 -fomit-frame-pointer -fwrapv -Qunused-arguments -fPIC -fPIE T:opteron-unrolled
clang -march=native -O3 -fomit-frame-pointer -fwrapv -Qunused-arguments -fPIC -fPIE T:opteron-unrolled
clang -march=native -O -fomit-frame-pointer -fwrapv -Qunused-arguments -fPIC -fPIE T:opteron-unrolled
clang -march=native -Os -fomit-frame-pointer -fwrapv -Qunused-arguments -fPIC -fPIE T:opteron-unrolled
clang -mcpu=native -O3 -fomit-frame-pointer -fwrapv -Qunused-arguments -fPIC -fPIE T:opteron-unrolled

Compiler output

Implementation: T:core2duo
Security model: timingleaks
Compiler: gcc -march=native -mtune=native -O2 -fomit-frame-pointer -fwrapv -fPIC -fPIE
try.c: /usr/bin/ld: libcrypto_hash_groestl256.a(hash.o): in function `Transform':
try.c: hash.c:(.text+0x...): undefined reference to `Q512ASM'
try.c: /usr/bin/ld: hash.c:(.text+0x...): undefined reference to `P512ASM'
try.c: /usr/bin/ld: libcrypto_hash_groestl256.a(hash.o): in function `OutputTransformation':
try.c: hash.c:(.text+0x...): undefined reference to `P512ASM'
try.c: collect2: error: ld returned 1 exit status

Number of similar (compiler,implementation) pairs: 9, namely:
CompilerImplementations
gcc -march=native -mtune=native -O2 -fomit-frame-pointer -fwrapv -fPIC -fPIE T:core2duo
gcc -march=native -mtune=native -O -fomit-frame-pointer -fwrapv -fPIC -fPIE T:core2duo
gcc -march=native -mtune=native -Os -fomit-frame-pointer -fwrapv -fPIC -fPIE T:core2duo
gcc -march=native -mtune=native -O2 -fomit-frame-pointer -fwrapv -fPIC -fPIE T:opteron
gcc -march=native -mtune=native -O -fomit-frame-pointer -fwrapv -fPIC -fPIE T:opteron
gcc -march=native -mtune=native -Os -fomit-frame-pointer -fwrapv -fPIC -fPIE T:opteron
gcc -march=native -mtune=native -O2 -fomit-frame-pointer -fwrapv -fPIC -fPIE T:opteron-unrolled
gcc -march=native -mtune=native -O -fomit-frame-pointer -fwrapv -fPIC -fPIE T:opteron-unrolled
gcc -march=native -mtune=native -Os -fomit-frame-pointer -fwrapv -fPIC -fPIE T:opteron-unrolled

Compiler output

Implementation: T:core2duo
Security model: timingleaks
Compiler: gcc -march=native -mtune=native -O3 -fomit-frame-pointer -fwrapv -fPIC -fPIE
try.c: /usr/bin/ld: libcrypto_hash_groestl256.a(hash.o): in function `Transform.constprop.0':
try.c: hash.c:(.text+0x...): undefined reference to `Q512ASM'
try.c: /usr/bin/ld: hash.c:(.text+0x...): undefined reference to `P512ASM'
try.c: /usr/bin/ld: libcrypto_hash_groestl256.a(hash.o): in function `Transform':
try.c: hash.c:(.text+0x...): undefined reference to `Q512ASM'
try.c: /usr/bin/ld: hash.c:(.text+0x...): undefined reference to `P512ASM'
try.c: /usr/bin/ld: libcrypto_hash_groestl256.a(hash.o): in function `OutputTransformation':
try.c: hash.c:(.text+0x...): undefined reference to `P512ASM'
try.c: /usr/bin/ld: libcrypto_hash_groestl256.a(hash.o): in function `Final':
try.c: hash.c:(.text+0x...): undefined reference to `P512ASM'
try.c: collect2: error: ld returned 1 exit status

Number of similar (compiler,implementation) pairs: 2, namely:
CompilerImplementations
gcc -march=native -mtune=native -O3 -fomit-frame-pointer -fwrapv -fPIC -fPIE T:core2duo T:opteron-unrolled

Compiler output

Implementation: T:opt64
Security model: timingleaks
Compiler: clang -march=native -O2 -fomit-frame-pointer -fwrapv -Qunused-arguments -fPIC -fPIE
try.c: /usr/bin/ld: libcrypto_hash_groestl256.a(hash.o): in function `Transform':
try.c: hash.c:(.text+0x...): undefined reference to `F512'
try.c: /usr/bin/ld: hash.c:(.text+0x...): undefined reference to `F1024'
try.c: /usr/bin/ld: libcrypto_hash_groestl256.a(hash.o): in function `Update':
try.c: hash.c:(.text+0x...): undefined reference to `F512'
try.c: /usr/bin/ld: hash.c:(.text+0x...): undefined reference to `F1024'
try.c: /usr/bin/ld: hash.c:(.text+0x...): undefined reference to `F512'
try.c: /usr/bin/ld: hash.c:(.text+0x...): undefined reference to `F1024'
try.c: /usr/bin/ld: libcrypto_hash_groestl256.a(hash.o): in function `Final':
try.c: hash.c:(.text+0x...): undefined reference to `F512'
try.c: /usr/bin/ld: hash.c:(.text+0x...): undefined reference to `F1024'
try.c: /usr/bin/ld: hash.c:(.text+0x...): undefined reference to `F512'
try.c: /usr/bin/ld: hash.c:(.text+0x...): undefined reference to `F1024'
try.c: clang: error: linker command failed with exit code 1 (use -v to see invocation)

Number of similar (compiler,implementation) pairs: 4, namely:
CompilerImplementations
clang -march=native -O2 -fomit-frame-pointer -fwrapv -Qunused-arguments -fPIC -fPIE T:opt64
clang -march=native -O3 -fomit-frame-pointer -fwrapv -Qunused-arguments -fPIC -fPIE T:opt64
clang -march=native -O -fomit-frame-pointer -fwrapv -Qunused-arguments -fPIC -fPIE T:opt64
clang -mcpu=native -O3 -fomit-frame-pointer -fwrapv -Qunused-arguments -fPIC -fPIE T:opt64

Compiler output

Implementation: T:opt64
Security model: timingleaks
Compiler: clang -march=native -Os -fomit-frame-pointer -fwrapv -Qunused-arguments -fPIC -fPIE
try.c: /usr/bin/ld: libcrypto_hash_groestl256.a(hash.o): in function `Transform':
try.c: hash.c:(.text+0x...): undefined reference to `F512'
try.c: /usr/bin/ld: hash.c:(.text+0x...): undefined reference to `F1024'
try.c: clang: error: linker command failed with exit code 1 (use -v to see invocation)

Number of similar (compiler,implementation) pairs: 1, namely:
CompilerImplementations
clang -march=native -Os -fomit-frame-pointer -fwrapv -Qunused-arguments -fPIC -fPIE T:opt64

Compiler output

Implementation: T:opt64
Security model: timingleaks
Compiler: gcc -march=native -mtune=native -O2 -fomit-frame-pointer -fwrapv -fPIC -fPIE
try.c: /usr/bin/ld: libcrypto_hash_groestl256.a(hash.o): in function `Transform':
try.c: hash.c:(.text+0x...): undefined reference to `F1024'
try.c: /usr/bin/ld: hash.c:(.text+0x...): undefined reference to `F512'
try.c: collect2: error: ld returned 1 exit status

Number of similar (compiler,implementation) pairs: 2, namely:
CompilerImplementations
gcc -march=native -mtune=native -O2 -fomit-frame-pointer -fwrapv -fPIC -fPIE T:opt64
gcc -march=native -mtune=native -O -fomit-frame-pointer -fwrapv -fPIC -fPIE T:opt64

Compiler output

Implementation: T:opt64
Security model: timingleaks
Compiler: gcc -march=native -mtune=native -O3 -fomit-frame-pointer -fwrapv -fPIC -fPIE
try.c: /usr/bin/ld: libcrypto_hash_groestl256.a(hash.o): in function `Transform':
try.c: hash.c:(.text+0x...): undefined reference to `F1024'
try.c: /usr/bin/ld: hash.c:(.text+0x...): undefined reference to `F512'
try.c: /usr/bin/ld: libcrypto_hash_groestl256.a(hash.o): in function `Update':
try.c: hash.c:(.text+0x...): undefined reference to `F1024'
try.c: /usr/bin/ld: hash.c:(.text+0x...): undefined reference to `F512'
try.c: /usr/bin/ld: hash.c:(.text+0x...): undefined reference to `F1024'
try.c: /usr/bin/ld: hash.c:(.text+0x...): undefined reference to `F512'
try.c: /usr/bin/ld: libcrypto_hash_groestl256.a(hash.o): in function `Final':
try.c: hash.c:(.text+0x...): undefined reference to `F1024'
try.c: /usr/bin/ld: hash.c:(.text+0x...): undefined reference to `F1024'
try.c: /usr/bin/ld: hash.c:(.text+0x...): undefined reference to `F512'
try.c: /usr/bin/ld: hash.c:(.text+0x...): undefined reference to `F512'
try.c: collect2: error: ld returned 1 exit status

Number of similar (compiler,implementation) pairs: 1, namely:
CompilerImplementations
gcc -march=native -mtune=native -O3 -fomit-frame-pointer -fwrapv -fPIC -fPIE T:opt64

Compiler output

Implementation: T:opt64
Security model: timingleaks
Compiler: gcc -march=native -mtune=native -Os -fomit-frame-pointer -fwrapv -fPIC -fPIE
try.c: /usr/bin/ld: libcrypto_hash_groestl256.a(hash.o): in function `Transform':
try.c: hash.c:(.text+0x...): undefined reference to `F512'
try.c: /usr/bin/ld: hash.c:(.text+0x...): undefined reference to `F1024'
try.c: collect2: error: ld returned 1 exit status

Number of similar (compiler,implementation) pairs: 1, namely:
CompilerImplementations
gcc -march=native -mtune=native -Os -fomit-frame-pointer -fwrapv -fPIC -fPIE T:opt64

Compiler output

Implementation: T:opteron
Security model: timingleaks
Compiler: gcc -march=native -mtune=native -O3 -fomit-frame-pointer -fwrapv -fPIC -fPIE
try.c: /usr/bin/ld: libcrypto_hash_groestl256.a(hash.o): relocation R_X86_64_32S against symbol `T0' can not be used when making a PIE object; recompile with -fPIE
try.c: /usr/bin/ld: failed to set dynamic section sizes: bad value
try.c: collect2: error: ld returned 1 exit status

Number of similar (compiler,implementation) pairs: 1, namely:
CompilerImplementations
gcc -march=native -mtune=native -O3 -fomit-frame-pointer -fwrapv -fPIC -fPIE T:opteron

Compiler output

Implementation: T:vperm
Security model: timingleaks
Compiler: clang -march=native -O2 -fomit-frame-pointer -fwrapv -Qunused-arguments -fPIC -fPIE
hash.c: hash.c:104:12: warning: comparison of array 'ctx->chaining' equal to a null pointer is always false [-Wtautological-pointer-compare]
hash.c: if (ctx->chaining == NULL || ctx->buffer == NULL)
hash.c: ~~~~~^~~~~~~~ ~~~~
hash.c: hash.c:104:37: warning: comparison of array 'ctx->buffer' equal to a null pointer is always false [-Wtautological-pointer-compare]
hash.c: if (ctx->chaining == NULL || ctx->buffer == NULL)
hash.c: ~~~~~^~~~~~ ~~~~
hash.c: In file included from hash.c:19:
hash.c: ./groestl-asm-vperm.h:705:3: error: invalid operand for instruction
hash.c: VPERM_Transform_RoundConst();
hash.c: ^
hash.c: ./groestl-asm-vperm.h:685:8: note: expanded from macro 'VPERM_Transform_RoundConst'
hash.c: asm ("movaps xmm0, [ROUND_CONST_Lx]");\
hash.c: ^
hash.c: <inline asm>:1:15: note: instantiated into assembly here
hash.c: movaps xmm0, [ROUND_CONST_Lx]
hash.c: ^~~~~~~~~~~~~~~~
hash.c: In file included from hash.c:19:
hash.c: ./groestl-asm-vperm.h:705:3: error: invalid operand for instruction
hash.c: VPERM_Transform_RoundConst();
hash.c: ^
hash.c: ./groestl-asm-vperm.h:686:3: note: expanded from macro 'VPERM_Transform_RoundConst'
hash.c: VPERM_Transform(0, 1, VPERM_IPT, 4, 5, 6, 7, 8, 9, 10);\
hash.c: ^
hash.c: ./groestl-asm-vperm.h:142:3: note: expanded from macro 'VPERM_Transform'
hash.c: VPERM_Transform_Set_Const(table, c0, c1, c2);\
hash.c: ...

Number of similar (compiler,implementation) pairs: 5, namely:
CompilerImplementations
clang -march=native -O2 -fomit-frame-pointer -fwrapv -Qunused-arguments -fPIC -fPIE T:vperm
clang -march=native -O3 -fomit-frame-pointer -fwrapv -Qunused-arguments -fPIC -fPIE T:vperm
clang -march=native -O -fomit-frame-pointer -fwrapv -Qunused-arguments -fPIC -fPIE T:vperm
clang -march=native -Os -fomit-frame-pointer -fwrapv -Qunused-arguments -fPIC -fPIE T:vperm
clang -mcpu=native -O3 -fomit-frame-pointer -fwrapv -Qunused-arguments -fPIC -fPIE T:vperm

Compiler output

Implementation: T:vperm
Security model: timingleaks
Compiler: gcc -march=native -mtune=native -O2 -fomit-frame-pointer -fwrapv -fPIC -fPIE
try.c: /usr/bin/ld: libcrypto_hash_groestl256.a(hash.o): relocation R_X86_64_32S against symbol `ROUND_CONST_Lx' can not be used when making a PIE object; recompile with -fPIE
try.c: /usr/bin/ld: failed to set dynamic section sizes: bad value
try.c: collect2: error: ld returned 1 exit status

Number of similar (compiler,implementation) pairs: 4, namely:
CompilerImplementations
gcc -march=native -mtune=native -O2 -fomit-frame-pointer -fwrapv -fPIC -fPIE T:vperm
gcc -march=native -mtune=native -O3 -fomit-frame-pointer -fwrapv -fPIC -fPIE T:vperm
gcc -march=native -mtune=native -O -fomit-frame-pointer -fwrapv -fPIC -fPIE T:vperm
gcc -march=native -mtune=native -Os -fomit-frame-pointer -fwrapv -fPIC -fPIE T:vperm

Compiler output

Implementation: T:vperm-intr
Security model: timingleaks
Compiler: clang -march=native -O2 -fomit-frame-pointer -fwrapv -Qunused-arguments -fPIC -fPIE
hash.c: hash.c:104:12: warning: comparison of array 'ctx->chaining' equal to a null pointer is always false [-Wtautological-pointer-compare]
hash.c: if (ctx->chaining == NULL || ctx->buffer == NULL)
hash.c: ~~~~~^~~~~~~~ ~~~~
hash.c: hash.c:104:37: warning: comparison of array 'ctx->buffer' equal to a null pointer is always false [-Wtautological-pointer-compare]
hash.c: if (ctx->chaining == NULL || ctx->buffer == NULL)
hash.c: ~~~~~^~~~~~ ~~~~
hash.c: 2 warnings generated.

Number of similar (compiler,implementation) pairs: 4, namely:
CompilerImplementations
clang -march=native -O2 -fomit-frame-pointer -fwrapv -Qunused-arguments -fPIC -fPIE T:vperm-intr
clang -march=native -O3 -fomit-frame-pointer -fwrapv -Qunused-arguments -fPIC -fPIE T:vperm-intr
clang -march=native -O -fomit-frame-pointer -fwrapv -Qunused-arguments -fPIC -fPIE T:vperm-intr
clang -march=native -Os -fomit-frame-pointer -fwrapv -Qunused-arguments -fPIC -fPIE T:vperm-intr

Compiler output

Implementation: T:vperm-intr
Security model: timingleaks
Compiler: clang -mcpu=native -O3 -fomit-frame-pointer -fwrapv -Qunused-arguments -fPIC -fPIE
hash.c: In file included from hash.c:34:
hash.c: ./groestl-intr-vperm.h:653:3: error: always_inline function '_mm_shuffle_epi8' requires target feature 'ssse3', but would be inlined into function 'INIT' that is compiled without support for 'ssse3'
hash.c: VPERM_Transform_RoundConst();
hash.c: ^
hash.c: ./groestl-intr-vperm.h:636:3: note: expanded from macro 'VPERM_Transform_RoundConst'
hash.c: VPERM_Transform(xmm0, xmm1, VPERM_IPT, xmm4, xmm5, xmm6, xmm7, xmm8, xmm9, xmm10);\
hash.c: ^
hash.c: ./groestl-intr-vperm.h:119:3: note: expanded from macro 'VPERM_Transform'
hash.c: VPERM_Transform_No_Const(a0, a1, t0, t1, t2, t3, c0, c1, c2);\
hash.c: ^
hash.c: ./groestl-intr-vperm.h:88:8: note: expanded from macro 'VPERM_Transform_No_Const'
hash.c: t2 = _mm_shuffle_epi8(t2, a0);\
hash.c: ^
hash.c: ./groestl-intr-vperm.h:653:3: error: always_inline function '_mm_shuffle_epi8' requires target feature 'ssse3', but would be inlined into function 'INIT' that is compiled without support for 'ssse3'
hash.c: ./groestl-intr-vperm.h:636:3: note: expanded from macro 'VPERM_Transform_RoundConst'
hash.c: VPERM_Transform(xmm0, xmm1, VPERM_IPT, xmm4, xmm5, xmm6, xmm7, xmm8, xmm9, xmm10);\
hash.c: ^
hash.c: ./groestl-intr-vperm.h:119:3: note: expanded from macro 'VPERM_Transform'
hash.c: VPERM_Transform_No_Const(a0, a1, t0, t1, t2, t3, c0, c1, c2);\
hash.c: ^
hash.c: ./groestl-intr-vperm.h:89:8: note: expanded from macro 'VPERM_Transform_No_Const'
hash.c: t3 = _mm_shuffle_epi8(t3, a1);\
hash.c: ^
hash.c: ./groestl-intr-vperm.h:653:3: error: always_inline function '_mm_shuffle_epi8' requires target feature 'ssse3', but would be inlined into function 'INIT' that is compiled without support for 'ssse3'
hash.c: ./groestl-intr-vperm.h:636:3: note: expanded from macro 'VPERM_Transform_RoundConst'
hash.c: ...

Number of similar (compiler,implementation) pairs: 1, namely:
CompilerImplementations
clang -mcpu=native -O3 -fomit-frame-pointer -fwrapv -Qunused-arguments -fPIC -fPIE T:vperm-intr