Implementation notes: amd64, margaux, crypto_hash/asconhashav12

Computer: margaux
Microarchitecture: amd64; Core 2 65nm (6fb)
Architecture: amd64
CPU ID: GenuineIntel-000006fb-bfebfbff
SUPERCOP version: 20230530
Operation: crypto_hash
Primitive: asconhashav12
TimeObject sizeTest sizeImplementationCompilerBenchmark dateSUPERCOP version
313774985 0 015667 844 896opt64clang_-march=native_-O_-fomit-frame-pointer_-fwrapv_-Qunused-arguments_-fPIC_-fPIE2023053120230530
314034975 0 014861 836 896opt64clang_-march=native_-Os_-fomit-frame-pointer_-fwrapv_-Qunused-arguments_-fPIC_-fPIE2023053120230530
314185001 0 016595 844 896opt64clang_-march=native_-O2_-fomit-frame-pointer_-fwrapv_-Qunused-arguments_-fPIC_-fPIE2023053120230530
314185001 0 017707 844 896opt64clang_-march=native_-O3_-fomit-frame-pointer_-fwrapv_-Qunused-arguments_-fPIC_-fPIE2023053120230530
314185001 0 017483 844 896opt64clang_-mcpu=native_-O3_-fomit-frame-pointer_-fwrapv_-Qunused-arguments_-fPIC_-fPIE2023053120230530
333755364 0 018412 812 960opt64gcc_-march=native_-mtune=native_-O3_-fomit-frame-pointer_-fwrapv_-fPIC_-fPIE2023053120230530
333925364 0 017220 812 960opt64gcc_-march=native_-mtune=native_-O2_-fomit-frame-pointer_-fwrapv_-fPIC_-fPIE2023053120230530
338005414 0 015727 788 928opt64gcc_-march=native_-mtune=native_-Os_-fomit-frame-pointer_-fwrapv_-fPIC_-fPIE2023053120230530
340424130 0 015715 844 896refclang_-march=native_-O2_-fomit-frame-pointer_-fwrapv_-Qunused-arguments_-fPIC_-fPIE2023053120230530
340454130 0 016827 844 896refclang_-march=native_-O3_-fomit-frame-pointer_-fwrapv_-Qunused-arguments_-fPIC_-fPIE2023053120230530
340654114 0 016587 844 896refclang_-mcpu=native_-O3_-fomit-frame-pointer_-fwrapv_-Qunused-arguments_-fPIC_-fPIE2023053120230530
350995908 0 018901 804 960refgcc_-march=native_-mtune=native_-O3_-fomit-frame-pointer_-fwrapv_-fPIC_-fPIE2023053120230530
352225968 0 017299 804 960opt64gcc_-march=native_-mtune=native_-O_-fomit-frame-pointer_-fwrapv_-fPIC_-fPIE2023053120230530
36678901 0 012740 812 960opt64_lowsizegcc_-march=native_-mtune=native_-O2_-fomit-frame-pointer_-fwrapv_-fPIC_-fPIE2023053120230530
369894130 0 014819 844 896refclang_-march=native_-O_-fomit-frame-pointer_-fwrapv_-Qunused-arguments_-fPIC_-fPIE2023053120230530
37721797 0 012395 844 896opt64_lowsizeclang_-march=native_-O2_-fomit-frame-pointer_-fwrapv_-Qunused-arguments_-fPIC_-fPIE2023053120230530
38229773 0 010677 836 896opt64_lowsizeclang_-march=native_-Os_-fomit-frame-pointer_-fwrapv_-Qunused-arguments_-fPIC_-fPIE2023053120230530
384894064 0 013965 836 896refclang_-march=native_-Os_-fomit-frame-pointer_-fwrapv_-Qunused-arguments_-fPIC_-fPIE2023053120230530
38881877 0 011159 788 928opt64_lowsizegcc_-march=native_-mtune=native_-Os_-fomit-frame-pointer_-fwrapv_-fPIC_-fPIE2023053120230530
39005797 0 013507 844 896opt64_lowsizeclang_-march=native_-O3_-fomit-frame-pointer_-fwrapv_-Qunused-arguments_-fPIC_-fPIE2023053120230530
39052797 0 013283 844 896opt64_lowsizeclang_-mcpu=native_-O3_-fomit-frame-pointer_-fwrapv_-Qunused-arguments_-fPIC_-fPIE2023053120230530
39140923 0 013964 812 960opt64_lowsizegcc_-march=native_-mtune=native_-O3_-fomit-frame-pointer_-fwrapv_-fPIC_-fPIE2023053120230530
39281734 0 011427 844 896opt64_lowsizeclang_-march=native_-O_-fomit-frame-pointer_-fwrapv_-Qunused-arguments_-fPIC_-fPIE2023053120230530
397805901 0 017164 796 960refgcc_-march=native_-mtune=native_-O_-fomit-frame-pointer_-fwrapv_-fPIC_-fPIE2023053120230530
405466004 0 017805 804 960refgcc_-march=native_-mtune=native_-O2_-fomit-frame-pointer_-fwrapv_-fPIC_-fPIE2023053120230530
413626536 0 018115 844 896opt32clang_-march=native_-O2_-fomit-frame-pointer_-fwrapv_-Qunused-arguments_-fPIC_-fPIE2023053120230530
413626536 0 019003 844 896opt32clang_-mcpu=native_-O3_-fomit-frame-pointer_-fwrapv_-Qunused-arguments_-fPIC_-fPIE2023053120230530
413876536 0 019227 844 896opt32clang_-march=native_-O3_-fomit-frame-pointer_-fwrapv_-Qunused-arguments_-fPIC_-fPIE2023053120230530
413946515 0 016413 836 896opt32clang_-march=native_-Os_-fomit-frame-pointer_-fwrapv_-Qunused-arguments_-fPIC_-fPIE2023053120230530
414141422 0 012739 804 960opt64_lowsizegcc_-march=native_-mtune=native_-O_-fomit-frame-pointer_-fwrapv_-fPIC_-fPIE2023053120230530
424246558 0 017235 844 896opt32clang_-march=native_-O_-fomit-frame-pointer_-fwrapv_-Qunused-arguments_-fPIC_-fPIE2023053120230530
437236727 0 017031 788 928opt32gcc_-march=native_-mtune=native_-Os_-fomit-frame-pointer_-fwrapv_-fPIC_-fPIE2023053120230530
443566684 0 018548 812 960opt32gcc_-march=native_-mtune=native_-O2_-fomit-frame-pointer_-fwrapv_-fPIC_-fPIE2023053120230530
443816684 0 019740 812 960opt32gcc_-march=native_-mtune=native_-O3_-fomit-frame-pointer_-fwrapv_-fPIC_-fPIE2023053120230530
460797592 0 018931 804 960opt32gcc_-march=native_-mtune=native_-O_-fomit-frame-pointer_-fwrapv_-fPIC_-fPIE2023053120230530
46480811 0 010717 836 896opt32_lowsizeclang_-march=native_-Os_-fomit-frame-pointer_-fwrapv_-Qunused-arguments_-fPIC_-fPIE2023053120230530
47367774 0 011467 844 896opt32_lowsizeclang_-march=native_-O_-fomit-frame-pointer_-fwrapv_-Qunused-arguments_-fPIC_-fPIE2023053120230530
47768971 0 012812 812 960opt32_lowsizegcc_-march=native_-mtune=native_-O2_-fomit-frame-pointer_-fwrapv_-fPIC_-fPIE2023053120230530
47895837 0 012435 844 896opt32_lowsizeclang_-march=native_-O2_-fomit-frame-pointer_-fwrapv_-Qunused-arguments_-fPIC_-fPIE2023053120230530
47895837 0 013547 844 896opt32_lowsizeclang_-march=native_-O3_-fomit-frame-pointer_-fwrapv_-Qunused-arguments_-fPIC_-fPIE2023053120230530
47895837 0 013323 844 896opt32_lowsizeclang_-mcpu=native_-O3_-fomit-frame-pointer_-fwrapv_-Qunused-arguments_-fPIC_-fPIE2023053120230530
484781001 0 011232 780 928refgcc_-march=native_-mtune=native_-Os_-fomit-frame-pointer_-fwrapv_-fPIC_-fPIE2023053120230530
48838961 0 011255 788 928opt32_lowsizegcc_-march=native_-mtune=native_-Os_-fomit-frame-pointer_-fwrapv_-fPIC_-fPIE2023053120230530
50265991 0 014036 812 960opt32_lowsizegcc_-march=native_-mtune=native_-O3_-fomit-frame-pointer_-fwrapv_-fPIC_-fPIE2023053120230530
519761490 0 012811 804 960opt32_lowsizegcc_-march=native_-mtune=native_-O_-fomit-frame-pointer_-fwrapv_-fPIC_-fPIE2023053120230530
682378513 0 021195 844 896bi32clang_-march=native_-O3_-fomit-frame-pointer_-fwrapv_-Qunused-arguments_-fPIC_-fPIE2023053120230530
682508513 0 020971 844 896bi32clang_-mcpu=native_-O3_-fomit-frame-pointer_-fwrapv_-Qunused-arguments_-fPIC_-fPIE2023053120230530
689678067 0 018723 844 896bi32clang_-march=native_-O_-fomit-frame-pointer_-fwrapv_-Qunused-arguments_-fPIC_-fPIE2023053120230530
689828060 0 017949 836 896bi32clang_-march=native_-Os_-fomit-frame-pointer_-fwrapv_-Qunused-arguments_-fPIC_-fPIE2023053120230530
690518071 0 019635 844 896bi32clang_-march=native_-O2_-fomit-frame-pointer_-fwrapv_-Qunused-arguments_-fPIC_-fPIE2023053120230530
718828867 0 020652 812 960bi32gcc_-march=native_-mtune=native_-O2_-fomit-frame-pointer_-fwrapv_-fPIC_-fPIE2023053120230530
727778872 0 019087 788 928bi32gcc_-march=native_-mtune=native_-Os_-fomit-frame-pointer_-fwrapv_-fPIC_-fPIE2023053120230530
735879369 0 020619 804 960bi32gcc_-march=native_-mtune=native_-O_-fomit-frame-pointer_-fwrapv_-fPIC_-fPIE2023053120230530
811912985 0 015699 844 896bi32_lowregclang_-march=native_-O3_-fomit-frame-pointer_-fwrapv_-Qunused-arguments_-fPIC_-fPIE2023053120230530
812512985 0 014587 844 896bi32_lowregclang_-march=native_-O2_-fomit-frame-pointer_-fwrapv_-Qunused-arguments_-fPIC_-fPIE2023053120230530
813392985 0 015475 844 896bi32_lowregclang_-mcpu=native_-O3_-fomit-frame-pointer_-fwrapv_-Qunused-arguments_-fPIC_-fPIE2023053120230530
817162953 0 012869 836 896bi32_lowregclang_-march=native_-Os_-fomit-frame-pointer_-fwrapv_-Qunused-arguments_-fPIC_-fPIE2023053120230530
841813220 0 015052 812 960bi32_lowreggcc_-march=native_-mtune=native_-O2_-fomit-frame-pointer_-fwrapv_-fPIC_-fPIE2023053120230530
846061514 0 014227 844 896bi32_lowsizeclang_-march=native_-O3_-fomit-frame-pointer_-fwrapv_-Qunused-arguments_-fPIC_-fPIE2023053120230530
846871514 0 014003 844 896bi32_lowsizeclang_-mcpu=native_-O3_-fomit-frame-pointer_-fwrapv_-Qunused-arguments_-fPIC_-fPIE2023053120230530
851341691 0 013484 812 960bi32_lowsizegcc_-march=native_-mtune=native_-O2_-fomit-frame-pointer_-fwrapv_-fPIC_-fPIE2023053120230530
851791437 0 011349 836 896bi32_lowsizeclang_-march=native_-Os_-fomit-frame-pointer_-fwrapv_-Qunused-arguments_-fPIC_-fPIE2023053120230530
866731514 0 013115 844 896bi32_lowsizeclang_-march=native_-O2_-fomit-frame-pointer_-fwrapv_-Qunused-arguments_-fPIC_-fPIE2023053120230530
878152861 0 013579 844 896bi32_lowregclang_-march=native_-O_-fomit-frame-pointer_-fwrapv_-Qunused-arguments_-fPIC_-fPIE2023053120230530
892591464 0 012139 844 896bi32_lowsizeclang_-march=native_-O_-fomit-frame-pointer_-fwrapv_-Qunused-arguments_-fPIC_-fPIE2023053120230530
916051663 0 011887 788 928bi32_lowsizegcc_-march=native_-mtune=native_-Os_-fomit-frame-pointer_-fwrapv_-fPIC_-fPIE2023053120230530
921133571 0 014875 804 960bi32_lowreggcc_-march=native_-mtune=native_-O_-fomit-frame-pointer_-fwrapv_-fPIC_-fPIE2023053120230530
9236010209 0 023188 812 960bi32gcc_-march=native_-mtune=native_-O3_-fomit-frame-pointer_-fwrapv_-fPIC_-fPIE2023053120230530
929942852 0 013135 788 928bi32_lowreggcc_-march=native_-mtune=native_-Os_-fomit-frame-pointer_-fwrapv_-fPIC_-fPIE2023053120230530
955221911 0 013171 804 960bi32_lowsizegcc_-march=native_-mtune=native_-O_-fomit-frame-pointer_-fwrapv_-fPIC_-fPIE2023053120230530
1124093596 0 016604 812 960bi32_lowreggcc_-march=native_-mtune=native_-O3_-fomit-frame-pointer_-fwrapv_-fPIC_-fPIE2023053120230530
1147601784 0 014756 812 960bi32_lowsizegcc_-march=native_-mtune=native_-O3_-fomit-frame-pointer_-fwrapv_-fPIC_-fPIE2023053120230530
2726242986 0 014563 844 896opt8_lowsizeclang_-march=native_-O2_-fomit-frame-pointer_-fwrapv_-Qunused-arguments_-fPIC_-fPIE2023053120230530
2764663323 0 014859 844 896opt8clang_-march=native_-O2_-fomit-frame-pointer_-fwrapv_-Qunused-arguments_-fPIC_-fPIE2023053120230530
2922972291 0 012173 836 896opt8clang_-march=native_-Os_-fomit-frame-pointer_-fwrapv_-Qunused-arguments_-fPIC_-fPIE2023053120230530
2925253942 0 016027 844 896bi8clang_-mcpu=native_-O3_-fomit-frame-pointer_-fwrapv_-Qunused-arguments_-fPIC_-fPIE2023053120230530
2925553941 0 015139 844 896bi8clang_-march=native_-O2_-fomit-frame-pointer_-fwrapv_-Qunused-arguments_-fPIC_-fPIE2023053120230530
2925893941 0 016251 844 896bi8clang_-march=native_-O3_-fomit-frame-pointer_-fwrapv_-Qunused-arguments_-fPIC_-fPIE2023053120230530
2929872258 0 012149 836 896opt8_lowsizeclang_-march=native_-Os_-fomit-frame-pointer_-fwrapv_-Qunused-arguments_-fPIC_-fPIE2023053120230530
2989873530 0 013827 844 896bi8clang_-march=native_-O_-fomit-frame-pointer_-fwrapv_-Qunused-arguments_-fPIC_-fPIE2023053120230530
3006033539 0 013069 836 896bi8clang_-march=native_-Os_-fomit-frame-pointer_-fwrapv_-Qunused-arguments_-fPIC_-fPIE2023053120230530
3534253696 0 016268 812 960bi8gcc_-march=native_-mtune=native_-O3_-fomit-frame-pointer_-fwrapv_-fPIC_-fPIE2023053120230530
3725464180 0 016875 844 896opt8_lowsizeclang_-march=native_-O3_-fomit-frame-pointer_-fwrapv_-Qunused-arguments_-fPIC_-fPIE2023053120230530
3725474214 0 016683 844 896opt8_lowsizeclang_-mcpu=native_-O3_-fomit-frame-pointer_-fwrapv_-Qunused-arguments_-fPIC_-fPIE2023053120230530
3725904740 0 017195 844 896opt8clang_-mcpu=native_-O3_-fomit-frame-pointer_-fwrapv_-Qunused-arguments_-fPIC_-fPIE2023053120230530
3726454828 0 017451 844 896opt8clang_-march=native_-O3_-fomit-frame-pointer_-fwrapv_-Qunused-arguments_-fPIC_-fPIE2023053120230530
4107554190 0 014031 788 928bi8gcc_-march=native_-mtune=native_-Os_-fomit-frame-pointer_-fwrapv_-fPIC_-fPIE2023053120230530
4154342465 0 013163 844 896opt8clang_-march=native_-O_-fomit-frame-pointer_-fwrapv_-Qunused-arguments_-fPIC_-fPIE2023053120230530
4170022174 0 012851 844 896opt8_lowsizeclang_-march=native_-O_-fomit-frame-pointer_-fwrapv_-Qunused-arguments_-fPIC_-fPIE2023053120230530
4373374807 0 015683 804 960bi8gcc_-march=native_-mtune=native_-O_-fomit-frame-pointer_-fwrapv_-fPIC_-fPIE2023053120230530
4469954465 0 015876 812 960bi8gcc_-march=native_-mtune=native_-O2_-fomit-frame-pointer_-fwrapv_-fPIC_-fPIE2023053120230530
8670134283 0 017189 804 960opt8_lowsizegcc_-march=native_-mtune=native_-O3_-fomit-frame-pointer_-fwrapv_-fPIC_-fPIE2023053120230530
8680594929 0 017901 804 960opt8gcc_-march=native_-mtune=native_-O3_-fomit-frame-pointer_-fwrapv_-fPIC_-fPIE2023053120230530
10714294178 0 015949 804 960opt8gcc_-march=native_-mtune=native_-O2_-fomit-frame-pointer_-fwrapv_-fPIC_-fPIE2023053120230530
10717623989 0 015717 804 960opt8_lowsizegcc_-march=native_-mtune=native_-O2_-fomit-frame-pointer_-fwrapv_-fPIC_-fPIE2023053120230530
12027914281 0 015532 796 960opt8gcc_-march=native_-mtune=native_-O_-fomit-frame-pointer_-fwrapv_-fPIC_-fPIE2023053120230530
12030674190 0 015364 796 960opt8_lowsizegcc_-march=native_-mtune=native_-O_-fomit-frame-pointer_-fwrapv_-fPIC_-fPIE2023053120230530
12189143849 0 014072 780 928opt8gcc_-march=native_-mtune=native_-Os_-fomit-frame-pointer_-fwrapv_-fPIC_-fPIE2023053120230530
12198673851 0 014000 780 928opt8_lowsizegcc_-march=native_-mtune=native_-Os_-fomit-frame-pointer_-fwrapv_-fPIC_-fPIE2023053120230530

Compiler output

Implementation: T:asm_esp32
Security model: timingleaks
Compiler: clang -march=native -O2 -fomit-frame-pointer -fwrapv -Qunused-arguments -fPIC -fPIE
ascon.S: ascon.S:1:10: fatal error: 'xtensa/coreasm.h' file not found
ascon.S: #include <xtensa/coreasm.h>
ascon.S: ^~~~~~~~~~~~~~~~~~
ascon.S: 1 error generated.

Number of similar (compiler,implementation) pairs: 5, namely:
CompilerImplementations
clang -march=native -O2 -fomit-frame-pointer -fwrapv -Qunused-arguments -fPIC -fPIE T:asm_esp32
clang -march=native -O3 -fomit-frame-pointer -fwrapv -Qunused-arguments -fPIC -fPIE T:asm_esp32
clang -march=native -O -fomit-frame-pointer -fwrapv -Qunused-arguments -fPIC -fPIE T:asm_esp32
clang -march=native -Os -fomit-frame-pointer -fwrapv -Qunused-arguments -fPIC -fPIE T:asm_esp32
clang -mcpu=native -O3 -fomit-frame-pointer -fwrapv -Qunused-arguments -fPIC -fPIE T:asm_esp32

Compiler output

Implementation: T:asm_esp32
Security model: timingleaks
Compiler: gcc -march=native -mtune=native -O2 -fomit-frame-pointer -fwrapv -fPIC -fPIE
ascon.S: ascon.S:1:10: fatal error: xtensa/coreasm.h: No such file or directory
ascon.S: 1 | #include <xtensa/coreasm.h>
ascon.S: | ^~~~~~~~~~~~~~~~~~
ascon.S: compilation terminated.

Number of similar (compiler,implementation) pairs: 4, namely:
CompilerImplementations
gcc -march=native -mtune=native -O2 -fomit-frame-pointer -fwrapv -fPIC -fPIE T:asm_esp32
gcc -march=native -mtune=native -O3 -fomit-frame-pointer -fwrapv -fPIC -fPIE T:asm_esp32
gcc -march=native -mtune=native -O -fomit-frame-pointer -fwrapv -fPIC -fPIE T:asm_esp32
gcc -march=native -mtune=native -Os -fomit-frame-pointer -fwrapv -fPIC -fPIE T:asm_esp32

Compiler output

Implementation: avr
Security model: constbranchindex
Compiler: clang -march=native -O2 -fomit-frame-pointer -fwrapv -Qunused-arguments -fPIC -fPIE
permutations.S: permutations.S:29:10: fatal error: 'avr/io.h' file not found
permutations.S: #include "avr/io.h"
permutations.S: ^~~~~~~~~~
permutations.S: 1 error generated.

Number of similar (compiler,implementation) pairs: 10, namely:
CompilerImplementations
clang -march=native -O2 -fomit-frame-pointer -fwrapv -Qunused-arguments -fPIC -fPIE avr
clang -march=native -O3 -fomit-frame-pointer -fwrapv -Qunused-arguments -fPIC -fPIE avr
clang -march=native -O -fomit-frame-pointer -fwrapv -Qunused-arguments -fPIC -fPIE avr
clang -march=native -Os -fomit-frame-pointer -fwrapv -Qunused-arguments -fPIC -fPIE avr
clang -mcpu=native -O3 -fomit-frame-pointer -fwrapv -Qunused-arguments -fPIC -fPIE avr
clang -march=native -O2 -fomit-frame-pointer -fwrapv -Qunused-arguments -fPIC -fPIE avr_lowsize
clang -march=native -O3 -fomit-frame-pointer -fwrapv -Qunused-arguments -fPIC -fPIE avr_lowsize
clang -march=native -O -fomit-frame-pointer -fwrapv -Qunused-arguments -fPIC -fPIE avr_lowsize
clang -march=native -Os -fomit-frame-pointer -fwrapv -Qunused-arguments -fPIC -fPIE avr_lowsize
clang -mcpu=native -O3 -fomit-frame-pointer -fwrapv -Qunused-arguments -fPIC -fPIE avr_lowsize

Compiler output

Implementation: avr
Security model: constbranchindex
Compiler: gcc -march=native -mtune=native -O2 -fomit-frame-pointer -fwrapv -fPIC -fPIE
permutations.S: permutations.S:29:10: fatal error: avr/io.h: No such file or directory
permutations.S: 29 | #include "avr/io.h"
permutations.S: | ^~~~~~~~~~
permutations.S: compilation terminated.

Number of similar (compiler,implementation) pairs: 8, namely:
CompilerImplementations
gcc -march=native -mtune=native -O2 -fomit-frame-pointer -fwrapv -fPIC -fPIE avr
gcc -march=native -mtune=native -O3 -fomit-frame-pointer -fwrapv -fPIC -fPIE avr
gcc -march=native -mtune=native -O -fomit-frame-pointer -fwrapv -fPIC -fPIE avr
gcc -march=native -mtune=native -Os -fomit-frame-pointer -fwrapv -fPIC -fPIE avr
gcc -march=native -mtune=native -O2 -fomit-frame-pointer -fwrapv -fPIC -fPIE avr_lowsize
gcc -march=native -mtune=native -O3 -fomit-frame-pointer -fwrapv -fPIC -fPIE avr_lowsize
gcc -march=native -mtune=native -O -fomit-frame-pointer -fwrapv -fPIC -fPIE avr_lowsize
gcc -march=native -mtune=native -Os -fomit-frame-pointer -fwrapv -fPIC -fPIE avr_lowsize

Compiler output

Implementation: T:esp32
Security model: timingleaks
Compiler: clang -march=native -O2 -fomit-frame-pointer -fwrapv -Qunused-arguments -fPIC -fPIE
try.c: /usr/bin/ld: /tmp/try-small-cdd12b.o: in function `doit':
try.c: try-small.c:(.text+0x...): undefined reference to `crypto_hash_asconhashav12_esp32_timingleaks'
try.c: /usr/bin/ld: /tmp/try-small-cdd12b.o: in function `test':
try.c: try-small.c:(.text+0x...): undefined reference to `crypto_hash_asconhashav12_esp32_timingleaks'
try.c: /usr/bin/ld: try-small.c:(.text+0x...): undefined reference to `crypto_hash_asconhashav12_esp32_timingleaks'
try.c: /usr/bin/ld: try-small.c:(.text+0x...): undefined reference to `crypto_hash_asconhashav12_esp32_timingleaks'
try.c: clang: error: linker command failed with exit code 1 (use -v to see invocation)

Number of similar (compiler,implementation) pairs: 1, namely:
CompilerImplementations
clang -march=native -O2 -fomit-frame-pointer -fwrapv -Qunused-arguments -fPIC -fPIE T:esp32

Compiler output

Implementation: T:esp32
Security model: timingleaks
Compiler: clang -march=native -O3 -fomit-frame-pointer -fwrapv -Qunused-arguments -fPIC -fPIE
try.c: /usr/bin/ld: /tmp/try-small-1a373f.o: in function `doit':
try.c: try-small.c:(.text+0x...): undefined reference to `crypto_hash_asconhashav12_esp32_timingleaks'
try.c: /usr/bin/ld: /tmp/try-small-1a373f.o: in function `test':
try.c: try-small.c:(.text+0x...): undefined reference to `crypto_hash_asconhashav12_esp32_timingleaks'
try.c: /usr/bin/ld: try-small.c:(.text+0x...): undefined reference to `crypto_hash_asconhashav12_esp32_timingleaks'
try.c: /usr/bin/ld: try-small.c:(.text+0x...): undefined reference to `crypto_hash_asconhashav12_esp32_timingleaks'
try.c: clang: error: linker command failed with exit code 1 (use -v to see invocation)

Number of similar (compiler,implementation) pairs: 1, namely:
CompilerImplementations
clang -march=native -O3 -fomit-frame-pointer -fwrapv -Qunused-arguments -fPIC -fPIE T:esp32

Compiler output

Implementation: T:esp32
Security model: timingleaks
Compiler: clang -march=native -O -fomit-frame-pointer -fwrapv -Qunused-arguments -fPIC -fPIE
try.c: /usr/bin/ld: /tmp/try-small-30eeef.o: in function `doit':
try.c: try-small.c:(.text+0x...): undefined reference to `crypto_hash_asconhashav12_esp32_timingleaks'
try.c: /usr/bin/ld: /tmp/try-small-30eeef.o: in function `test':
try.c: try-small.c:(.text+0x...): undefined reference to `crypto_hash_asconhashav12_esp32_timingleaks'
try.c: /usr/bin/ld: try-small.c:(.text+0x...): undefined reference to `crypto_hash_asconhashav12_esp32_timingleaks'
try.c: /usr/bin/ld: try-small.c:(.text+0x...): undefined reference to `crypto_hash_asconhashav12_esp32_timingleaks'
try.c: clang: error: linker command failed with exit code 1 (use -v to see invocation)

Number of similar (compiler,implementation) pairs: 1, namely:
CompilerImplementations
clang -march=native -O -fomit-frame-pointer -fwrapv -Qunused-arguments -fPIC -fPIE T:esp32

Compiler output

Implementation: T:esp32
Security model: timingleaks
Compiler: clang -march=native -Os -fomit-frame-pointer -fwrapv -Qunused-arguments -fPIC -fPIE
try.c: /usr/bin/ld: /tmp/try-small-e9e4e9.o: in function `doit':
try.c: try-small.c:(.text+0x...): undefined reference to `crypto_hash_asconhashav12_esp32_timingleaks'
try.c: /usr/bin/ld: /tmp/try-small-e9e4e9.o: in function `test':
try.c: try-small.c:(.text+0x...): undefined reference to `crypto_hash_asconhashav12_esp32_timingleaks'
try.c: /usr/bin/ld: try-small.c:(.text+0x...): undefined reference to `crypto_hash_asconhashav12_esp32_timingleaks'
try.c: /usr/bin/ld: try-small.c:(.text+0x...): undefined reference to `crypto_hash_asconhashav12_esp32_timingleaks'
try.c: clang: error: linker command failed with exit code 1 (use -v to see invocation)

Number of similar (compiler,implementation) pairs: 1, namely:
CompilerImplementations
clang -march=native -Os -fomit-frame-pointer -fwrapv -Qunused-arguments -fPIC -fPIE T:esp32

Compiler output

Implementation: T:esp32
Security model: timingleaks
Compiler: clang -mcpu=native -O3 -fomit-frame-pointer -fwrapv -Qunused-arguments -fPIC -fPIE
try.c: /usr/bin/ld: /tmp/try-small-56853a.o: in function `doit':
try.c: try-small.c:(.text+0x...): undefined reference to `crypto_hash_asconhashav12_esp32_timingleaks'
try.c: /usr/bin/ld: /tmp/try-small-56853a.o: in function `test':
try.c: try-small.c:(.text+0x...): undefined reference to `crypto_hash_asconhashav12_esp32_timingleaks'
try.c: /usr/bin/ld: try-small.c:(.text+0x...): undefined reference to `crypto_hash_asconhashav12_esp32_timingleaks'
try.c: /usr/bin/ld: try-small.c:(.text+0x...): undefined reference to `crypto_hash_asconhashav12_esp32_timingleaks'
try.c: clang: error: linker command failed with exit code 1 (use -v to see invocation)

Number of similar (compiler,implementation) pairs: 1, namely:
CompilerImplementations
clang -mcpu=native -O3 -fomit-frame-pointer -fwrapv -Qunused-arguments -fPIC -fPIE T:esp32

Compiler output

Implementation: T:esp32
Security model: timingleaks
Compiler: gcc -march=native -mtune=native -O2 -fomit-frame-pointer -fwrapv -fPIC -fPIE
try.c: /usr/bin/ld: /tmp/ccDNiE7G.o: in function `test':
try.c: try-small.c:(.text+0x...): undefined reference to `crypto_hash_asconhashav12_esp32_timingleaks'
try.c: /usr/bin/ld: try-small.c:(.text+0x...): undefined reference to `crypto_hash_asconhashav12_esp32_timingleaks'
try.c: /usr/bin/ld: try-small.c:(.text+0x...): undefined reference to `crypto_hash_asconhashav12_esp32_timingleaks'
try.c: /usr/bin/ld: /tmp/ccDNiE7G.o: in function `doit':
try.c: try-small.c:(.text+0x...): undefined reference to `crypto_hash_asconhashav12_esp32_timingleaks'
try.c: collect2: error: ld returned 1 exit status

Number of similar (compiler,implementation) pairs: 1, namely:
CompilerImplementations
gcc -march=native -mtune=native -O2 -fomit-frame-pointer -fwrapv -fPIC -fPIE T:esp32

Compiler output

Implementation: T:esp32
Security model: timingleaks
Compiler: gcc -march=native -mtune=native -O3 -fomit-frame-pointer -fwrapv -fPIC -fPIE
try.c: /usr/bin/ld: /tmp/ccQB4fkH.o: in function `test':
try.c: try-small.c:(.text+0x...): undefined reference to `crypto_hash_asconhashav12_esp32_timingleaks'
try.c: /usr/bin/ld: try-small.c:(.text+0x...): undefined reference to `crypto_hash_asconhashav12_esp32_timingleaks'
try.c: /usr/bin/ld: try-small.c:(.text+0x...): undefined reference to `crypto_hash_asconhashav12_esp32_timingleaks'
try.c: /usr/bin/ld: /tmp/ccQB4fkH.o: in function `doit':
try.c: try-small.c:(.text+0x...): undefined reference to `crypto_hash_asconhashav12_esp32_timingleaks'
try.c: collect2: error: ld returned 1 exit status

Number of similar (compiler,implementation) pairs: 1, namely:
CompilerImplementations
gcc -march=native -mtune=native -O3 -fomit-frame-pointer -fwrapv -fPIC -fPIE T:esp32

Compiler output

Implementation: T:esp32
Security model: timingleaks
Compiler: gcc -march=native -mtune=native -O -fomit-frame-pointer -fwrapv -fPIC -fPIE
try.c: /usr/bin/ld: /tmp/cc4pl3vP.o: in function `doit':
try.c: try-small.c:(.text+0x...): undefined reference to `crypto_hash_asconhashav12_esp32_timingleaks'
try.c: /usr/bin/ld: /tmp/cc4pl3vP.o: in function `test':
try.c: try-small.c:(.text+0x...): undefined reference to `crypto_hash_asconhashav12_esp32_timingleaks'
try.c: /usr/bin/ld: try-small.c:(.text+0x...): undefined reference to `crypto_hash_asconhashav12_esp32_timingleaks'
try.c: /usr/bin/ld: try-small.c:(.text+0x...): undefined reference to `crypto_hash_asconhashav12_esp32_timingleaks'
try.c: collect2: error: ld returned 1 exit status

Number of similar (compiler,implementation) pairs: 1, namely:
CompilerImplementations
gcc -march=native -mtune=native -O -fomit-frame-pointer -fwrapv -fPIC -fPIE T:esp32

Compiler output

Implementation: T:esp32
Security model: timingleaks
Compiler: gcc -march=native -mtune=native -Os -fomit-frame-pointer -fwrapv -fPIC -fPIE
try.c: /usr/bin/ld: /tmp/cc83uFj4.o: in function `test':
try.c: try-small.c:(.text+0x...): undefined reference to `crypto_hash_asconhashav12_esp32_timingleaks'
try.c: /usr/bin/ld: try-small.c:(.text+0x...): undefined reference to `crypto_hash_asconhashav12_esp32_timingleaks'
try.c: /usr/bin/ld: try-small.c:(.text+0x...): undefined reference to `crypto_hash_asconhashav12_esp32_timingleaks'
try.c: /usr/bin/ld: /tmp/cc83uFj4.o: in function `doit':
try.c: try-small.c:(.text+0x...): undefined reference to `crypto_hash_asconhashav12_esp32_timingleaks'
try.c: collect2: error: ld returned 1 exit status

Number of similar (compiler,implementation) pairs: 1, namely:
CompilerImplementations
gcc -march=native -mtune=native -Os -fomit-frame-pointer -fwrapv -fPIC -fPIE T:esp32