Test results for amd64, margaux, crypto_aead/omdsha256k256n104tau160v1

[Page version: 20240911 13:44:07]

Measurements for amd64, margaux, crypto_aead Test results for amd64, margaux, crypto_aead Test results for crypto_aead/omdsha256k256n104tau160v1
Computer: margaux
Microarchitecture: amd64; Core 2 65nm (6fb)
Architecture: amd64
CPU ID: GenuineIntel-000006fb-bfebfbff
SUPERCOP version: 20240909
Operation: crypto_aead
Primitive: omdsha256k256n104tau160v1
TimeObject sizeTest sizeImplementationCompilerBenchmark dateSUPERCOP version
27415217036 0 040188 812 1088T:refgcc -march=native -mtune=native -O3 -fwrapv -fPIC -fPIE -gdwarf-4 -Wall2024063020240625
28645812138 0 033523 844 1024T:refclang -march=native -O2 -fwrapv -Qunused-arguments -fPIC -fPIE -gdwarf-4 -Wall2024063020240625
29236412328 0 034787 844 1024T:refclang -march=native -O3 -fwrapv -Qunused-arguments -fPIC -fPIE -gdwarf-4 -Wall2024063020240625
29358912215 0 034499 844 1024T:refclang -mcpu=native -O3 -fwrapv -Qunused-arguments -fPIC -fPIE -gdwarf-4 -Wall2024063020240625
2942415077 0 024453 836 1024T:refclang -march=native -Os -fwrapv -Qunused-arguments -fPIC -fPIE -gdwarf-4 -Wall2024063020240625
3200506331 0 026451 844 1024T:refclang -march=native -O -fwrapv -Qunused-arguments -fPIC -fPIE -gdwarf-4 -Wall2024063020240625
3379837534 0 029532 812 1088T:refgcc -march=native -mtune=native -O2 -fwrapv -fPIC -fPIE -gdwarf-4 -Wall2024063020240625
3399266404 0 027691 804 1088T:refgcc -march=native -mtune=native -O -fwrapv -fPIC -fPIE -gdwarf-4 -Wall2024063020240625
3548684477 0 023983 788 1056T:refgcc -march=native -mtune=native -Os -fwrapv -fPIC -fPIE -gdwarf-4 -Wall2024063020240625

Compiler output


try.c: /usr/bin/ld: libcrypto_aead_omdsha256k256n104tau160v1.a(omdsha256.o):.../supercop-data/margaux/amd64/try/c/clang_-march=native_-O2_-fwrapv_-Qunused-arguments_-fPIC_-fPIE_-gdwarf-4_-Wall/timingleaks/crypto_aead/omdsha256k256n104tau160v1/avx1/work/./omdsha256.h:137: multiple definition of `Hash'; libcrypto_aead_omdsha256k256n104tau160v1.a(encrypt.o):.../supercop-data/margaux/amd64/try/c/clang_-march=native_-O2_-fwrapv_-Qunused-arguments_-fPIC_-fPIE_-gdwarf-4_-Wall/timingleaks/crypto_aead/omdsha256k256n104tau160v1/avx1/work/./omdsha256.h:137: first defined here
try.c: clang: error: linker command failed with exit code 1 (use -v to see invocation)

Number of similar (implementation,compiler) pairs: 1, namely:
ImplementationCompiler
T:avx1clang -march=native -O2 -fwrapv -Qunused-arguments -fPIC -fPIE -gdwarf-4 -Wall (Ubuntu_Clang_14.0.0)

Compiler output


try.c: /usr/bin/ld: libcrypto_aead_omdsha256k256n104tau160v1.a(omdsha256.o):.../supercop-data/margaux/amd64/try/c/clang_-march=native_-O3_-fwrapv_-Qunused-arguments_-fPIC_-fPIE_-gdwarf-4_-Wall/timingleaks/crypto_aead/omdsha256k256n104tau160v1/avx1/work/./omdsha256.h:137: multiple definition of `Hash'; libcrypto_aead_omdsha256k256n104tau160v1.a(encrypt.o):.../supercop-data/margaux/amd64/try/c/clang_-march=native_-O3_-fwrapv_-Qunused-arguments_-fPIC_-fPIE_-gdwarf-4_-Wall/timingleaks/crypto_aead/omdsha256k256n104tau160v1/avx1/work/./omdsha256.h:137: first defined here
try.c: clang: error: linker command failed with exit code 1 (use -v to see invocation)

Number of similar (implementation,compiler) pairs: 1, namely:
ImplementationCompiler
T:avx1clang -march=native -O3 -fwrapv -Qunused-arguments -fPIC -fPIE -gdwarf-4 -Wall (Ubuntu_Clang_14.0.0)

Compiler output


try.c: /usr/bin/ld: libcrypto_aead_omdsha256k256n104tau160v1.a(omdsha256.o):.../supercop-data/margaux/amd64/try/c/clang_-march=native_-O_-fwrapv_-Qunused-arguments_-fPIC_-fPIE_-gdwarf-4_-Wall/timingleaks/crypto_aead/omdsha256k256n104tau160v1/avx1/work/./omdsha256.h:137: multiple definition of `Hash'; libcrypto_aead_omdsha256k256n104tau160v1.a(encrypt.o):.../supercop-data/margaux/amd64/try/c/clang_-march=native_-O_-fwrapv_-Qunused-arguments_-fPIC_-fPIE_-gdwarf-4_-Wall/timingleaks/crypto_aead/omdsha256k256n104tau160v1/avx1/work/./omdsha256.h:137: first defined here
try.c: clang: error: linker command failed with exit code 1 (use -v to see invocation)

Number of similar (implementation,compiler) pairs: 1, namely:
ImplementationCompiler
T:avx1clang -march=native -O -fwrapv -Qunused-arguments -fPIC -fPIE -gdwarf-4 -Wall (Ubuntu_Clang_14.0.0)

Compiler output


try.c: /usr/bin/ld: libcrypto_aead_omdsha256k256n104tau160v1.a(omdsha256.o):.../supercop-data/margaux/amd64/try/c/clang_-march=native_-Os_-fwrapv_-Qunused-arguments_-fPIC_-fPIE_-gdwarf-4_-Wall/timingleaks/crypto_aead/omdsha256k256n104tau160v1/avx1/work/./omdsha256.h:137: multiple definition of `Hash'; libcrypto_aead_omdsha256k256n104tau160v1.a(encrypt.o):.../supercop-data/margaux/amd64/try/c/clang_-march=native_-Os_-fwrapv_-Qunused-arguments_-fPIC_-fPIE_-gdwarf-4_-Wall/timingleaks/crypto_aead/omdsha256k256n104tau160v1/avx1/work/./omdsha256.h:137: first defined here
try.c: clang: error: linker command failed with exit code 1 (use -v to see invocation)

Number of similar (implementation,compiler) pairs: 1, namely:
ImplementationCompiler
T:avx1clang -march=native -Os -fwrapv -Qunused-arguments -fPIC -fPIE -gdwarf-4 -Wall (Ubuntu_Clang_14.0.0)

Compiler output


try.c: /usr/bin/ld: libcrypto_aead_omdsha256k256n104tau160v1.a(omdsha256.o):.../supercop-data/margaux/amd64/try/c/clang_-mcpu=native_-O3_-fwrapv_-Qunused-arguments_-fPIC_-fPIE_-gdwarf-4_-Wall/timingleaks/crypto_aead/omdsha256k256n104tau160v1/avx1/work/./omdsha256.h:137: multiple definition of `Hash'; libcrypto_aead_omdsha256k256n104tau160v1.a(encrypt.o):.../supercop-data/margaux/amd64/try/c/clang_-mcpu=native_-O3_-fwrapv_-Qunused-arguments_-fPIC_-fPIE_-gdwarf-4_-Wall/timingleaks/crypto_aead/omdsha256k256n104tau160v1/avx1/work/./omdsha256.h:137: first defined here
try.c: clang: error: linker command failed with exit code 1 (use -v to see invocation)

Number of similar (implementation,compiler) pairs: 1, namely:
ImplementationCompiler
T:avx1clang -mcpu=native -O3 -fwrapv -Qunused-arguments -fPIC -fPIE -gdwarf-4 -Wall (Ubuntu_Clang_14.0.0)

Compiler output


encrypt.c: /tmp/ccuUTjfb.s: Assembler messages:
encrypt.c: /tmp/ccuUTjfb.s:922: Warning: dwarf line number information for .data ignored
encrypt.c: /tmp/ccuUTjfb.s:924: Warning: dwarf line number information for .data ignored
encrypt.c: /tmp/ccuUTjfb.s:926: Warning: dwarf line number information for .data ignored
encrypt.c: /tmp/ccuUTjfb.s:927: Warning: dwarf line number information for .data ignored
encrypt.c: /tmp/ccuUTjfb.s:928: Warning: dwarf line number information for .data ignored
encrypt.c: /tmp/ccuUTjfb.s:939: Warning: dwarf line number information for .data ignored
encrypt.c: /tmp/ccuUTjfb.s:946: Warning: dwarf line number information for .data ignored
encrypt.c: /tmp/ccuUTjfb.s:949: Warning: dwarf line number information for .data ignored
encrypt.c: /tmp/ccuUTjfb.s:950: Warning: dwarf line number information for .data ignored
encrypt.c: /tmp/ccuUTjfb.s:957: Warning: dwarf line number information for .data ignored
encrypt.c: /tmp/ccuUTjfb.s:958: Warning: dwarf line number information for .data ignored
encrypt.c: /tmp/ccuUTjfb.s:961: Warning: dwarf line number information for .data ignored
encrypt.c: /tmp/ccuUTjfb.s:963: Warning: dwarf line number information for .data ignored
encrypt.c: /tmp/ccuUTjfb.s:966: Warning: dwarf line number information for .data ignored
encrypt.c: /tmp/ccuUTjfb.s:974: Warning: dwarf line number information for .data ignored
encrypt.c: /tmp/ccuUTjfb.s:985: Warning: dwarf line number information for .data ignored
encrypt.c: /tmp/ccuUTjfb.s:987: Warning: dwarf line number information for .data ignored
encrypt.c: /tmp/ccuUTjfb.s:989: Warning: dwarf line number information for .data ignored
encrypt.c: /tmp/ccuUTjfb.s:990: Warning: dwarf line number information for .data ignored
encrypt.c: /tmp/ccuUTjfb.s:991: Warning: dwarf line number information for .data ignored
encrypt.c: /tmp/ccuUTjfb.s:998: Warning: dwarf line number information for .data ignored
encrypt.c: /tmp/ccuUTjfb.s:1005: Warning: dwarf line number information for .data ignored
encrypt.c: /tmp/ccuUTjfb.s:1008: Warning: dwarf line number information for .data ignored
encrypt.c: /tmp/ccuUTjfb.s:1011: Warning: dwarf line number information for .data ignored
encrypt.c: ...

Number of similar (implementation,compiler) pairs: 1, namely:
ImplementationCompiler
T:avx1gcc -march=native -mtune=native -O2 -fwrapv -fPIC -fPIE -gdwarf-4 -Wall (11.4.0)

Compiler output


encrypt.c: /tmp/cclrZEmH.s: Assembler messages:
encrypt.c: /tmp/cclrZEmH.s:922: Warning: dwarf line number information for .data ignored
encrypt.c: /tmp/cclrZEmH.s:924: Warning: dwarf line number information for .data ignored
encrypt.c: /tmp/cclrZEmH.s:926: Warning: dwarf line number information for .data ignored
encrypt.c: /tmp/cclrZEmH.s:927: Warning: dwarf line number information for .data ignored
encrypt.c: /tmp/cclrZEmH.s:928: Warning: dwarf line number information for .data ignored
encrypt.c: /tmp/cclrZEmH.s:939: Warning: dwarf line number information for .data ignored
encrypt.c: /tmp/cclrZEmH.s:946: Warning: dwarf line number information for .data ignored
encrypt.c: /tmp/cclrZEmH.s:949: Warning: dwarf line number information for .data ignored
encrypt.c: /tmp/cclrZEmH.s:950: Warning: dwarf line number information for .data ignored
encrypt.c: /tmp/cclrZEmH.s:957: Warning: dwarf line number information for .data ignored
encrypt.c: /tmp/cclrZEmH.s:958: Warning: dwarf line number information for .data ignored
encrypt.c: /tmp/cclrZEmH.s:961: Warning: dwarf line number information for .data ignored
encrypt.c: /tmp/cclrZEmH.s:963: Warning: dwarf line number information for .data ignored
encrypt.c: /tmp/cclrZEmH.s:966: Warning: dwarf line number information for .data ignored
encrypt.c: /tmp/cclrZEmH.s:974: Warning: dwarf line number information for .data ignored
encrypt.c: /tmp/cclrZEmH.s:985: Warning: dwarf line number information for .data ignored
encrypt.c: /tmp/cclrZEmH.s:987: Warning: dwarf line number information for .data ignored
encrypt.c: /tmp/cclrZEmH.s:989: Warning: dwarf line number information for .data ignored
encrypt.c: /tmp/cclrZEmH.s:990: Warning: dwarf line number information for .data ignored
encrypt.c: /tmp/cclrZEmH.s:991: Warning: dwarf line number information for .data ignored
encrypt.c: /tmp/cclrZEmH.s:998: Warning: dwarf line number information for .data ignored
encrypt.c: /tmp/cclrZEmH.s:1005: Warning: dwarf line number information for .data ignored
encrypt.c: /tmp/cclrZEmH.s:1008: Warning: dwarf line number information for .data ignored
encrypt.c: /tmp/cclrZEmH.s:1011: Warning: dwarf line number information for .data ignored
encrypt.c: ...

Number of similar (implementation,compiler) pairs: 1, namely:
ImplementationCompiler
T:avx1gcc -march=native -mtune=native -O3 -fwrapv -fPIC -fPIE -gdwarf-4 -Wall (11.4.0)

Compiler output


encrypt.c: /tmp/ccPKu4TR.s: Assembler messages:
encrypt.c: /tmp/ccPKu4TR.s:921: Warning: dwarf line number information for .data ignored
encrypt.c: /tmp/ccPKu4TR.s:923: Warning: dwarf line number information for .data ignored
encrypt.c: /tmp/ccPKu4TR.s:935: Warning: dwarf line number information for .data ignored
encrypt.c: /tmp/ccPKu4TR.s:936: Warning: dwarf line number information for .data ignored
encrypt.c: /tmp/ccPKu4TR.s:937: Warning: dwarf line number information for .data ignored
encrypt.c: /tmp/ccPKu4TR.s:944: Warning: dwarf line number information for .data ignored
encrypt.c: /tmp/ccPKu4TR.s:947: Warning: dwarf line number information for .data ignored
encrypt.c: /tmp/ccPKu4TR.s:948: Warning: dwarf line number information for .data ignored
encrypt.c: /tmp/ccPKu4TR.s:953: Warning: dwarf line number information for .data ignored
encrypt.c: /tmp/ccPKu4TR.s:954: Warning: dwarf line number information for .data ignored
encrypt.c: /tmp/ccPKu4TR.s:957: Warning: dwarf line number information for .data ignored
encrypt.c: /tmp/ccPKu4TR.s:959: Warning: dwarf line number information for .data ignored
encrypt.c: /tmp/ccPKu4TR.s:962: Warning: dwarf line number information for .data ignored
encrypt.c: /tmp/ccPKu4TR.s:970: Warning: dwarf line number information for .data ignored
encrypt.c: /tmp/ccPKu4TR.s:980: Warning: dwarf line number information for .data ignored
encrypt.c: /tmp/ccPKu4TR.s:982: Warning: dwarf line number information for .data ignored
encrypt.c: /tmp/ccPKu4TR.s:995: Warning: dwarf line number information for .data ignored
encrypt.c: /tmp/ccPKu4TR.s:999: Warning: dwarf line number information for .data ignored
encrypt.c: /tmp/ccPKu4TR.s:1000: Warning: dwarf line number information for .data ignored
encrypt.c: /tmp/ccPKu4TR.s:1001: Warning: dwarf line number information for .data ignored
encrypt.c: /tmp/ccPKu4TR.s:1008: Warning: dwarf line number information for .data ignored
encrypt.c: /tmp/ccPKu4TR.s:1011: Warning: dwarf line number information for .data ignored
encrypt.c: /tmp/ccPKu4TR.s:1014: Warning: dwarf line number information for .data ignored
encrypt.c: /tmp/ccPKu4TR.s:1017: Warning: dwarf line number information for .data ignored
encrypt.c: ...

Number of similar (implementation,compiler) pairs: 1, namely:
ImplementationCompiler
T:avx1gcc -march=native -mtune=native -O -fwrapv -fPIC -fPIE -gdwarf-4 -Wall (11.4.0)

Compiler output


encrypt.c: /tmp/ccebE8s0.s: Assembler messages:
encrypt.c: /tmp/ccebE8s0.s:921: Warning: dwarf line number information for .data ignored
encrypt.c: /tmp/ccebE8s0.s:923: Warning: dwarf line number information for .data ignored
encrypt.c: /tmp/ccebE8s0.s:925: Warning: dwarf line number information for .data ignored
encrypt.c: /tmp/ccebE8s0.s:926: Warning: dwarf line number information for .data ignored
encrypt.c: /tmp/ccebE8s0.s:927: Warning: dwarf line number information for .data ignored
encrypt.c: /tmp/ccebE8s0.s:938: Warning: dwarf line number information for .data ignored
encrypt.c: /tmp/ccebE8s0.s:945: Warning: dwarf line number information for .data ignored
encrypt.c: /tmp/ccebE8s0.s:948: Warning: dwarf line number information for .data ignored
encrypt.c: /tmp/ccebE8s0.s:949: Warning: dwarf line number information for .data ignored
encrypt.c: /tmp/ccebE8s0.s:956: Warning: dwarf line number information for .data ignored
encrypt.c: /tmp/ccebE8s0.s:957: Warning: dwarf line number information for .data ignored
encrypt.c: /tmp/ccebE8s0.s:960: Warning: dwarf line number information for .data ignored
encrypt.c: /tmp/ccebE8s0.s:962: Warning: dwarf line number information for .data ignored
encrypt.c: /tmp/ccebE8s0.s:965: Warning: dwarf line number information for .data ignored
encrypt.c: /tmp/ccebE8s0.s:973: Warning: dwarf line number information for .data ignored
encrypt.c: /tmp/ccebE8s0.s:983: Warning: dwarf line number information for .data ignored
encrypt.c: /tmp/ccebE8s0.s:985: Warning: dwarf line number information for .data ignored
encrypt.c: /tmp/ccebE8s0.s:987: Warning: dwarf line number information for .data ignored
encrypt.c: /tmp/ccebE8s0.s:988: Warning: dwarf line number information for .data ignored
encrypt.c: /tmp/ccebE8s0.s:989: Warning: dwarf line number information for .data ignored
encrypt.c: /tmp/ccebE8s0.s:996: Warning: dwarf line number information for .data ignored
encrypt.c: /tmp/ccebE8s0.s:1003: Warning: dwarf line number information for .data ignored
encrypt.c: /tmp/ccebE8s0.s:1006: Warning: dwarf line number information for .data ignored
encrypt.c: /tmp/ccebE8s0.s:1009: Warning: dwarf line number information for .data ignored
encrypt.c: ...

Number of similar (implementation,compiler) pairs: 1, namely:
ImplementationCompiler
T:avx1gcc -march=native -mtune=native -Os -fwrapv -fPIC -fPIE -gdwarf-4 -Wall (11.4.0)

Compiler output


try.c: /usr/bin/ld: libcrypto_aead_omdsha256k256n104tau160v1.a(omdsha256.o):.../supercop-data/margaux/amd64/try/c/clang_-march=native_-O2_-fwrapv_-Qunused-arguments_-fPIC_-fPIE_-gdwarf-4_-Wall/timingleaks/crypto_aead/omdsha256k256n104tau160v1/sse4/work/./omdsha256.h:137: multiple definition of `Hash'; libcrypto_aead_omdsha256k256n104tau160v1.a(encrypt.o):.../supercop-data/margaux/amd64/try/c/clang_-march=native_-O2_-fwrapv_-Qunused-arguments_-fPIC_-fPIE_-gdwarf-4_-Wall/timingleaks/crypto_aead/omdsha256k256n104tau160v1/sse4/work/./omdsha256.h:137: first defined here
try.c: clang: error: linker command failed with exit code 1 (use -v to see invocation)

Number of similar (implementation,compiler) pairs: 1, namely:
ImplementationCompiler
T:sse4clang -march=native -O2 -fwrapv -Qunused-arguments -fPIC -fPIE -gdwarf-4 -Wall (Ubuntu_Clang_14.0.0)

Compiler output


try.c: /usr/bin/ld: libcrypto_aead_omdsha256k256n104tau160v1.a(omdsha256.o):.../supercop-data/margaux/amd64/try/c/clang_-march=native_-O3_-fwrapv_-Qunused-arguments_-fPIC_-fPIE_-gdwarf-4_-Wall/timingleaks/crypto_aead/omdsha256k256n104tau160v1/sse4/work/./omdsha256.h:137: multiple definition of `Hash'; libcrypto_aead_omdsha256k256n104tau160v1.a(encrypt.o):.../supercop-data/margaux/amd64/try/c/clang_-march=native_-O3_-fwrapv_-Qunused-arguments_-fPIC_-fPIE_-gdwarf-4_-Wall/timingleaks/crypto_aead/omdsha256k256n104tau160v1/sse4/work/./omdsha256.h:137: first defined here
try.c: clang: error: linker command failed with exit code 1 (use -v to see invocation)

Number of similar (implementation,compiler) pairs: 1, namely:
ImplementationCompiler
T:sse4clang -march=native -O3 -fwrapv -Qunused-arguments -fPIC -fPIE -gdwarf-4 -Wall (Ubuntu_Clang_14.0.0)

Compiler output


try.c: /usr/bin/ld: libcrypto_aead_omdsha256k256n104tau160v1.a(omdsha256.o):.../supercop-data/margaux/amd64/try/c/clang_-march=native_-O_-fwrapv_-Qunused-arguments_-fPIC_-fPIE_-gdwarf-4_-Wall/timingleaks/crypto_aead/omdsha256k256n104tau160v1/sse4/work/./omdsha256.h:137: multiple definition of `Hash'; libcrypto_aead_omdsha256k256n104tau160v1.a(encrypt.o):.../supercop-data/margaux/amd64/try/c/clang_-march=native_-O_-fwrapv_-Qunused-arguments_-fPIC_-fPIE_-gdwarf-4_-Wall/timingleaks/crypto_aead/omdsha256k256n104tau160v1/sse4/work/./omdsha256.h:137: first defined here
try.c: clang: error: linker command failed with exit code 1 (use -v to see invocation)

Number of similar (implementation,compiler) pairs: 1, namely:
ImplementationCompiler
T:sse4clang -march=native -O -fwrapv -Qunused-arguments -fPIC -fPIE -gdwarf-4 -Wall (Ubuntu_Clang_14.0.0)

Compiler output


try.c: /usr/bin/ld: libcrypto_aead_omdsha256k256n104tau160v1.a(omdsha256.o):.../supercop-data/margaux/amd64/try/c/clang_-march=native_-Os_-fwrapv_-Qunused-arguments_-fPIC_-fPIE_-gdwarf-4_-Wall/timingleaks/crypto_aead/omdsha256k256n104tau160v1/sse4/work/./omdsha256.h:137: multiple definition of `Hash'; libcrypto_aead_omdsha256k256n104tau160v1.a(encrypt.o):.../supercop-data/margaux/amd64/try/c/clang_-march=native_-Os_-fwrapv_-Qunused-arguments_-fPIC_-fPIE_-gdwarf-4_-Wall/timingleaks/crypto_aead/omdsha256k256n104tau160v1/sse4/work/./omdsha256.h:137: first defined here
try.c: clang: error: linker command failed with exit code 1 (use -v to see invocation)

Number of similar (implementation,compiler) pairs: 1, namely:
ImplementationCompiler
T:sse4clang -march=native -Os -fwrapv -Qunused-arguments -fPIC -fPIE -gdwarf-4 -Wall (Ubuntu_Clang_14.0.0)

Compiler output


try.c: /usr/bin/ld: libcrypto_aead_omdsha256k256n104tau160v1.a(omdsha256.o):.../supercop-data/margaux/amd64/try/c/clang_-mcpu=native_-O3_-fwrapv_-Qunused-arguments_-fPIC_-fPIE_-gdwarf-4_-Wall/timingleaks/crypto_aead/omdsha256k256n104tau160v1/sse4/work/./omdsha256.h:137: multiple definition of `Hash'; libcrypto_aead_omdsha256k256n104tau160v1.a(encrypt.o):.../supercop-data/margaux/amd64/try/c/clang_-mcpu=native_-O3_-fwrapv_-Qunused-arguments_-fPIC_-fPIE_-gdwarf-4_-Wall/timingleaks/crypto_aead/omdsha256k256n104tau160v1/sse4/work/./omdsha256.h:137: first defined here
try.c: clang: error: linker command failed with exit code 1 (use -v to see invocation)

Number of similar (implementation,compiler) pairs: 1, namely:
ImplementationCompiler
T:sse4clang -mcpu=native -O3 -fwrapv -Qunused-arguments -fPIC -fPIE -gdwarf-4 -Wall (Ubuntu_Clang_14.0.0)

Compiler output


encrypt.c: /tmp/ccLwnKfI.s: Assembler messages:
encrypt.c: /tmp/ccLwnKfI.s:961: Warning: dwarf line number information for .data ignored
encrypt.c: /tmp/ccLwnKfI.s:963: Warning: dwarf line number information for .data ignored
encrypt.c: /tmp/ccLwnKfI.s:965: Warning: dwarf line number information for .data ignored
encrypt.c: /tmp/ccLwnKfI.s:966: Warning: dwarf line number information for .data ignored
encrypt.c: /tmp/ccLwnKfI.s:967: Warning: dwarf line number information for .data ignored
encrypt.c: /tmp/ccLwnKfI.s:978: Warning: dwarf line number information for .data ignored
encrypt.c: /tmp/ccLwnKfI.s:985: Warning: dwarf line number information for .data ignored
encrypt.c: /tmp/ccLwnKfI.s:988: Warning: dwarf line number information for .data ignored
encrypt.c: /tmp/ccLwnKfI.s:989: Warning: dwarf line number information for .data ignored
encrypt.c: /tmp/ccLwnKfI.s:996: Warning: dwarf line number information for .data ignored
encrypt.c: /tmp/ccLwnKfI.s:997: Warning: dwarf line number information for .data ignored
encrypt.c: /tmp/ccLwnKfI.s:1000: Warning: dwarf line number information for .data ignored
encrypt.c: /tmp/ccLwnKfI.s:1002: Warning: dwarf line number information for .data ignored
encrypt.c: /tmp/ccLwnKfI.s:1005: Warning: dwarf line number information for .data ignored
encrypt.c: /tmp/ccLwnKfI.s:1013: Warning: dwarf line number information for .data ignored
encrypt.c: /tmp/ccLwnKfI.s:1024: Warning: dwarf line number information for .data ignored
encrypt.c: /tmp/ccLwnKfI.s:1026: Warning: dwarf line number information for .data ignored
encrypt.c: /tmp/ccLwnKfI.s:1028: Warning: dwarf line number information for .data ignored
encrypt.c: /tmp/ccLwnKfI.s:1029: Warning: dwarf line number information for .data ignored
encrypt.c: /tmp/ccLwnKfI.s:1030: Warning: dwarf line number information for .data ignored
encrypt.c: /tmp/ccLwnKfI.s:1037: Warning: dwarf line number information for .data ignored
encrypt.c: /tmp/ccLwnKfI.s:1044: Warning: dwarf line number information for .data ignored
encrypt.c: /tmp/ccLwnKfI.s:1047: Warning: dwarf line number information for .data ignored
encrypt.c: /tmp/ccLwnKfI.s:1050: Warning: dwarf line number information for .data ignored
encrypt.c: ...

Number of similar (implementation,compiler) pairs: 1, namely:
ImplementationCompiler
T:sse4gcc -march=native -mtune=native -O2 -fwrapv -fPIC -fPIE -gdwarf-4 -Wall (11.4.0)

Compiler output


encrypt.c: /tmp/cciJhjrY.s: Assembler messages:
encrypt.c: /tmp/cciJhjrY.s:961: Warning: dwarf line number information for .data ignored
encrypt.c: /tmp/cciJhjrY.s:963: Warning: dwarf line number information for .data ignored
encrypt.c: /tmp/cciJhjrY.s:965: Warning: dwarf line number information for .data ignored
encrypt.c: /tmp/cciJhjrY.s:966: Warning: dwarf line number information for .data ignored
encrypt.c: /tmp/cciJhjrY.s:967: Warning: dwarf line number information for .data ignored
encrypt.c: /tmp/cciJhjrY.s:978: Warning: dwarf line number information for .data ignored
encrypt.c: /tmp/cciJhjrY.s:985: Warning: dwarf line number information for .data ignored
encrypt.c: /tmp/cciJhjrY.s:988: Warning: dwarf line number information for .data ignored
encrypt.c: /tmp/cciJhjrY.s:989: Warning: dwarf line number information for .data ignored
encrypt.c: /tmp/cciJhjrY.s:996: Warning: dwarf line number information for .data ignored
encrypt.c: /tmp/cciJhjrY.s:997: Warning: dwarf line number information for .data ignored
encrypt.c: /tmp/cciJhjrY.s:1000: Warning: dwarf line number information for .data ignored
encrypt.c: /tmp/cciJhjrY.s:1002: Warning: dwarf line number information for .data ignored
encrypt.c: /tmp/cciJhjrY.s:1005: Warning: dwarf line number information for .data ignored
encrypt.c: /tmp/cciJhjrY.s:1013: Warning: dwarf line number information for .data ignored
encrypt.c: /tmp/cciJhjrY.s:1024: Warning: dwarf line number information for .data ignored
encrypt.c: /tmp/cciJhjrY.s:1026: Warning: dwarf line number information for .data ignored
encrypt.c: /tmp/cciJhjrY.s:1028: Warning: dwarf line number information for .data ignored
encrypt.c: /tmp/cciJhjrY.s:1029: Warning: dwarf line number information for .data ignored
encrypt.c: /tmp/cciJhjrY.s:1030: Warning: dwarf line number information for .data ignored
encrypt.c: /tmp/cciJhjrY.s:1037: Warning: dwarf line number information for .data ignored
encrypt.c: /tmp/cciJhjrY.s:1044: Warning: dwarf line number information for .data ignored
encrypt.c: /tmp/cciJhjrY.s:1047: Warning: dwarf line number information for .data ignored
encrypt.c: /tmp/cciJhjrY.s:1050: Warning: dwarf line number information for .data ignored
encrypt.c: ...

Number of similar (implementation,compiler) pairs: 1, namely:
ImplementationCompiler
T:sse4gcc -march=native -mtune=native -O3 -fwrapv -fPIC -fPIE -gdwarf-4 -Wall (11.4.0)

Compiler output


encrypt.c: /tmp/cceEeC9J.s: Assembler messages:
encrypt.c: /tmp/cceEeC9J.s:960: Warning: dwarf line number information for .data ignored
encrypt.c: /tmp/cceEeC9J.s:962: Warning: dwarf line number information for .data ignored
encrypt.c: /tmp/cceEeC9J.s:974: Warning: dwarf line number information for .data ignored
encrypt.c: /tmp/cceEeC9J.s:975: Warning: dwarf line number information for .data ignored
encrypt.c: /tmp/cceEeC9J.s:976: Warning: dwarf line number information for .data ignored
encrypt.c: /tmp/cceEeC9J.s:983: Warning: dwarf line number information for .data ignored
encrypt.c: /tmp/cceEeC9J.s:986: Warning: dwarf line number information for .data ignored
encrypt.c: /tmp/cceEeC9J.s:987: Warning: dwarf line number information for .data ignored
encrypt.c: /tmp/cceEeC9J.s:992: Warning: dwarf line number information for .data ignored
encrypt.c: /tmp/cceEeC9J.s:993: Warning: dwarf line number information for .data ignored
encrypt.c: /tmp/cceEeC9J.s:996: Warning: dwarf line number information for .data ignored
encrypt.c: /tmp/cceEeC9J.s:998: Warning: dwarf line number information for .data ignored
encrypt.c: /tmp/cceEeC9J.s:1001: Warning: dwarf line number information for .data ignored
encrypt.c: /tmp/cceEeC9J.s:1009: Warning: dwarf line number information for .data ignored
encrypt.c: /tmp/cceEeC9J.s:1019: Warning: dwarf line number information for .data ignored
encrypt.c: /tmp/cceEeC9J.s:1021: Warning: dwarf line number information for .data ignored
encrypt.c: /tmp/cceEeC9J.s:1034: Warning: dwarf line number information for .data ignored
encrypt.c: /tmp/cceEeC9J.s:1038: Warning: dwarf line number information for .data ignored
encrypt.c: /tmp/cceEeC9J.s:1039: Warning: dwarf line number information for .data ignored
encrypt.c: /tmp/cceEeC9J.s:1040: Warning: dwarf line number information for .data ignored
encrypt.c: /tmp/cceEeC9J.s:1047: Warning: dwarf line number information for .data ignored
encrypt.c: /tmp/cceEeC9J.s:1050: Warning: dwarf line number information for .data ignored
encrypt.c: /tmp/cceEeC9J.s:1053: Warning: dwarf line number information for .data ignored
encrypt.c: /tmp/cceEeC9J.s:1056: Warning: dwarf line number information for .data ignored
encrypt.c: ...

Number of similar (implementation,compiler) pairs: 1, namely:
ImplementationCompiler
T:sse4gcc -march=native -mtune=native -O -fwrapv -fPIC -fPIE -gdwarf-4 -Wall (11.4.0)

Compiler output


encrypt.c: /tmp/ccvfFV1a.s: Assembler messages:
encrypt.c: /tmp/ccvfFV1a.s:960: Warning: dwarf line number information for .data ignored
encrypt.c: /tmp/ccvfFV1a.s:962: Warning: dwarf line number information for .data ignored
encrypt.c: /tmp/ccvfFV1a.s:964: Warning: dwarf line number information for .data ignored
encrypt.c: /tmp/ccvfFV1a.s:965: Warning: dwarf line number information for .data ignored
encrypt.c: /tmp/ccvfFV1a.s:966: Warning: dwarf line number information for .data ignored
encrypt.c: /tmp/ccvfFV1a.s:977: Warning: dwarf line number information for .data ignored
encrypt.c: /tmp/ccvfFV1a.s:984: Warning: dwarf line number information for .data ignored
encrypt.c: /tmp/ccvfFV1a.s:987: Warning: dwarf line number information for .data ignored
encrypt.c: /tmp/ccvfFV1a.s:988: Warning: dwarf line number information for .data ignored
encrypt.c: /tmp/ccvfFV1a.s:995: Warning: dwarf line number information for .data ignored
encrypt.c: /tmp/ccvfFV1a.s:996: Warning: dwarf line number information for .data ignored
encrypt.c: /tmp/ccvfFV1a.s:999: Warning: dwarf line number information for .data ignored
encrypt.c: /tmp/ccvfFV1a.s:1001: Warning: dwarf line number information for .data ignored
encrypt.c: /tmp/ccvfFV1a.s:1004: Warning: dwarf line number information for .data ignored
encrypt.c: /tmp/ccvfFV1a.s:1012: Warning: dwarf line number information for .data ignored
encrypt.c: /tmp/ccvfFV1a.s:1022: Warning: dwarf line number information for .data ignored
encrypt.c: /tmp/ccvfFV1a.s:1024: Warning: dwarf line number information for .data ignored
encrypt.c: /tmp/ccvfFV1a.s:1026: Warning: dwarf line number information for .data ignored
encrypt.c: /tmp/ccvfFV1a.s:1027: Warning: dwarf line number information for .data ignored
encrypt.c: /tmp/ccvfFV1a.s:1028: Warning: dwarf line number information for .data ignored
encrypt.c: /tmp/ccvfFV1a.s:1035: Warning: dwarf line number information for .data ignored
encrypt.c: /tmp/ccvfFV1a.s:1042: Warning: dwarf line number information for .data ignored
encrypt.c: /tmp/ccvfFV1a.s:1045: Warning: dwarf line number information for .data ignored
encrypt.c: /tmp/ccvfFV1a.s:1048: Warning: dwarf line number information for .data ignored
encrypt.c: ...

Number of similar (implementation,compiler) pairs: 1, namely:
ImplementationCompiler
T:sse4gcc -march=native -mtune=native -Os -fwrapv -fPIC -fPIE -gdwarf-4 -Wall (11.4.0)