Implementation notes: amd64, lucienne, crypto_stream/simon6496ctr

Computer: lucienne
Microarchitecture: amd64; Zen 2 (860f81)
Architecture: amd64
CPU ID: AuthenticAMD-00860f81-178bfbff
SUPERCOP version: 20240625
Operation: crypto_stream
Primitive: simon6496ctr
TimeObject sizeTest sizeImplementationCompilerBenchmark dateSUPERCOP version
294388716 0 0103336 812 984T:avx2clang_-march=native_-O3_-fwrapv_-Qunused-arguments_-fPIC_-fPIE_-gdwarf-4_-Wall2024062620240625
296888252 0 0102760 812 984T:avx2clang_-march=native_-O2_-fwrapv_-Qunused-arguments_-fPIC_-fPIE_-gdwarf-4_-Wall2024062620240625
313487958 0 0103208 780 1016T:avx2gcc_-march=native_-mtune=native_-O3_-fwrapv_-fPIC_-fPIE_-gdwarf-4_-Wall2024062620240625
404687299 0 099454 804 952T:avx2clang_-march=native_-Os_-fwrapv_-Qunused-arguments_-fPIC_-fPIE_-gdwarf-4_-Wall2024062620240625
429284550 0 098064 780 1016T:avx2gcc_-march=native_-mtune=native_-O2_-fwrapv_-fPIC_-fPIE_-gdwarf-4_-Wall2024062620240625
446783888 0 095755 756 984T:avx2gcc_-march=native_-mtune=native_-Os_-fwrapv_-fPIC_-fPIE_-gdwarf-4_-Wall2024062620240625
457878521 0 093752 780 1016T:sse4gcc_-march=native_-mtune=native_-O3_-fwrapv_-fPIC_-fPIE_-gdwarf-4_-Wall2024062620240625
486176741 0 091440 812 984T:sse4clang_-march=native_-O3_-fwrapv_-Qunused-arguments_-fPIC_-fPIE_-gdwarf-4_-Wall2024062620240625
560276357 0 090928 812 984T:sse4clang_-march=native_-O2_-fwrapv_-Qunused-arguments_-fPIC_-fPIE_-gdwarf-4_-Wall2024062620240625
693180027 0 092310 804 952T:sse4clang_-march=native_-Os_-fwrapv_-Qunused-arguments_-fPIC_-fPIE_-gdwarf-4_-Wall2024062620240625
712081835 0 093659 756 984T:sse4gcc_-march=native_-mtune=native_-Os_-fwrapv_-fPIC_-fPIE_-gdwarf-4_-Wall2024062620240625
717678231 0 091704 780 1016T:sse4gcc_-march=native_-mtune=native_-O2_-fwrapv_-fPIC_-fPIE_-gdwarf-4_-Wall2024062620240625
724780645 0 093623 772 1016T:sse4gcc_-march=native_-mtune=native_-O_-fwrapv_-fPIC_-fPIE_-gdwarf-4_-Wall2024062620240625
769785405 0 097870 804 952T:sse4clang_-march=native_-O_-fwrapv_-Qunused-arguments_-fPIC_-fPIE_-gdwarf-4_-Wall2024062620240625

Compiler output


try.c: /usr/bin/ld: libcrypto_stream_simon6496ctr.a(stream.o): in function `ExpandKeyBS':
try.c: .../supercop-data/lucienne/amd64/try/c/clang_-march=native_-O_-fwrapv_-Qunused-arguments_-fPIC_-fPIE_-gdwarf-4_-Wall/timingleaks/crypto_stream/simon6496ctr/avx2/work/stream.c:375: undefined reference to `Transpose'
try.c: /usr/bin/ld: libcrypto_stream_simon6496ctr.a(stream.o): in function `Encrypt':
try.c: .../supercop-data/lucienne/amd64/try/c/clang_-march=native_-O_-fwrapv_-Qunused-arguments_-fPIC_-fPIE_-gdwarf-4_-Wall/timingleaks/crypto_stream/simon6496ctr/avx2/work/stream.c:165: undefined reference to `Transpose'
try.c: /usr/bin/ld: .../supercop-data/lucienne/amd64/try/c/clang_-march=native_-O_-fwrapv_-Qunused-arguments_-fPIC_-fPIE_-gdwarf-4_-Wall/timingleaks/crypto_stream/simon6496ctr/avx2/work/stream.c:165: undefined reference to `Transpose'
try.c: /usr/bin/ld: .../supercop-data/lucienne/amd64/try/c/clang_-march=native_-O_-fwrapv_-Qunused-arguments_-fPIC_-fPIE_-gdwarf-4_-Wall/timingleaks/crypto_stream/simon6496ctr/avx2/work/stream.c:174: undefined reference to `Transpose'
try.c: /usr/bin/ld: .../supercop-data/lucienne/amd64/try/c/clang_-march=native_-O_-fwrapv_-Qunused-arguments_-fPIC_-fPIE_-gdwarf-4_-Wall/timingleaks/crypto_stream/simon6496ctr/avx2/work/stream.c:174: undefined reference to `Transpose'
try.c: /usr/bin/ld: libcrypto_stream_simon6496ctr.a(stream.o):.../supercop-data/lucienne/amd64/try/c/clang_-march=native_-O_-fwrapv_-Qunused-arguments_-fPIC_-fPIE_-gdwarf-4_-Wall/timingleaks/crypto_stream/simon6496ctr/avx2/work/stream.c:333: more undefined references to `Transpose' follow
try.c: clang: error: linker command failed with exit code 1 (use -v to see invocation)

Number of similar (implementation,compiler) pairs: 1, namely:
ImplementationCompiler
T:avx2clang -march=native -O -fwrapv -Qunused-arguments -fPIC -fPIE -gdwarf-4 -Wall (Debian_Clang_11.0.1)

Compiler output


stream.c: stream.c:148:3: error: always_inline function '_mm256_set_epi32' requires target feature 'avx', but would be inlined into function 'Encrypt' that is compiled without support for 'avx'
stream.c:   SET1(X[0],nonce[1]); SET8(Y[0],nonce[0]);
stream.c:   ^
stream.c: ./Intrinsics_AVX2_64block.h:25:22: note: expanded from macro 'SET1'
stream.c: #define SET1(X,c) (X=SET(c,c,c,c,c,c,c,c))
stream.c:                      ^
stream.c: ./Intrinsics_AVX2_64block.h:24:13: note: expanded from macro 'SET'
stream.c: #define SET _mm256_set_epi32
stream.c:             ^
stream.c: stream.c:148:3: error: AVX vector return of type '__m256i' (vector of 4 'long long' values) without 'avx' enabled changes the ABI
stream.c: ./Intrinsics_AVX2_64block.h:25:22: note: expanded from macro 'SET1'
stream.c: #define SET1(X,c) (X=SET(c,c,c,c,c,c,c,c))
stream.c:                      ^
stream.c: ./Intrinsics_AVX2_64block.h:24:13: note: expanded from macro 'SET'
stream.c: #define SET _mm256_set_epi32
stream.c:             ^
stream.c: stream.c:148:24: error: always_inline function '_mm256_set_epi32' requires target feature 'avx', but would be inlined into function 'Encrypt' that is compiled without support for 'avx'
stream.c:   SET1(X[0],nonce[1]); SET8(Y[0],nonce[0]);
stream.c:                        ^
stream.c: ./Intrinsics_AVX2_64block.h:26:22: note: expanded from macro 'SET8'
stream.c: #define SET8(X,c) (X=SET(c,c,c,c,c,c,c,c), X=ADD(X,_q))
stream.c:                      ^
stream.c: ./Intrinsics_AVX2_64block.h:24:13: note: expanded from macro 'SET'
stream.c: #define SET _mm256_set_epi32
stream.c:             ^
stream.c: ...

Number of similar (implementation,compiler) pairs: 1, namely:
ImplementationCompiler
T:avx2clang -mcpu=native -O3 -fwrapv -Qunused-arguments -fPIC -fPIE -gdwarf-4 -Wall (Debian_Clang_11.0.1)

Compiler output


try.c: /usr/bin/ld: libcrypto_stream_simon6496ctr.a(stream.o): in function `Encrypt':
try.c: .../supercop-data/lucienne/amd64/try/c/gcc_-march=native_-mtune=native_-O_-fwrapv_-fPIC_-fPIE_-gdwarf-4_-Wall/timingleaks/crypto_stream/simon6496ctr/avx2/work/stream.c:165: undefined reference to `Transpose'
try.c: /usr/bin/ld: .../supercop-data/lucienne/amd64/try/c/gcc_-march=native_-mtune=native_-O_-fwrapv_-fPIC_-fPIE_-gdwarf-4_-Wall/timingleaks/crypto_stream/simon6496ctr/avx2/work/stream.c:165: undefined reference to `Transpose'
try.c: /usr/bin/ld: .../supercop-data/lucienne/amd64/try/c/gcc_-march=native_-mtune=native_-O_-fwrapv_-fPIC_-fPIE_-gdwarf-4_-Wall/timingleaks/crypto_stream/simon6496ctr/avx2/work/stream.c:174: undefined reference to `Transpose'
try.c: /usr/bin/ld: .../supercop-data/lucienne/amd64/try/c/gcc_-march=native_-mtune=native_-O_-fwrapv_-fPIC_-fPIE_-gdwarf-4_-Wall/timingleaks/crypto_stream/simon6496ctr/avx2/work/stream.c:174: undefined reference to `Transpose'
try.c: /usr/bin/ld: libcrypto_stream_simon6496ctr.a(stream.o): in function `Encrypt_Xor':
try.c: .../supercop-data/lucienne/amd64/try/c/gcc_-march=native_-mtune=native_-O_-fwrapv_-fPIC_-fPIE_-gdwarf-4_-Wall/timingleaks/crypto_stream/simon6496ctr/avx2/work/stream.c:333: undefined reference to `Transpose'
try.c: /usr/bin/ld: libcrypto_stream_simon6496ctr.a(stream.o):.../supercop-data/lucienne/amd64/try/c/gcc_-march=native_-mtune=native_-O_-fwrapv_-fPIC_-fPIE_-gdwarf-4_-Wall/timingleaks/crypto_stream/simon6496ctr/avx2/work/stream.c:333: more undefined references to `Transpose' follow
try.c: collect2: error: ld returned 1 exit status

Number of similar (implementation,compiler) pairs: 1, namely:
ImplementationCompiler
T:avx2gcc -march=native -mtune=native -O -fwrapv -fPIC -fPIE -gdwarf-4 -Wall (10.2.1_20210110)

Compiler output


stream.c: stream.c:341:3: error: always_inline function '_mm_shuffle_epi8' requires target feature 'ssse3', but would be inlined into function 'ExpandKeyBS' that is compiled without support for 'ssse3'
stream.c:   EKBS(rk);
stream.c:   ^
stream.c: ./Simon6496SSE4.h:59:19: note: expanded from macro 'EKBS'
stream.c: #define EKBS(rk) (RKBS(rk,3,_D),  RKBS(rk,4,_C),  RKBS(rk,5,_D),  RKBS(rk,6,_C),  RKBS(rk,7,_D),  RKBS(rk,8,_D), \
stream.c:                   ^
stream.c: ./Simon6496SSE4.h:50:52: note: expanded from macro 'RKBS'
stream.c: #define RKBS(rk,r,_V) (rk[r][7]= _D ^ rk[r-3][7] ^ ROR8(rk[r-1][2] ^ rk[r-1][3]), \
stream.c:                                                    ^
stream.c: ./Intrinsics_SSE4_64block.h:40:19: note: expanded from macro 'ROR8'
stream.c: #define ROR8(X)  (SHFL(X,R8))
stream.c:                   ^
stream.c: ./Intrinsics_SSE4_64block.h:35:14: note: expanded from macro 'SHFL'
stream.c: #define SHFL _mm_shuffle_epi8
stream.c:              ^
stream.c: stream.c:341:3: error: always_inline function '_mm_shuffle_epi8' requires target feature 'ssse3', but would be inlined into function 'ExpandKeyBS' that is compiled without support for 'ssse3'
stream.c: ./Simon6496SSE4.h:59:19: note: expanded from macro 'EKBS'
stream.c: #define EKBS(rk) (RKBS(rk,3,_D),  RKBS(rk,4,_C),  RKBS(rk,5,_D),  RKBS(rk,6,_C),  RKBS(rk,7,_D),  RKBS(rk,8,_D), \
stream.c:                   ^
stream.c: ./Simon6496SSE4.h:51:52: note: expanded from macro 'RKBS'
stream.c:                        rk[r][6]= _D ^ rk[r-3][6] ^ ROR8(rk[r-1][1] ^ rk[r-1][2]), \
stream.c:                                                    ^
stream.c: ./Intrinsics_SSE4_64block.h:40:19: note: expanded from macro 'ROR8'
stream.c: #define ROR8(X)  (SHFL(X,R8))
stream.c:                   ^
stream.c: ...

Number of similar (implementation,compiler) pairs: 1, namely:
ImplementationCompiler
T:sse4clang -mcpu=native -O3 -fwrapv -Qunused-arguments -fPIC -fPIE -gdwarf-4 -Wall (Debian_Clang_11.0.1)