Implementation notes: amd64, lucienne, crypto_stream/simon128256ctr

Computer: lucienne
Microarchitecture: amd64; Zen 2 (860f81)
Architecture: amd64
CPU ID: AuthenticAMD-00860f81-178bfbff
SUPERCOP version: 20240625
Operation: crypto_stream
Primitive: simon128256ctr
TimeObject sizeTest sizeImplementationCompilerBenchmark dateSUPERCOP version
4931133129 0 0147784 812 984T:avx2clang_-march=native_-O3_-fwrapv_-Qunused-arguments_-fPIC_-fPIE_-gdwarf-4_-Wall2024062620240625
4958132249 0 0146760 812 984T:avx2clang_-march=native_-O2_-fwrapv_-Qunused-arguments_-fPIC_-fPIE_-gdwarf-4_-Wall2024062620240625
6088141426 0 0156696 780 1016T:avx2gcc_-march=native_-mtune=native_-O3_-fwrapv_-fPIC_-fPIE_-gdwarf-4_-Wall2024062620240625
7710137714 0 0151248 780 1016T:avx2gcc_-march=native_-mtune=native_-O2_-fwrapv_-fPIC_-fPIE_-gdwarf-4_-Wall2024062620240625
7738131405 0 0143582 804 952T:avx2clang_-march=native_-Os_-fwrapv_-Qunused-arguments_-fPIC_-fPIE_-gdwarf-4_-Wall2024062620240625
8005135948 0 0151192 780 1016T:sse4gcc_-march=native_-mtune=native_-O3_-fwrapv_-fPIC_-fPIE_-gdwarf-4_-Wall2024062620240625
8215126218 0 0140808 812 984T:sse4clang_-march=native_-O2_-fwrapv_-Qunused-arguments_-fPIC_-fPIE_-gdwarf-4_-Wall2024062620240625
8228126762 0 0141480 812 984T:sse4clang_-march=native_-O3_-fwrapv_-Qunused-arguments_-fPIC_-fPIE_-gdwarf-4_-Wall2024062620240625
8269136598 0 0148507 756 984T:avx2gcc_-march=native_-mtune=native_-Os_-fwrapv_-fPIC_-fPIE_-gdwarf-4_-Wall2024062620240625
11471130737 0 0143038 804 952T:sse4clang_-march=native_-Os_-fwrapv_-Qunused-arguments_-fPIC_-fPIE_-gdwarf-4_-Wall2024062620240625
11512134846 0 0148328 780 1016T:sse4gcc_-march=native_-mtune=native_-O2_-fwrapv_-fPIC_-fPIE_-gdwarf-4_-Wall2024062620240625
12072135565 0 0147435 756 984T:sse4gcc_-march=native_-mtune=native_-Os_-fwrapv_-fPIC_-fPIE_-gdwarf-4_-Wall2024062620240625
12413136653 0 0149655 772 1016T:sse4gcc_-march=native_-mtune=native_-O_-fwrapv_-fPIC_-fPIE_-gdwarf-4_-Wall2024062620240625
12424144224 0 0156702 804 952T:sse4clang_-march=native_-O_-fwrapv_-Qunused-arguments_-fPIC_-fPIE_-gdwarf-4_-Wall2024062620240625

Compiler output


try.c: /usr/bin/ld: libcrypto_stream_simon128256ctr.a(stream.o): in function `ExpandKeyBS':
try.c: .../supercop-data/lucienne/amd64/try/c/clang_-march=native_-O_-fwrapv_-Qunused-arguments_-fPIC_-fPIE_-gdwarf-4_-Wall/timingleaks/crypto_stream/simon128256ctr/avx2/work/stream.c:337: undefined reference to `Transpose'
try.c: /usr/bin/ld: libcrypto_stream_simon128256ctr.a(stream.o): in function `Encrypt':
try.c: .../supercop-data/lucienne/amd64/try/c/clang_-march=native_-O_-fwrapv_-Qunused-arguments_-fPIC_-fPIE_-gdwarf-4_-Wall/timingleaks/crypto_stream/simon128256ctr/avx2/work/stream.c:145: undefined reference to `Transpose'
try.c: /usr/bin/ld: .../supercop-data/lucienne/amd64/try/c/clang_-march=native_-O_-fwrapv_-Qunused-arguments_-fPIC_-fPIE_-gdwarf-4_-Wall/timingleaks/crypto_stream/simon128256ctr/avx2/work/stream.c:145: undefined reference to `Transpose'
try.c: /usr/bin/ld: .../supercop-data/lucienne/amd64/try/c/clang_-march=native_-O_-fwrapv_-Qunused-arguments_-fPIC_-fPIE_-gdwarf-4_-Wall/timingleaks/crypto_stream/simon128256ctr/avx2/work/stream.c:154: undefined reference to `Transpose'
try.c: /usr/bin/ld: .../supercop-data/lucienne/amd64/try/c/clang_-march=native_-O_-fwrapv_-Qunused-arguments_-fPIC_-fPIE_-gdwarf-4_-Wall/timingleaks/crypto_stream/simon128256ctr/avx2/work/stream.c:154: undefined reference to `Transpose'
try.c: /usr/bin/ld: libcrypto_stream_simon128256ctr.a(stream.o):.../supercop-data/lucienne/amd64/try/c/clang_-march=native_-O_-fwrapv_-Qunused-arguments_-fPIC_-fPIE_-gdwarf-4_-Wall/timingleaks/crypto_stream/simon128256ctr/avx2/work/stream.c:294: more undefined references to `Transpose' follow
try.c: clang: error: linker command failed with exit code 1 (use -v to see invocation)

Number of similar (implementation,compiler) pairs: 1, namely:
ImplementationCompiler
T:avx2clang -march=native -O -fwrapv -Qunused-arguments -fPIC -fPIE -gdwarf-4 -Wall (Debian_Clang_11.0.1)

Compiler output


stream.c: stream.c:128:3: error: always_inline function '_mm256_set_epi64x' requires target feature 'avx', but would be inlined into function 'Encrypt' that is compiled without support for 'avx'
stream.c:   SET1(X[0],nonce[1]); SET4(Y[0],nonce[0]);
stream.c:   ^
stream.c: ./Intrinsics_AVX2_128block.h:25:22: note: expanded from macro 'SET1'
stream.c: #define SET1(X,c) (X=SET(c,c,c,c))
stream.c:                      ^
stream.c: ./Intrinsics_AVX2_128block.h:24:13: note: expanded from macro 'SET'
stream.c: #define SET _mm256_set_epi64x
stream.c:             ^
stream.c: stream.c:128:3: error: AVX vector return of type '__m256i' (vector of 4 'long long' values) without 'avx' enabled changes the ABI
stream.c: ./Intrinsics_AVX2_128block.h:25:22: note: expanded from macro 'SET1'
stream.c: #define SET1(X,c) (X=SET(c,c,c,c))
stream.c:                      ^
stream.c: ./Intrinsics_AVX2_128block.h:24:13: note: expanded from macro 'SET'
stream.c: #define SET _mm256_set_epi64x
stream.c:             ^
stream.c: stream.c:128:24: error: always_inline function '_mm256_set_epi64x' requires target feature 'avx', but would be inlined into function 'Encrypt' that is compiled without support for 'avx'
stream.c:   SET1(X[0],nonce[1]); SET4(Y[0],nonce[0]);
stream.c:                        ^
stream.c: ./Intrinsics_AVX2_128block.h:26:22: note: expanded from macro 'SET4'
stream.c: #define SET4(X,c) (X=SET(c,c,c,c), X=ADD(X,_q))
stream.c:                      ^
stream.c: ./Intrinsics_AVX2_128block.h:24:13: note: expanded from macro 'SET'
stream.c: #define SET _mm256_set_epi64x
stream.c:             ^
stream.c: ...

Number of similar (implementation,compiler) pairs: 1, namely:
ImplementationCompiler
T:avx2clang -mcpu=native -O3 -fwrapv -Qunused-arguments -fPIC -fPIE -gdwarf-4 -Wall (Debian_Clang_11.0.1)

Compiler output


try.c: /usr/bin/ld: libcrypto_stream_simon128256ctr.a(stream.o): in function `Encrypt':
try.c: .../supercop-data/lucienne/amd64/try/c/gcc_-march=native_-mtune=native_-O_-fwrapv_-fPIC_-fPIE_-gdwarf-4_-Wall/timingleaks/crypto_stream/simon128256ctr/avx2/work/stream.c:145: undefined reference to `Transpose'
try.c: /usr/bin/ld: .../supercop-data/lucienne/amd64/try/c/gcc_-march=native_-mtune=native_-O_-fwrapv_-fPIC_-fPIE_-gdwarf-4_-Wall/timingleaks/crypto_stream/simon128256ctr/avx2/work/stream.c:145: undefined reference to `Transpose'
try.c: /usr/bin/ld: .../supercop-data/lucienne/amd64/try/c/gcc_-march=native_-mtune=native_-O_-fwrapv_-fPIC_-fPIE_-gdwarf-4_-Wall/timingleaks/crypto_stream/simon128256ctr/avx2/work/stream.c:154: undefined reference to `Transpose'
try.c: /usr/bin/ld: .../supercop-data/lucienne/amd64/try/c/gcc_-march=native_-mtune=native_-O_-fwrapv_-fPIC_-fPIE_-gdwarf-4_-Wall/timingleaks/crypto_stream/simon128256ctr/avx2/work/stream.c:154: undefined reference to `Transpose'
try.c: /usr/bin/ld: libcrypto_stream_simon128256ctr.a(stream.o): in function `Encrypt_Xor':
try.c: .../supercop-data/lucienne/amd64/try/c/gcc_-march=native_-mtune=native_-O_-fwrapv_-fPIC_-fPIE_-gdwarf-4_-Wall/timingleaks/crypto_stream/simon128256ctr/avx2/work/stream.c:294: undefined reference to `Transpose'
try.c: /usr/bin/ld: libcrypto_stream_simon128256ctr.a(stream.o):.../supercop-data/lucienne/amd64/try/c/gcc_-march=native_-mtune=native_-O_-fwrapv_-fPIC_-fPIE_-gdwarf-4_-Wall/timingleaks/crypto_stream/simon128256ctr/avx2/work/stream.c:294: more undefined references to `Transpose' follow
try.c: collect2: error: ld returned 1 exit status

Number of similar (implementation,compiler) pairs: 1, namely:
ImplementationCompiler
T:avx2gcc -march=native -mtune=native -O -fwrapv -fPIC -fPIE -gdwarf-4 -Wall (10.2.1_20210110)

Compiler output


stream.c: stream.c:307:3: error: always_inline function '_mm_shuffle_epi8' requires target feature 'ssse3', but would be inlined into function 'ExpandKeyBS' that is compiled without support for 'ssse3'
stream.c:   EKBS(rk);
stream.c:   ^
stream.c: ./Simon128256SSE4.h:67:19: note: expanded from macro 'EKBS'
stream.c: #define EKBS(rk) (RKBS(rk,4,_D),  RKBS(rk,5,_D),  RKBS(rk,6,_C),  RKBS(rk,7,_D),  RKBS(rk,8,_C),   RKBS(rk,9,_C),  RKBS(rk,10,_C), RKBS(rk,11,_D), \
stream.c:                   ^
stream.c: ./Simon128256SSE4.h:57:52: note: expanded from macro 'RKBS'
stream.c: #define RKBS(rk,r,_V) (rk[r][7]= _D ^ rk[r-4][7] ^ ROR8(rk[r-1][2])  ^ rk[r-3][7] ^ ROR8(rk[r-1][3])  ^ ROR8(rk[r-3][0]), \
stream.c:                                                    ^
stream.c: ./Intrinsics_SSE4_128block.h:39:19: note: expanded from macro 'ROR8'
stream.c: #define ROR8(X)  (SHFL(X,R8))
stream.c:                   ^
stream.c: ./Intrinsics_SSE4_128block.h:35:14: note: expanded from macro 'SHFL'
stream.c: #define SHFL _mm_shuffle_epi8
stream.c:              ^
stream.c: stream.c:307:3: error: always_inline function '_mm_shuffle_epi8' requires target feature 'ssse3', but would be inlined into function 'ExpandKeyBS' that is compiled without support for 'ssse3'
stream.c: ./Simon128256SSE4.h:67:19: note: expanded from macro 'EKBS'
stream.c: #define EKBS(rk) (RKBS(rk,4,_D),  RKBS(rk,5,_D),  RKBS(rk,6,_C),  RKBS(rk,7,_D),  RKBS(rk,8,_C),   RKBS(rk,9,_C),  RKBS(rk,10,_C), RKBS(rk,11,_D), \
stream.c:                   ^
stream.c: ./Simon128256SSE4.h:57:85: note: expanded from macro 'RKBS'
stream.c: #define RKBS(rk,r,_V) (rk[r][7]= _D ^ rk[r-4][7] ^ ROR8(rk[r-1][2])  ^ rk[r-3][7] ^ ROR8(rk[r-1][3])  ^ ROR8(rk[r-3][0]), \
stream.c:                                                                                     ^
stream.c: ./Intrinsics_SSE4_128block.h:39:19: note: expanded from macro 'ROR8'
stream.c: #define ROR8(X)  (SHFL(X,R8))
stream.c:                   ^
stream.c: ...

Number of similar (implementation,compiler) pairs: 1, namely:
ImplementationCompiler
T:sse4clang -mcpu=native -O3 -fwrapv -Qunused-arguments -fPIC -fPIE -gdwarf-4 -Wall (Debian_Clang_11.0.1)