Implementation notes: amd64, lucienne, crypto_hash/luffa256

Computer: lucienne
Microarchitecture: amd64; Zen 2 (860f81)
Architecture: amd64
CPU ID: AuthenticAMD-00860f81-178bfbff
SUPERCOP version: 20240716
Operation: crypto_hash
Primitive: luffa256
TimeObject sizeTest sizeImplementationCompilerBenchmark dateSUPERCOP version
197169573 0 54422296 780 1496T:sse2gcc_-march=native_-mtune=native_-O3_-fwrapv_-fPIC_-fPIE_-gdwarf-4_-Wall2024071720240716
199929107 0 54421448 812 1464T:sse2clang_-march=native_-O2_-fwrapv_-Qunused-arguments_-fPIC_-fPIE_-gdwarf-4_-Wall2024071720240716
200149155 0 54421664 812 1464T:sse2clang_-march=native_-O3_-fwrapv_-Qunused-arguments_-fPIC_-fPIE_-gdwarf-4_-Wall2024071720240716
201078675 0 54419680 780 1496T:sse2gcc_-march=native_-mtune=native_-O2_-fwrapv_-fPIC_-fPIE_-gdwarf-4_-Wall2024071720240716
2021011327 0 54424032 812 1432T:sse2clang_-mcpu=native_-O3_-fwrapv_-Qunused-arguments_-fPIC_-fPIE_-gdwarf-4_-Wall2024071720240716
211499322 0 54419951 772 1496T:sse2gcc_-march=native_-mtune=native_-O_-fwrapv_-fPIC_-fPIE_-gdwarf-4_-Wall2024071720240716
212507894 0 54418126 804 1432T:sse2clang_-march=native_-Os_-fwrapv_-Qunused-arguments_-fPIC_-fPIE_-gdwarf-4_-Wall2024071720240716
217297772 0 54417435 756 1464T:sse2gcc_-march=native_-mtune=native_-Os_-fwrapv_-fPIC_-fPIE_-gdwarf-4_-Wall2024071720240716
226749418 0 54420014 804 1432T:sse2clang_-march=native_-O_-fwrapv_-Qunused-arguments_-fPIC_-fPIE_-gdwarf-4_-Wall2024071720240716
2485528052 0 039152 780 952T:sphlibgcc_-march=native_-mtune=native_-O2_-fwrapv_-fPIC_-fPIE_-gdwarf-4_-Wall2024071720240716
2523728180 0 040992 780 952T:sphlibgcc_-march=native_-mtune=native_-O3_-fwrapv_-fPIC_-fPIE_-gdwarf-4_-Wall2024071720240716
2526726625 0 037408 780 952T:sphlibgcc_-march=native_-mtune=native_-O_-fwrapv_-fPIC_-fPIE_-gdwarf-4_-Wall2024071720240716
2651926788 0 039400 812 920T:sphlibclang_-march=native_-O2_-fwrapv_-Qunused-arguments_-fPIC_-fPIE_-gdwarf-4_-Wall2024071720240716
2655926376 0 036670 804 888T:sphlibclang_-march=native_-Os_-fwrapv_-Qunused-arguments_-fPIC_-fPIE_-gdwarf-4_-Wall2024071720240716
2656226820 0 039560 812 920T:sphlibclang_-march=native_-O3_-fwrapv_-Qunused-arguments_-fPIC_-fPIE_-gdwarf-4_-Wall2024071720240716
2779026469 0 039448 812 888T:sphlibclang_-mcpu=native_-O3_-fwrapv_-Qunused-arguments_-fPIC_-fPIE_-gdwarf-4_-Wall2024071720240716
285033373 0 9616248 812 984T:thomaz/basicclang_-mcpu=native_-O3_-fwrapv_-Qunused-arguments_-fPIC_-fPIE_-gdwarf-4_-Wall2024071720240716
2955729859 0 040462 804 888T:sphlibclang_-march=native_-O_-fwrapv_-Qunused-arguments_-fPIC_-fPIE_-gdwarf-4_-Wall2024071720240716
3012819827 320 032632 1140 888T:opt32clang_-mcpu=native_-O3_-fwrapv_-Qunused-arguments_-fPIC_-fPIE_-gdwarf-4_-Wall2024071720240716
3056916420 320 029232 1108 952T:opt32gcc_-march=native_-mtune=native_-O3_-fwrapv_-fPIC_-fPIE_-gdwarf-4_-Wall2024071720240716
3087423084 0 032827 756 920T:sphlibgcc_-march=native_-mtune=native_-Os_-fwrapv_-fPIC_-fPIE_-gdwarf-4_-Wall2024071720240716
330869516 320 019259 1084 920T:opt32gcc_-march=native_-mtune=native_-Os_-fwrapv_-fPIC_-fPIE_-gdwarf-4_-Wall2024071720240716
3313410977 320 022064 1108 952T:opt32gcc_-march=native_-mtune=native_-O2_-fwrapv_-fPIC_-fPIE_-gdwarf-4_-Wall2024071720240716
3386710284 320 020886 1132 888T:opt32clang_-march=native_-O_-fwrapv_-Qunused-arguments_-fPIC_-fPIE_-gdwarf-4_-Wall2024071720240716
3627810547 320 021247 1100 952T:opt32gcc_-march=native_-mtune=native_-O_-fwrapv_-fPIC_-fPIE_-gdwarf-4_-Wall2024071720240716
597722372 0 9613344 780 1048T:thomaz/basicgcc_-march=native_-mtune=native_-O2_-fwrapv_-fPIC_-fPIE_-gdwarf-4_-Wall2024071720240716
609333016 0 9615696 780 1048T:thomaz/basicgcc_-march=native_-mtune=native_-O3_-fwrapv_-fPIC_-fPIE_-gdwarf-4_-Wall2024071720240716
625713707 0 9616368 812 1016T:thomaz/basicclang_-march=native_-O3_-fwrapv_-Qunused-arguments_-fPIC_-fPIE_-gdwarf-4_-Wall2024071720240716
626323707 0 9616256 812 1016T:thomaz/basicclang_-march=native_-O2_-fwrapv_-Qunused-arguments_-fPIC_-fPIE_-gdwarf-4_-Wall2024071720240716
6435319524 320 031648 1140 920T:opt32clang_-march=native_-O3_-fwrapv_-Qunused-arguments_-fPIC_-fPIE_-gdwarf-4_-Wall2024071720240716
6449017732 320 030000 1140 920T:opt32clang_-march=native_-O2_-fwrapv_-Qunused-arguments_-fPIC_-fPIE_-gdwarf-4_-Wall2024071720240716
7344711712 320 021694 1132 888T:opt32clang_-march=native_-Os_-fwrapv_-Qunused-arguments_-fPIC_-fPIE_-gdwarf-4_-Wall2024071720240716
898761995 0 9612238 804 984T:thomaz/basicclang_-march=native_-Os_-fwrapv_-Qunused-arguments_-fPIC_-fPIE_-gdwarf-4_-Wall2024071720240716
905932139 0 9612710 804 984T:thomaz/basicclang_-march=native_-O_-fwrapv_-Qunused-arguments_-fPIC_-fPIE_-gdwarf-4_-Wall2024071720240716
931921651 0 9611323 756 1016T:thomaz/basicgcc_-march=native_-mtune=native_-Os_-fwrapv_-fPIC_-fPIE_-gdwarf-4_-Wall2024071720240716
939581857 0 9612495 772 1048T:thomaz/basicgcc_-march=native_-mtune=native_-O_-fwrapv_-fPIC_-fPIE_-gdwarf-4_-Wall2024071720240716

Compiler output


luffa.c: luffa.c:76:22: warning: unused variable 'RC00' [-Wunused-const-variable]
luffa.c: static const sph_u32 RC00[8] = {
luffa.c:                      ^
luffa.c: luffa.c:83:22: warning: unused variable 'RC04' [-Wunused-const-variable]
luffa.c: static const sph_u32 RC04[8] = {
luffa.c:                      ^
luffa.c: luffa.c:90:22: warning: unused variable 'RC10' [-Wunused-const-variable]
luffa.c: static const sph_u32 RC10[8] = {
luffa.c:                      ^
luffa.c: luffa.c:97:22: warning: unused variable 'RC14' [-Wunused-const-variable]
luffa.c: static const sph_u32 RC14[8] = {
luffa.c:                      ^
luffa.c: luffa.c:136:22: warning: unused variable 'RC30' [-Wunused-const-variable]
luffa.c: static const sph_u32 RC30[8] = {
luffa.c:                      ^
luffa.c: luffa.c:143:22: warning: unused variable 'RC34' [-Wunused-const-variable]
luffa.c: static const sph_u32 RC34[8] = {
luffa.c:                      ^
luffa.c: 6 warnings generated.

Number of similar (implementation,compiler) pairs: 5, namely:
ImplementationCompiler
T:sphlibclang -march=native -O2 -fwrapv -Qunused-arguments -fPIC -fPIE -gdwarf-4 -Wall (Debian_Clang_11.0.1)
T:sphlibclang -march=native -O3 -fwrapv -Qunused-arguments -fPIC -fPIE -gdwarf-4 -Wall (Debian_Clang_11.0.1)
T:sphlibclang -march=native -O -fwrapv -Qunused-arguments -fPIC -fPIE -gdwarf-4 -Wall (Debian_Clang_11.0.1)
T:sphlibclang -march=native -Os -fwrapv -Qunused-arguments -fPIC -fPIE -gdwarf-4 -Wall (Debian_Clang_11.0.1)
T:sphlibclang -mcpu=native -O3 -fwrapv -Qunused-arguments -fPIC -fPIE -gdwarf-4 -Wall (Debian_Clang_11.0.1)

Compiler output


luffa.c: luffa.c:143:22: warning: 'RC34' defined but not used [-Wunused-const-variable=]
luffa.c:   143 | static const sph_u32 RC34[8] = {
luffa.c:       |                      ^~~~
luffa.c: luffa.c:136:22: warning: 'RC30' defined but not used [-Wunused-const-variable=]
luffa.c:   136 | static const sph_u32 RC30[8] = {
luffa.c:       |                      ^~~~
luffa.c: luffa.c:97:22: warning: 'RC14' defined but not used [-Wunused-const-variable=]
luffa.c:    97 | static const sph_u32 RC14[8] = {
luffa.c:       |                      ^~~~
luffa.c: luffa.c:90:22: warning: 'RC10' defined but not used [-Wunused-const-variable=]
luffa.c:    90 | static const sph_u32 RC10[8] = {
luffa.c:       |                      ^~~~
luffa.c: luffa.c:83:22: warning: 'RC04' defined but not used [-Wunused-const-variable=]
luffa.c:    83 | static const sph_u32 RC04[8] = {
luffa.c:       |                      ^~~~
luffa.c: luffa.c:76:22: warning: 'RC00' defined but not used [-Wunused-const-variable=]
luffa.c:    76 | static const sph_u32 RC00[8] = {
luffa.c:       |                      ^~~~

Number of similar (implementation,compiler) pairs: 4, namely:
ImplementationCompiler
T:sphlibgcc -march=native -mtune=native -O2 -fwrapv -fPIC -fPIE -gdwarf-4 -Wall (10.2.1_20210110)
T:sphlibgcc -march=native -mtune=native -O3 -fwrapv -fPIC -fPIE -gdwarf-4 -Wall (10.2.1_20210110)
T:sphlibgcc -march=native -mtune=native -O -fwrapv -fPIC -fPIE -gdwarf-4 -Wall (10.2.1_20210110)
T:sphlibgcc -march=native -mtune=native -Os -fwrapv -fPIC -fPIE -gdwarf-4 -Wall (10.2.1_20210110)

Compiler output


luffa_x64asm.s: luffa_x64asm.s:780:13: error: unknown token in expression
luffa_x64asm.s:     movaps  %xmm0, [IV   ]
luffa_x64asm.s:             ^
luffa_x64asm.s: luffa_x64asm.s:781:13: error: unknown token in expression
luffa_x64asm.s:     movaps  %xmm1, [IV+16]
luffa_x64asm.s:             ^
luffa_x64asm.s: luffa_x64asm.s:782:13: error: unknown token in expression
luffa_x64asm.s:     movaps  %xmm2, [IV+32]
luffa_x64asm.s:             ^
luffa_x64asm.s: luffa_x64asm.s:783:13: error: unknown token in expression
luffa_x64asm.s:     movaps  %xmm3, [IV+48]
luffa_x64asm.s:             ^
luffa_x64asm.s: luffa_x64asm.s:784:13: error: unknown token in expression
luffa_x64asm.s:     movaps  %xmm4, [IV+64]
luffa_x64asm.s:             ^
luffa_x64asm.s: luffa_x64asm.s:785:13: error: unknown token in expression
luffa_x64asm.s:     movaps  %xmm5, [IV+80]
luffa_x64asm.s:             ^
luffa_x64asm.s: luffa_x64asm.s:786:14: error: unknown token in expression
luffa_x64asm.s:     movups  [%rdi   ], %xmm0
luffa_x64asm.s:              ^
luffa_x64asm.s: luffa_x64asm.s:787:14: error: unknown token in expression
luffa_x64asm.s:     movups  [%rdi+16], %xmm1
luffa_x64asm.s:              ^
luffa_x64asm.s: luffa_x64asm.s:788:14: error: unknown token in expression
luffa_x64asm.s: ...

Number of similar (implementation,compiler) pairs: 10, namely:
ImplementationCompiler
T:sse2_x64asmclang -march=native -O2 -fwrapv -Qunused-arguments -fPIC -fPIE -gdwarf-4 -Wall (Debian_Clang_11.0.1)
T:sse2_x64asmclang -march=native -O3 -fwrapv -Qunused-arguments -fPIC -fPIE -gdwarf-4 -Wall (Debian_Clang_11.0.1)
T:sse2_x64asmclang -march=native -O -fwrapv -Qunused-arguments -fPIC -fPIE -gdwarf-4 -Wall (Debian_Clang_11.0.1)
T:sse2_x64asmclang -march=native -Os -fwrapv -Qunused-arguments -fPIC -fPIE -gdwarf-4 -Wall (Debian_Clang_11.0.1)
T:sse2_x64asmclang -mcpu=native -O3 -fwrapv -Qunused-arguments -fPIC -fPIE -gdwarf-4 -Wall (Debian_Clang_11.0.1)
T:ssse3_x64asmclang -march=native -O2 -fwrapv -Qunused-arguments -fPIC -fPIE -gdwarf-4 -Wall (Debian_Clang_11.0.1)
T:ssse3_x64asmclang -march=native -O3 -fwrapv -Qunused-arguments -fPIC -fPIE -gdwarf-4 -Wall (Debian_Clang_11.0.1)
T:ssse3_x64asmclang -march=native -O -fwrapv -Qunused-arguments -fPIC -fPIE -gdwarf-4 -Wall (Debian_Clang_11.0.1)
T:ssse3_x64asmclang -march=native -Os -fwrapv -Qunused-arguments -fPIC -fPIE -gdwarf-4 -Wall (Debian_Clang_11.0.1)
T:ssse3_x64asmclang -mcpu=native -O3 -fwrapv -Qunused-arguments -fPIC -fPIE -gdwarf-4 -Wall (Debian_Clang_11.0.1)

Compiler output


try.c: /usr/bin/ld: libcrypto_hash_luffa256.a(luffa_x64asm.o): relocation R_X86_64_32S against symbol `IV' can not be used when making a PIE object; recompile with -fPIE
try.c: collect2: error: ld returned 1 exit status

Number of similar (implementation,compiler) pairs: 16, namely:
ImplementationCompiler
T:sse2_x64asmgcc -march=native -mtune=native -O2 -fwrapv -fPIC -fPIE -gdwarf-4 -Wall (10.2.1_20210110)
T:sse2_x64asmgcc -march=native -mtune=native -O3 -fwrapv -fPIC -fPIE -gdwarf-4 -Wall (10.2.1_20210110)
T:sse2_x64asmgcc -march=native -mtune=native -O -fwrapv -fPIC -fPIE -gdwarf-4 -Wall (10.2.1_20210110)
T:sse2_x64asmgcc -march=native -mtune=native -Os -fwrapv -fPIC -fPIE -gdwarf-4 -Wall (10.2.1_20210110)
T:sse2_x64asm-2gcc -march=native -mtune=native -O2 -fwrapv -fPIC -fPIE -gdwarf-4 -Wall (10.2.1_20210110)
T:sse2_x64asm-2gcc -march=native -mtune=native -O3 -fwrapv -fPIC -fPIE -gdwarf-4 -Wall (10.2.1_20210110)
T:sse2_x64asm-2gcc -march=native -mtune=native -O -fwrapv -fPIC -fPIE -gdwarf-4 -Wall (10.2.1_20210110)
T:sse2_x64asm-2gcc -march=native -mtune=native -Os -fwrapv -fPIC -fPIE -gdwarf-4 -Wall (10.2.1_20210110)
T:ssse3_x64asmgcc -march=native -mtune=native -O2 -fwrapv -fPIC -fPIE -gdwarf-4 -Wall (10.2.1_20210110)
T:ssse3_x64asmgcc -march=native -mtune=native -O3 -fwrapv -fPIC -fPIE -gdwarf-4 -Wall (10.2.1_20210110)
T:ssse3_x64asmgcc -march=native -mtune=native -O -fwrapv -fPIC -fPIE -gdwarf-4 -Wall (10.2.1_20210110)
T:ssse3_x64asmgcc -march=native -mtune=native -Os -fwrapv -fPIC -fPIE -gdwarf-4 -Wall (10.2.1_20210110)
T:ssse3_x64asm-2gcc -march=native -mtune=native -O2 -fwrapv -fPIC -fPIE -gdwarf-4 -Wall (10.2.1_20210110)
T:ssse3_x64asm-2gcc -march=native -mtune=native -O3 -fwrapv -fPIC -fPIE -gdwarf-4 -Wall (10.2.1_20210110)
T:ssse3_x64asm-2gcc -march=native -mtune=native -O -fwrapv -fPIC -fPIE -gdwarf-4 -Wall (10.2.1_20210110)
T:ssse3_x64asm-2gcc -march=native -mtune=native -Os -fwrapv -fPIC -fPIE -gdwarf-4 -Wall (10.2.1_20210110)

Compiler output


luffa_x64asm.s: luffa_x64asm.s:780:13: error: unknown token in expression
luffa_x64asm.s:     movdqa  %xmm0, [IV   ]
luffa_x64asm.s:             ^
luffa_x64asm.s: luffa_x64asm.s:781:13: error: unknown token in expression
luffa_x64asm.s:     movdqa  %xmm1, [IV+16]
luffa_x64asm.s:             ^
luffa_x64asm.s: luffa_x64asm.s:782:13: error: unknown token in expression
luffa_x64asm.s:     movdqa  %xmm2, [IV+32]
luffa_x64asm.s:             ^
luffa_x64asm.s: luffa_x64asm.s:783:13: error: unknown token in expression
luffa_x64asm.s:     movdqa  %xmm3, [IV+48]
luffa_x64asm.s:             ^
luffa_x64asm.s: luffa_x64asm.s:784:13: error: unknown token in expression
luffa_x64asm.s:     movdqa  %xmm4, [IV+64]
luffa_x64asm.s:             ^
luffa_x64asm.s: luffa_x64asm.s:785:13: error: unknown token in expression
luffa_x64asm.s:     movdqa  %xmm5, [IV+80]
luffa_x64asm.s:             ^
luffa_x64asm.s: luffa_x64asm.s:786:14: error: unknown token in expression
luffa_x64asm.s:     movups  [%rdi   ], %xmm0
luffa_x64asm.s:              ^
luffa_x64asm.s: luffa_x64asm.s:787:14: error: unknown token in expression
luffa_x64asm.s:     movups  [%rdi+16], %xmm1
luffa_x64asm.s:              ^
luffa_x64asm.s: luffa_x64asm.s:788:14: error: unknown token in expression
luffa_x64asm.s: ...

Number of similar (implementation,compiler) pairs: 10, namely:
ImplementationCompiler
T:sse2_x64asm-2clang -march=native -O2 -fwrapv -Qunused-arguments -fPIC -fPIE -gdwarf-4 -Wall (Debian_Clang_11.0.1)
T:sse2_x64asm-2clang -march=native -O3 -fwrapv -Qunused-arguments -fPIC -fPIE -gdwarf-4 -Wall (Debian_Clang_11.0.1)
T:sse2_x64asm-2clang -march=native -O -fwrapv -Qunused-arguments -fPIC -fPIE -gdwarf-4 -Wall (Debian_Clang_11.0.1)
T:sse2_x64asm-2clang -march=native -Os -fwrapv -Qunused-arguments -fPIC -fPIE -gdwarf-4 -Wall (Debian_Clang_11.0.1)
T:sse2_x64asm-2clang -mcpu=native -O3 -fwrapv -Qunused-arguments -fPIC -fPIE -gdwarf-4 -Wall (Debian_Clang_11.0.1)
T:ssse3_x64asm-2clang -march=native -O2 -fwrapv -Qunused-arguments -fPIC -fPIE -gdwarf-4 -Wall (Debian_Clang_11.0.1)
T:ssse3_x64asm-2clang -march=native -O3 -fwrapv -Qunused-arguments -fPIC -fPIE -gdwarf-4 -Wall (Debian_Clang_11.0.1)
T:ssse3_x64asm-2clang -march=native -O -fwrapv -Qunused-arguments -fPIC -fPIE -gdwarf-4 -Wall (Debian_Clang_11.0.1)
T:ssse3_x64asm-2clang -march=native -Os -fwrapv -Qunused-arguments -fPIC -fPIE -gdwarf-4 -Wall (Debian_Clang_11.0.1)
T:ssse3_x64asm-2clang -mcpu=native -O3 -fwrapv -Qunused-arguments -fPIC -fPIE -gdwarf-4 -Wall (Debian_Clang_11.0.1)

Compiler output


luffa256_x64asm.s: luffa256_x64asm.s:297:9: error: unknown token in expression
luffa256_x64asm.s:         movaps  %xmm0, [IV   ]
luffa256_x64asm.s:                 ^
luffa256_x64asm.s: luffa256_x64asm.s:298:9: error: unknown token in expression
luffa256_x64asm.s:         movaps  %xmm1, [IV+16]
luffa256_x64asm.s:                 ^
luffa256_x64asm.s: luffa256_x64asm.s:299:9: error: unknown token in expression
luffa256_x64asm.s:         movaps  %xmm2, [IV+32]
luffa256_x64asm.s:                 ^
luffa256_x64asm.s: luffa256_x64asm.s:300:9: error: unknown token in expression
luffa256_x64asm.s:         movaps  %xmm3, [IV+48]
luffa256_x64asm.s:                 ^
luffa256_x64asm.s: luffa256_x64asm.s:301:9: error: unknown token in expression
luffa256_x64asm.s:         movaps  %xmm4, [IV+64]
luffa256_x64asm.s:                 ^
luffa256_x64asm.s: luffa256_x64asm.s:302:9: error: unknown token in expression
luffa256_x64asm.s:         movaps  %xmm5, [IV+80]
luffa256_x64asm.s:                 ^
luffa256_x64asm.s: luffa256_x64asm.s:303:10: error: unknown token in expression
luffa256_x64asm.s:         movups  [%rdi   ], %xmm0
luffa256_x64asm.s:                  ^
luffa256_x64asm.s: luffa256_x64asm.s:304:10: error: unknown token in expression
luffa256_x64asm.s:         movups  [%rdi+16], %xmm1
luffa256_x64asm.s:                  ^
luffa256_x64asm.s: luffa256_x64asm.s:305:10: error: unknown token in expression
luffa256_x64asm.s: ...

Number of similar (implementation,compiler) pairs: 5, namely:
ImplementationCompiler
T:ssse3_x64asm-PSclang -march=native -O2 -fwrapv -Qunused-arguments -fPIC -fPIE -gdwarf-4 -Wall (Debian_Clang_11.0.1)
T:ssse3_x64asm-PSclang -march=native -O3 -fwrapv -Qunused-arguments -fPIC -fPIE -gdwarf-4 -Wall (Debian_Clang_11.0.1)
T:ssse3_x64asm-PSclang -march=native -O -fwrapv -Qunused-arguments -fPIC -fPIE -gdwarf-4 -Wall (Debian_Clang_11.0.1)
T:ssse3_x64asm-PSclang -march=native -Os -fwrapv -Qunused-arguments -fPIC -fPIE -gdwarf-4 -Wall (Debian_Clang_11.0.1)
T:ssse3_x64asm-PSclang -mcpu=native -O3 -fwrapv -Qunused-arguments -fPIC -fPIE -gdwarf-4 -Wall (Debian_Clang_11.0.1)

Compiler output


try.c: /usr/bin/ld: libcrypto_hash_luffa256.a(luffa256_x64asm.o): relocation R_X86_64_32S against `.rodata' can not be used when making a PIE object; recompile with -fPIE
try.c: /usr/bin/ld: libcrypto_hash_luffa256.a(luffa384_x64asm.o): relocation R_X86_64_32S against `.rodata' can not be used when making a PIE object; recompile with -fPIE
try.c: /usr/bin/ld: libcrypto_hash_luffa256.a(luffa512_x64asm.o): relocation R_X86_64_32S against `.rodata' can not be used when making a PIE object; recompile with -fPIE
try.c: collect2: error: ld returned 1 exit status

Number of similar (implementation,compiler) pairs: 8, namely:
ImplementationCompiler
T:ssse3_x64asm-PSgcc -march=native -mtune=native -O2 -fwrapv -fPIC -fPIE -gdwarf-4 -Wall (10.2.1_20210110)
T:ssse3_x64asm-PSgcc -march=native -mtune=native -O3 -fwrapv -fPIC -fPIE -gdwarf-4 -Wall (10.2.1_20210110)
T:ssse3_x64asm-PSgcc -march=native -mtune=native -O -fwrapv -fPIC -fPIE -gdwarf-4 -Wall (10.2.1_20210110)
T:ssse3_x64asm-PSgcc -march=native -mtune=native -Os -fwrapv -fPIC -fPIE -gdwarf-4 -Wall (10.2.1_20210110)
T:ssse3_x64asm-PS-2gcc -march=native -mtune=native -O2 -fwrapv -fPIC -fPIE -gdwarf-4 -Wall (10.2.1_20210110)
T:ssse3_x64asm-PS-2gcc -march=native -mtune=native -O3 -fwrapv -fPIC -fPIE -gdwarf-4 -Wall (10.2.1_20210110)
T:ssse3_x64asm-PS-2gcc -march=native -mtune=native -O -fwrapv -fPIC -fPIE -gdwarf-4 -Wall (10.2.1_20210110)
T:ssse3_x64asm-PS-2gcc -march=native -mtune=native -Os -fwrapv -fPIC -fPIE -gdwarf-4 -Wall (10.2.1_20210110)

Compiler output


luffa256_x64asm.s: luffa256_x64asm.s:297:9: error: unknown token in expression
luffa256_x64asm.s:         movdqa  %xmm0, [IV   ]
luffa256_x64asm.s:                 ^
luffa256_x64asm.s: luffa256_x64asm.s:298:9: error: unknown token in expression
luffa256_x64asm.s:         movdqa  %xmm1, [IV+16]
luffa256_x64asm.s:                 ^
luffa256_x64asm.s: luffa256_x64asm.s:299:9: error: unknown token in expression
luffa256_x64asm.s:         movdqa  %xmm2, [IV+32]
luffa256_x64asm.s:                 ^
luffa256_x64asm.s: luffa256_x64asm.s:300:9: error: unknown token in expression
luffa256_x64asm.s:         movdqa  %xmm3, [IV+48]
luffa256_x64asm.s:                 ^
luffa256_x64asm.s: luffa256_x64asm.s:301:9: error: unknown token in expression
luffa256_x64asm.s:         movdqa  %xmm4, [IV+64]
luffa256_x64asm.s:                 ^
luffa256_x64asm.s: luffa256_x64asm.s:302:9: error: unknown token in expression
luffa256_x64asm.s:         movdqa  %xmm5, [IV+80]
luffa256_x64asm.s:                 ^
luffa256_x64asm.s: luffa256_x64asm.s:303:10: error: unknown token in expression
luffa256_x64asm.s:         movdqu  [%rdi   ], %xmm0
luffa256_x64asm.s:                  ^
luffa256_x64asm.s: luffa256_x64asm.s:304:10: error: unknown token in expression
luffa256_x64asm.s:         movdqu  [%rdi+16], %xmm1
luffa256_x64asm.s:                  ^
luffa256_x64asm.s: luffa256_x64asm.s:305:10: error: unknown token in expression
luffa256_x64asm.s: ...

Number of similar (implementation,compiler) pairs: 5, namely:
ImplementationCompiler
T:ssse3_x64asm-PS-2clang -march=native -O2 -fwrapv -Qunused-arguments -fPIC -fPIE -gdwarf-4 -Wall (Debian_Clang_11.0.1)
T:ssse3_x64asm-PS-2clang -march=native -O3 -fwrapv -Qunused-arguments -fPIC -fPIE -gdwarf-4 -Wall (Debian_Clang_11.0.1)
T:ssse3_x64asm-PS-2clang -march=native -O -fwrapv -Qunused-arguments -fPIC -fPIE -gdwarf-4 -Wall (Debian_Clang_11.0.1)
T:ssse3_x64asm-PS-2clang -march=native -Os -fwrapv -Qunused-arguments -fPIC -fPIE -gdwarf-4 -Wall (Debian_Clang_11.0.1)
T:ssse3_x64asm-PS-2clang -mcpu=native -O3 -fwrapv -Qunused-arguments -fPIC -fPIE -gdwarf-4 -Wall (Debian_Clang_11.0.1)

Compiler output


hash.c: hash.c:32:12: warning: passing 'const unsigned char *' to parameter of type 'unsigned char *' discards qualifiers [-Wincompatible-pointer-types-discards-qualifiers]
hash.c:         fLuffa256(in, out, inlen);
hash.c:                   ^~
hash.c: hash.c:29:31: note: passing argument to parameter 'input' here
hash.c: void fLuffa256(unsigned char *input, unsigned char *output, int len);
hash.c:                               ^
hash.c: 1 warning generated.
luffa_256.s: <instantiation>:1:8: error: unknown token in expression
luffa_256.s: pshufb %xmm6, %xmm12
luffa_256.s:        ^
luffa_256.s: <instantiation>:1:1: note: while in macro instantiation
luffa_256.s: mPSSTEPI %xmm6, %xmm7, %xmm12
luffa_256.s: ^
luffa_256.s: luffa_256.s:232:2: note: while in macro instantiation
luffa_256.s:         mPS %xmm6, %xmm7, %xmm8, %xmm9, %xmm10, %xmm11
luffa_256.s:         ^
luffa_256.s: <instantiation>:2:9: error: unknown token in expression
luffa_256.s:         pshufb %xmm7, %xmm12
luffa_256.s:                ^
luffa_256.s: <instantiation>:1:1: note: while in macro instantiation
luffa_256.s: mPSSTEPI %xmm6, %xmm7, %xmm12
luffa_256.s: ^
luffa_256.s: luffa_256.s:232:2: note: while in macro instantiation
luffa_256.s:         mPS %xmm6, %xmm7, %xmm8, %xmm9, %xmm10, %xmm11
luffa_256.s:         ^
luffa_256.s: <instantiation>:1:8: error: unknown token in expression
luffa_256.s: movaps %xmm8, %xmm6
luffa_256.s:        ^
luffa_256.s: <instantiation>:2:2: note: while in macro instantiation
luffa_256.s:         mPSSTEPII %xmm6, %xmm7, %xmm8, %xmm9, %xmm10, %xmm11
luffa_256.s:         ^
luffa_256.s: luffa_256.s:232:2: note: while in macro instantiation
luffa_256.s: ...

Number of similar (implementation,compiler) pairs: 10, namely:
ImplementationCompiler
T:thomaz/asm-PSclang -march=native -O2 -fwrapv -Qunused-arguments -fPIC -fPIE -gdwarf-4 -Wall (Debian_Clang_11.0.1)
T:thomaz/asm-PSclang -march=native -O3 -fwrapv -Qunused-arguments -fPIC -fPIE -gdwarf-4 -Wall (Debian_Clang_11.0.1)
T:thomaz/asm-PSclang -march=native -O -fwrapv -Qunused-arguments -fPIC -fPIE -gdwarf-4 -Wall (Debian_Clang_11.0.1)
T:thomaz/asm-PSclang -march=native -Os -fwrapv -Qunused-arguments -fPIC -fPIE -gdwarf-4 -Wall (Debian_Clang_11.0.1)
T:thomaz/asm-PSclang -mcpu=native -O3 -fwrapv -Qunused-arguments -fPIC -fPIE -gdwarf-4 -Wall (Debian_Clang_11.0.1)
T:thomaz/asm-PS-v2-FPclang -march=native -O2 -fwrapv -Qunused-arguments -fPIC -fPIE -gdwarf-4 -Wall (Debian_Clang_11.0.1)
T:thomaz/asm-PS-v2-FPclang -march=native -O3 -fwrapv -Qunused-arguments -fPIC -fPIE -gdwarf-4 -Wall (Debian_Clang_11.0.1)
T:thomaz/asm-PS-v2-FPclang -march=native -O -fwrapv -Qunused-arguments -fPIC -fPIE -gdwarf-4 -Wall (Debian_Clang_11.0.1)
T:thomaz/asm-PS-v2-FPclang -march=native -Os -fwrapv -Qunused-arguments -fPIC -fPIE -gdwarf-4 -Wall (Debian_Clang_11.0.1)
T:thomaz/asm-PS-v2-FPclang -mcpu=native -O3 -fwrapv -Qunused-arguments -fPIC -fPIE -gdwarf-4 -Wall (Debian_Clang_11.0.1)

Compiler output


hash.c: hash.c: In function 'crypto_hash_luffa256_thomaz_asm_PS_timingleaks':
hash.c: hash.c:32:12: warning: passing argument 1 of 'fLuffa256' discards 'const' qualifier from pointer target type [-Wdiscarded-qualifiers]
hash.c:    32 |  fLuffa256(in, out, inlen);
hash.c:       |            ^~
hash.c: hash.c:29:31: note: expected 'unsigned char *' but argument is of type 'const unsigned char *'
hash.c:    29 | void fLuffa256(unsigned char *input, unsigned char *output, int len);
hash.c:       |                ~~~~~~~~~~~~~~~^~~~~
try.c: /usr/bin/ld: libcrypto_hash_luffa256.a(luffa_256.o): relocation R_X86_64_32S against `.rodata' can not be used when making a PIE object; recompile with -fPIE
try.c: collect2: error: ld returned 1 exit status

Number of similar (implementation,compiler) pairs: 4, namely:
ImplementationCompiler
T:thomaz/asm-PSgcc -march=native -mtune=native -O2 -fwrapv -fPIC -fPIE -gdwarf-4 -Wall (10.2.1_20210110)
T:thomaz/asm-PSgcc -march=native -mtune=native -O3 -fwrapv -fPIC -fPIE -gdwarf-4 -Wall (10.2.1_20210110)
T:thomaz/asm-PSgcc -march=native -mtune=native -O -fwrapv -fPIC -fPIE -gdwarf-4 -Wall (10.2.1_20210110)
T:thomaz/asm-PSgcc -march=native -mtune=native -Os -fwrapv -fPIC -fPIE -gdwarf-4 -Wall (10.2.1_20210110)

Compiler output


hash.c: hash.c: In function 'crypto_hash_luffa256_thomaz_asm_PS_v2_FP_timingleaks':
hash.c: hash.c:32:12: warning: passing argument 1 of 'fLuffa256' discards 'const' qualifier from pointer target type [-Wdiscarded-qualifiers]
hash.c:    32 |  fLuffa256(in, out, inlen);
hash.c:       |            ^~
hash.c: hash.c:29:31: note: expected 'unsigned char *' but argument is of type 'const unsigned char *'
hash.c:    29 | void fLuffa256(unsigned char *input, unsigned char *output, int len);
hash.c:       |                ~~~~~~~~~~~~~~~^~~~~
try.c: /usr/bin/ld: libcrypto_hash_luffa256.a(luffa_256.o): relocation R_X86_64_32S against `.rodata' can not be used when making a PIE object; recompile with -fPIE
try.c: collect2: error: ld returned 1 exit status

Number of similar (implementation,compiler) pairs: 4, namely:
ImplementationCompiler
T:thomaz/asm-PS-v2-FPgcc -march=native -mtune=native -O2 -fwrapv -fPIC -fPIE -gdwarf-4 -Wall (10.2.1_20210110)
T:thomaz/asm-PS-v2-FPgcc -march=native -mtune=native -O3 -fwrapv -fPIC -fPIE -gdwarf-4 -Wall (10.2.1_20210110)
T:thomaz/asm-PS-v2-FPgcc -march=native -mtune=native -O -fwrapv -fPIC -fPIE -gdwarf-4 -Wall (10.2.1_20210110)
T:thomaz/asm-PS-v2-FPgcc -march=native -mtune=native -Os -fwrapv -fPIC -fPIE -gdwarf-4 -Wall (10.2.1_20210110)

Compiler output


hash.c: hash.c:32:12: warning: passing 'const unsigned char *' to parameter of type 'unsigned char *' discards qualifiers [-Wincompatible-pointer-types-discards-qualifiers]
hash.c:         fLuffa256(in, out, inlen);
hash.c:                   ^~
hash.c: hash.c:29:31: note: passing argument to parameter 'input' here
hash.c: void fLuffa256(unsigned char *input, unsigned char *output, int len);
hash.c:                               ^
hash.c: 1 warning generated.
luffa_256.s: <instantiation>:1:8: error: unknown token in expression
luffa_256.s: pshufb %xmm6, %xmm12
luffa_256.s:        ^
luffa_256.s: <instantiation>:1:1: note: while in macro instantiation
luffa_256.s: mPSSTEPI %xmm6, %xmm7, %xmm12
luffa_256.s: ^
luffa_256.s: luffa_256.s:232:2: note: while in macro instantiation
luffa_256.s:         mPS %xmm6, %xmm7, %xmm8, %xmm9, %xmm10, %xmm11
luffa_256.s:         ^
luffa_256.s: <instantiation>:2:9: error: unknown token in expression
luffa_256.s:         pshufb %xmm7, %xmm12
luffa_256.s:                ^
luffa_256.s: <instantiation>:1:1: note: while in macro instantiation
luffa_256.s: mPSSTEPI %xmm6, %xmm7, %xmm12
luffa_256.s: ^
luffa_256.s: luffa_256.s:232:2: note: while in macro instantiation
luffa_256.s:         mPS %xmm6, %xmm7, %xmm8, %xmm9, %xmm10, %xmm11
luffa_256.s:         ^
luffa_256.s: <instantiation>:1:8: error: unknown token in expression
luffa_256.s: movdqa %xmm8, %xmm6
luffa_256.s:        ^
luffa_256.s: <instantiation>:2:2: note: while in macro instantiation
luffa_256.s:         mPSSTEPII %xmm6, %xmm7, %xmm8, %xmm9, %xmm10, %xmm11
luffa_256.s:         ^
luffa_256.s: luffa_256.s:232:2: note: while in macro instantiation
luffa_256.s: ...

Number of similar (implementation,compiler) pairs: 5, namely:
ImplementationCompiler
T:thomaz/asm-PS-v2-INTclang -march=native -O2 -fwrapv -Qunused-arguments -fPIC -fPIE -gdwarf-4 -Wall (Debian_Clang_11.0.1)
T:thomaz/asm-PS-v2-INTclang -march=native -O3 -fwrapv -Qunused-arguments -fPIC -fPIE -gdwarf-4 -Wall (Debian_Clang_11.0.1)
T:thomaz/asm-PS-v2-INTclang -march=native -O -fwrapv -Qunused-arguments -fPIC -fPIE -gdwarf-4 -Wall (Debian_Clang_11.0.1)
T:thomaz/asm-PS-v2-INTclang -march=native -Os -fwrapv -Qunused-arguments -fPIC -fPIE -gdwarf-4 -Wall (Debian_Clang_11.0.1)
T:thomaz/asm-PS-v2-INTclang -mcpu=native -O3 -fwrapv -Qunused-arguments -fPIC -fPIE -gdwarf-4 -Wall (Debian_Clang_11.0.1)

Compiler output


hash.c: hash.c: In function 'crypto_hash_luffa256_thomaz_asm_PS_v2_INT_timingleaks':
hash.c: hash.c:32:12: warning: passing argument 1 of 'fLuffa256' discards 'const' qualifier from pointer target type [-Wdiscarded-qualifiers]
hash.c:    32 |  fLuffa256(in, out, inlen);
hash.c:       |            ^~
hash.c: hash.c:29:31: note: expected 'unsigned char *' but argument is of type 'const unsigned char *'
hash.c:    29 | void fLuffa256(unsigned char *input, unsigned char *output, int len);
hash.c:       |                ~~~~~~~~~~~~~~~^~~~~
try.c: /usr/bin/ld: libcrypto_hash_luffa256.a(luffa_256.o): relocation R_X86_64_32S against `.rodata' can not be used when making a PIE object; recompile with -fPIE
try.c: collect2: error: ld returned 1 exit status

Number of similar (implementation,compiler) pairs: 4, namely:
ImplementationCompiler
T:thomaz/asm-PS-v2-INTgcc -march=native -mtune=native -O2 -fwrapv -fPIC -fPIE -gdwarf-4 -Wall (10.2.1_20210110)
T:thomaz/asm-PS-v2-INTgcc -march=native -mtune=native -O3 -fwrapv -fPIC -fPIE -gdwarf-4 -Wall (10.2.1_20210110)
T:thomaz/asm-PS-v2-INTgcc -march=native -mtune=native -O -fwrapv -fPIC -fPIE -gdwarf-4 -Wall (10.2.1_20210110)
T:thomaz/asm-PS-v2-INTgcc -march=native -mtune=native -Os -fwrapv -fPIC -fPIE -gdwarf-4 -Wall (10.2.1_20210110)

Compiler output


hash.c: hash.c:32:12: warning: passing 'const unsigned char *' to parameter of type 'unsigned char *' discards qualifiers [-Wincompatible-pointer-types-discards-qualifiers]
hash.c:         fLuffa256(in, out, inlen);
hash.c:                   ^~
hash.c: hash.c:29:31: note: passing argument to parameter 'input' here
hash.c: void fLuffa256(unsigned char *input, unsigned char *output, int len);
hash.c:                               ^
hash.c: 1 warning generated.
luffa256.s: <instantiation>:1:8: error: unknown token in expression
luffa256.s: pshufb %xmm6, maskShufLittleEndian
luffa256.s:        ^
luffa256.s: <instantiation>:1:1: note: while in macro instantiation
luffa256.s: mPSSTEPI %xmm6, %xmm7, maskShufLittleEndian
luffa256.s: ^
luffa256.s: luffa256.s:445:2: note: while in macro instantiation
luffa256.s:         mPS %xmm6, %xmm7, %xmm8, %xmm9, %xmm10, %xmm11
luffa256.s:         ^
luffa256.s: <instantiation>:2:9: error: unknown token in expression
luffa256.s:         pshufb %xmm7, maskShufLittleEndian
luffa256.s:                ^
luffa256.s: <instantiation>:1:1: note: while in macro instantiation
luffa256.s: mPSSTEPI %xmm6, %xmm7, maskShufLittleEndian
luffa256.s: ^
luffa256.s: luffa256.s:445:2: note: while in macro instantiation
luffa256.s:         mPS %xmm6, %xmm7, %xmm8, %xmm9, %xmm10, %xmm11
luffa256.s:         ^
luffa256.s: <instantiation>:1:8: error: unknown token in expression
luffa256.s: movaps %xmm8, %xmm6
luffa256.s:        ^
luffa256.s: <instantiation>:2:2: note: while in macro instantiation
luffa256.s:         mPSSTEPII %xmm6, %xmm7, %xmm8, %xmm9, %xmm10, %xmm11
luffa256.s:         ^
luffa256.s: luffa256.s:445:2: note: while in macro instantiation
luffa256.s: ...

Number of similar (implementation,compiler) pairs: 5, namely:
ImplementationCompiler
T:thomaz/asm-PSPar-v2-FPclang -march=native -O2 -fwrapv -Qunused-arguments -fPIC -fPIE -gdwarf-4 -Wall (Debian_Clang_11.0.1)
T:thomaz/asm-PSPar-v2-FPclang -march=native -O3 -fwrapv -Qunused-arguments -fPIC -fPIE -gdwarf-4 -Wall (Debian_Clang_11.0.1)
T:thomaz/asm-PSPar-v2-FPclang -march=native -O -fwrapv -Qunused-arguments -fPIC -fPIE -gdwarf-4 -Wall (Debian_Clang_11.0.1)
T:thomaz/asm-PSPar-v2-FPclang -march=native -Os -fwrapv -Qunused-arguments -fPIC -fPIE -gdwarf-4 -Wall (Debian_Clang_11.0.1)
T:thomaz/asm-PSPar-v2-FPclang -mcpu=native -O3 -fwrapv -Qunused-arguments -fPIC -fPIE -gdwarf-4 -Wall (Debian_Clang_11.0.1)

Compiler output


hash.c: hash.c: In function 'crypto_hash_luffa256_thomaz_asm_PSPar_v2_FP_timingleaks':
hash.c: hash.c:32:12: warning: passing argument 1 of 'fLuffa256' discards 'const' qualifier from pointer target type [-Wdiscarded-qualifiers]
hash.c:    32 |  fLuffa256(in, out, inlen);
hash.c:       |            ^~
hash.c: hash.c:29:31: note: expected 'unsigned char *' but argument is of type 'const unsigned char *'
hash.c:    29 | void fLuffa256(unsigned char *input, unsigned char *output, int len);
hash.c:       |                ~~~~~~~~~~~~~~~^~~~~
try.c: /usr/bin/ld: libcrypto_hash_luffa256.a(luffa256.o): relocation R_X86_64_32S against `.rodata' can not be used when making a PIE object; recompile with -fPIE
try.c: collect2: error: ld returned 1 exit status

Number of similar (implementation,compiler) pairs: 4, namely:
ImplementationCompiler
T:thomaz/asm-PSPar-v2-FPgcc -march=native -mtune=native -O2 -fwrapv -fPIC -fPIE -gdwarf-4 -Wall (10.2.1_20210110)
T:thomaz/asm-PSPar-v2-FPgcc -march=native -mtune=native -O3 -fwrapv -fPIC -fPIE -gdwarf-4 -Wall (10.2.1_20210110)
T:thomaz/asm-PSPar-v2-FPgcc -march=native -mtune=native -O -fwrapv -fPIC -fPIE -gdwarf-4 -Wall (10.2.1_20210110)
T:thomaz/asm-PSPar-v2-FPgcc -march=native -mtune=native -Os -fwrapv -fPIC -fPIE -gdwarf-4 -Wall (10.2.1_20210110)

Compiler output


hash.c: hash.c:32:12: warning: passing 'const unsigned char *' to parameter of type 'unsigned char *' discards qualifiers [-Wincompatible-pointer-types-discards-qualifiers]
hash.c:         fLuffa256(in, out, inlen);
hash.c:                   ^~
hash.c: hash.c:29:31: note: passing argument to parameter 'input' here
hash.c: void fLuffa256(unsigned char *input, unsigned char *output, int len);
hash.c:                               ^
hash.c: 1 warning generated.
luffa256.s: <instantiation>:1:8: error: unknown token in expression
luffa256.s: pshufb %xmm6, maskShufLittleEndian
luffa256.s:        ^
luffa256.s: <instantiation>:1:1: note: while in macro instantiation
luffa256.s: mPSSTEPI %xmm6, %xmm7, maskShufLittleEndian
luffa256.s: ^
luffa256.s: luffa256.s:445:2: note: while in macro instantiation
luffa256.s:         mPS %xmm6, %xmm7, %xmm8, %xmm9, %xmm10, %xmm11
luffa256.s:         ^
luffa256.s: <instantiation>:2:9: error: unknown token in expression
luffa256.s:         pshufb %xmm7, maskShufLittleEndian
luffa256.s:                ^
luffa256.s: <instantiation>:1:1: note: while in macro instantiation
luffa256.s: mPSSTEPI %xmm6, %xmm7, maskShufLittleEndian
luffa256.s: ^
luffa256.s: luffa256.s:445:2: note: while in macro instantiation
luffa256.s:         mPS %xmm6, %xmm7, %xmm8, %xmm9, %xmm10, %xmm11
luffa256.s:         ^
luffa256.s: <instantiation>:1:8: error: unknown token in expression
luffa256.s: movdqa %xmm8, %xmm6
luffa256.s:        ^
luffa256.s: <instantiation>:2:2: note: while in macro instantiation
luffa256.s:         mPSSTEPII %xmm6, %xmm7, %xmm8, %xmm9, %xmm10, %xmm11
luffa256.s:         ^
luffa256.s: luffa256.s:445:2: note: while in macro instantiation
luffa256.s: ...

Number of similar (implementation,compiler) pairs: 5, namely:
ImplementationCompiler
T:thomaz/asm-PSPar-v2-INTclang -march=native -O2 -fwrapv -Qunused-arguments -fPIC -fPIE -gdwarf-4 -Wall (Debian_Clang_11.0.1)
T:thomaz/asm-PSPar-v2-INTclang -march=native -O3 -fwrapv -Qunused-arguments -fPIC -fPIE -gdwarf-4 -Wall (Debian_Clang_11.0.1)
T:thomaz/asm-PSPar-v2-INTclang -march=native -O -fwrapv -Qunused-arguments -fPIC -fPIE -gdwarf-4 -Wall (Debian_Clang_11.0.1)
T:thomaz/asm-PSPar-v2-INTclang -march=native -Os -fwrapv -Qunused-arguments -fPIC -fPIE -gdwarf-4 -Wall (Debian_Clang_11.0.1)
T:thomaz/asm-PSPar-v2-INTclang -mcpu=native -O3 -fwrapv -Qunused-arguments -fPIC -fPIE -gdwarf-4 -Wall (Debian_Clang_11.0.1)

Compiler output


hash.c: hash.c: In function 'crypto_hash_luffa256_thomaz_asm_PSPar_v2_INT_timingleaks':
hash.c: hash.c:32:12: warning: passing argument 1 of 'fLuffa256' discards 'const' qualifier from pointer target type [-Wdiscarded-qualifiers]
hash.c:    32 |  fLuffa256(in, out, inlen);
hash.c:       |            ^~
hash.c: hash.c:29:31: note: expected 'unsigned char *' but argument is of type 'const unsigned char *'
hash.c:    29 | void fLuffa256(unsigned char *input, unsigned char *output, int len);
hash.c:       |                ~~~~~~~~~~~~~~~^~~~~
try.c: /usr/bin/ld: libcrypto_hash_luffa256.a(luffa256.o): relocation R_X86_64_32S against `.rodata' can not be used when making a PIE object; recompile with -fPIE
try.c: collect2: error: ld returned 1 exit status

Number of similar (implementation,compiler) pairs: 4, namely:
ImplementationCompiler
T:thomaz/asm-PSPar-v2-INTgcc -march=native -mtune=native -O2 -fwrapv -fPIC -fPIE -gdwarf-4 -Wall (10.2.1_20210110)
T:thomaz/asm-PSPar-v2-INTgcc -march=native -mtune=native -O3 -fwrapv -fPIC -fPIE -gdwarf-4 -Wall (10.2.1_20210110)
T:thomaz/asm-PSPar-v2-INTgcc -march=native -mtune=native -O -fwrapv -fPIC -fPIE -gdwarf-4 -Wall (10.2.1_20210110)
T:thomaz/asm-PSPar-v2-INTgcc -march=native -mtune=native -Os -fwrapv -fPIC -fPIE -gdwarf-4 -Wall (10.2.1_20210110)

Namespace violations


luffa_for_32.o CNS D
luffa_for_32.o Final T
luffa_for_32.o Hash T
luffa_for_32.o IV R
luffa_for_32.o Init T
luffa_for_32.o Update T
luffa_for_32.o Update256 T
luffa_for_32.o Update384 T
luffa_for_32.o Update512 T
luffa_for_32.o finalization224 T
luffa_for_32.o finalization256 T
luffa_for_32.o finalization384 T
luffa_for_32.o finalization512 T
luffa_for_32.o process_last_msgs256 T
luffa_for_32.o process_last_msgs384 T
luffa_for_32.o process_last_msgs512 T
luffa_for_32.o rnd256 T
luffa_for_32.o rnd384 T
luffa_for_32.o rnd512 T

Number of similar (implementation,compiler) pairs: 9, namely:
ImplementationCompiler
T:opt32clang -march=native -O2 -fwrapv -Qunused-arguments -fPIC -fPIE -gdwarf-4 -Wall (Debian_Clang_11.0.1)
T:opt32clang -march=native -O3 -fwrapv -Qunused-arguments -fPIC -fPIE -gdwarf-4 -Wall (Debian_Clang_11.0.1)
T:opt32clang -march=native -O -fwrapv -Qunused-arguments -fPIC -fPIE -gdwarf-4 -Wall (Debian_Clang_11.0.1)
T:opt32clang -march=native -Os -fwrapv -Qunused-arguments -fPIC -fPIE -gdwarf-4 -Wall (Debian_Clang_11.0.1)
T:opt32clang -mcpu=native -O3 -fwrapv -Qunused-arguments -fPIC -fPIE -gdwarf-4 -Wall (Debian_Clang_11.0.1)
T:opt32gcc -march=native -mtune=native -O2 -fwrapv -fPIC -fPIE -gdwarf-4 -Wall (10.2.1_20210110)
T:opt32gcc -march=native -mtune=native -O3 -fwrapv -fPIC -fPIE -gdwarf-4 -Wall (10.2.1_20210110)
T:opt32gcc -march=native -mtune=native -O -fwrapv -fPIC -fPIE -gdwarf-4 -Wall (10.2.1_20210110)
T:opt32gcc -march=native -mtune=native -Os -fwrapv -fPIC -fPIE -gdwarf-4 -Wall (10.2.1_20210110)

Namespace violations


luffa.o sph_luffa224 T
luffa.o sph_luffa224_addbits_and_close T
luffa.o sph_luffa224_close T
luffa.o sph_luffa224_init T
luffa.o sph_luffa256 T
luffa.o sph_luffa256_addbits_and_close T
luffa.o sph_luffa256_close T
luffa.o sph_luffa256_init T
luffa.o sph_luffa384 T
luffa.o sph_luffa384_addbits_and_close T
luffa.o sph_luffa384_close T
luffa.o sph_luffa384_init T
luffa.o sph_luffa512 T
luffa.o sph_luffa512_addbits_and_close T
luffa.o sph_luffa512_close T
luffa.o sph_luffa512_init T

Number of similar (implementation,compiler) pairs: 9, namely:
ImplementationCompiler
T:sphlibclang -march=native -O2 -fwrapv -Qunused-arguments -fPIC -fPIE -gdwarf-4 -Wall (Debian_Clang_11.0.1)
T:sphlibclang -march=native -O3 -fwrapv -Qunused-arguments -fPIC -fPIE -gdwarf-4 -Wall (Debian_Clang_11.0.1)
T:sphlibclang -march=native -O -fwrapv -Qunused-arguments -fPIC -fPIE -gdwarf-4 -Wall (Debian_Clang_11.0.1)
T:sphlibclang -march=native -Os -fwrapv -Qunused-arguments -fPIC -fPIE -gdwarf-4 -Wall (Debian_Clang_11.0.1)
T:sphlibclang -mcpu=native -O3 -fwrapv -Qunused-arguments -fPIC -fPIE -gdwarf-4 -Wall (Debian_Clang_11.0.1)
T:sphlibgcc -march=native -mtune=native -O2 -fwrapv -fPIC -fPIE -gdwarf-4 -Wall (10.2.1_20210110)
T:sphlibgcc -march=native -mtune=native -O3 -fwrapv -fPIC -fPIE -gdwarf-4 -Wall (10.2.1_20210110)
T:sphlibgcc -march=native -mtune=native -O -fwrapv -fPIC -fPIE -gdwarf-4 -Wall (10.2.1_20210110)
T:sphlibgcc -march=native -mtune=native -Os -fwrapv -fPIC -fPIE -gdwarf-4 -Wall (10.2.1_20210110)

Namespace violations


luffa_for_sse2.o ALLONE B
luffa_for_sse2.o CNS128 B
luffa_for_sse2.o Final T
luffa_for_sse2.o Hash T
luffa_for_sse2.o Init T
luffa_for_sse2.o MASK B
luffa_for_sse2.o Update T

Number of similar (implementation,compiler) pairs: 9, namely:
ImplementationCompiler
T:sse2clang -march=native -O2 -fwrapv -Qunused-arguments -fPIC -fPIE -gdwarf-4 -Wall (Debian_Clang_11.0.1)
T:sse2clang -march=native -O3 -fwrapv -Qunused-arguments -fPIC -fPIE -gdwarf-4 -Wall (Debian_Clang_11.0.1)
T:sse2clang -march=native -O -fwrapv -Qunused-arguments -fPIC -fPIE -gdwarf-4 -Wall (Debian_Clang_11.0.1)
T:sse2clang -march=native -Os -fwrapv -Qunused-arguments -fPIC -fPIE -gdwarf-4 -Wall (Debian_Clang_11.0.1)
T:sse2clang -mcpu=native -O3 -fwrapv -Qunused-arguments -fPIC -fPIE -gdwarf-4 -Wall (Debian_Clang_11.0.1)
T:sse2gcc -march=native -mtune=native -O2 -fwrapv -fPIC -fPIE -gdwarf-4 -Wall (10.2.1_20210110)
T:sse2gcc -march=native -mtune=native -O3 -fwrapv -fPIC -fPIE -gdwarf-4 -Wall (10.2.1_20210110)
T:sse2gcc -march=native -mtune=native -O -fwrapv -fPIC -fPIE -gdwarf-4 -Wall (10.2.1_20210110)
T:sse2gcc -march=native -mtune=native -Os -fwrapv -fPIC -fPIE -gdwarf-4 -Wall (10.2.1_20210110)