Implementation notes: amd64, lucienne, crypto_hash/echo512

Computer: lucienne
Microarchitecture: amd64; Zen 2 (860f81)
Architecture: amd64
CPU ID: AuthenticAMD-00860f81-178bfbff
SUPERCOP version: 20240625
Operation: crypto_hash
Primitive: echo512
TimeObject sizeTest sizeImplementationCompilerBenchmark dateSUPERCOP version
6982415971 0 028592 812 920T:ccalik/bitslicedclang_-march=native_-O2_-fwrapv_-Qunused-arguments_-fPIC_-fPIE_-gdwarf-4_-Wall2024062620240625
7050116459 0 029144 812 920T:ccalik/bitslicedclang_-march=native_-O3_-fwrapv_-Qunused-arguments_-fPIC_-fPIE_-gdwarf-4_-Wall2024062620240625
7074724862 0 037672 780 952T:ccalik/aesnigcc_-march=native_-mtune=native_-O3_-fwrapv_-fPIC_-fPIE_-gdwarf-4_-Wall2024062620240625
7077524862 0 037672 780 952T:ccalik/vpermgcc_-march=native_-mtune=native_-O3_-fwrapv_-fPIC_-fPIE_-gdwarf-4_-Wall2024062620240625
7105920537 0 031224 780 952T:ccalik/aesnigcc_-march=native_-mtune=native_-O_-fwrapv_-fPIC_-fPIE_-gdwarf-4_-Wall2024062620240625
7142624051 0 036672 812 920T:ccalik/vpermclang_-march=native_-O2_-fwrapv_-Qunused-arguments_-fPIC_-fPIE_-gdwarf-4_-Wall2024062620240625
7142820537 0 031224 780 952T:ccalik/vpermgcc_-march=native_-mtune=native_-O_-fwrapv_-fPIC_-fPIE_-gdwarf-4_-Wall2024062620240625
7148224051 0 036672 812 920T:ccalik/aesniclang_-march=native_-O2_-fwrapv_-Qunused-arguments_-fPIC_-fPIE_-gdwarf-4_-Wall2024062620240625
7175219581 0 029235 756 920T:ccalik/aesnigcc_-march=native_-mtune=native_-Os_-fwrapv_-fPIC_-fPIE_-gdwarf-4_-Wall2024062620240625
7175617806 0 030616 780 952T:ccalik/bitslicedgcc_-march=native_-mtune=native_-O3_-fwrapv_-fPIC_-fPIE_-gdwarf-4_-Wall2024062620240625
7188519581 0 029235 756 920T:ccalik/vpermgcc_-march=native_-mtune=native_-Os_-fwrapv_-fPIC_-fPIE_-gdwarf-4_-Wall2024062620240625
7227120380 0 031480 780 952T:ccalik/aesnigcc_-march=native_-mtune=native_-O2_-fwrapv_-fPIC_-fPIE_-gdwarf-4_-Wall2024062620240625
7227620380 0 031480 780 952T:ccalik/vpermgcc_-march=native_-mtune=native_-O2_-fwrapv_-fPIC_-fPIE_-gdwarf-4_-Wall2024062620240625
7237229019 0 041728 812 920T:sphlibclang_-march=native_-O2_-fwrapv_-Qunused-arguments_-fPIC_-fPIE_-gdwarf-4_-Wall2024062620240625
7280715246 0 025928 780 952T:ccalik/bitslicedgcc_-march=native_-mtune=native_-O_-fwrapv_-fPIC_-fPIE_-gdwarf-4_-Wall2024062620240625
7321529169 0 042000 812 920T:sphlibclang_-march=native_-O3_-fwrapv_-Qunused-arguments_-fPIC_-fPIE_-gdwarf-4_-Wall2024062620240625
7329414808 0 025126 804 888T:ccalik/bitslicedclang_-march=native_-Os_-fwrapv_-Qunused-arguments_-fPIC_-fPIE_-gdwarf-4_-Wall2024062620240625
7360324803 0 037488 812 920T:ccalik/aesniclang_-march=native_-O3_-fwrapv_-Qunused-arguments_-fPIC_-fPIE_-gdwarf-4_-Wall2024062620240625
7368513061 0 026016 780 952T:sphlib-smallgcc_-march=native_-mtune=native_-O3_-fwrapv_-fPIC_-fPIE_-gdwarf-4_-Wall2024062620240625
7373824803 0 037488 812 920T:ccalik/vpermclang_-march=native_-O3_-fwrapv_-Qunused-arguments_-fPIC_-fPIE_-gdwarf-4_-Wall2024062620240625
7425522509 0 033078 804 888T:ccalik/vpermclang_-march=native_-O_-fwrapv_-Qunused-arguments_-fPIC_-fPIE_-gdwarf-4_-Wall2024062620240625
7430222509 0 033078 804 888T:ccalik/aesniclang_-march=native_-O_-fwrapv_-Qunused-arguments_-fPIC_-fPIE_-gdwarf-4_-Wall2024062620240625
7573916028 0 027128 780 952T:ccalik/bitslicedgcc_-march=native_-mtune=native_-O2_-fwrapv_-fPIC_-fPIE_-gdwarf-4_-Wall2024062620240625
7695222833 0 033142 804 888T:ccalik/vpermclang_-march=native_-Os_-fwrapv_-Qunused-arguments_-fPIC_-fPIE_-gdwarf-4_-Wall2024062620240625
7703622833 0 033142 804 888T:ccalik/aesniclang_-march=native_-Os_-fwrapv_-Qunused-arguments_-fPIC_-fPIE_-gdwarf-4_-Wall2024062620240625
7707528629 0 039350 804 888T:sphlibclang_-march=native_-O_-fwrapv_-Qunused-arguments_-fPIC_-fPIE_-gdwarf-4_-Wall2024062620240625
7744512328 0 025072 812 920T:sphlib-smallclang_-march=native_-O2_-fwrapv_-Qunused-arguments_-fPIC_-fPIE_-gdwarf-4_-Wall2024062620240625
7757312621 0 025488 812 920T:sphlib-smallclang_-march=native_-O3_-fwrapv_-Qunused-arguments_-fPIC_-fPIE_-gdwarf-4_-Wall2024062620240625
7772328807 0 040032 780 952T:sphlibgcc_-march=native_-mtune=native_-O2_-fwrapv_-fPIC_-fPIE_-gdwarf-4_-Wall2024062620240625
7811227148 0 037534 804 888T:sphlibclang_-march=native_-Os_-fwrapv_-Qunused-arguments_-fPIC_-fPIE_-gdwarf-4_-Wall2024062620240625
7822930797 0 043712 780 952T:sphlibgcc_-march=native_-mtune=native_-O3_-fwrapv_-fPIC_-fPIE_-gdwarf-4_-Wall2024062620240625
7871026880 0 036651 756 920T:sphlibgcc_-march=native_-mtune=native_-Os_-fwrapv_-fPIC_-fPIE_-gdwarf-4_-Wall2024062620240625
7911628643 0 041592 812 888T:sphlibclang_-mcpu=native_-O3_-fwrapv_-Qunused-arguments_-fPIC_-fPIE_-gdwarf-4_-Wall2024062620240625
8034920879 0 130555 756 952T:generic/opt64gcc_-march=native_-mtune=native_-Os_-fwrapv_-fPIC_-fPIE_-gdwarf-4_-Wall2024062620240625
8126216413 0 026982 804 888T:ccalik/bitslicedclang_-march=native_-O_-fwrapv_-Qunused-arguments_-fPIC_-fPIE_-gdwarf-4_-Wall2024062620240625
8220019120 0 1631784 812 920T:generic/opt32clang_-march=native_-O2_-fwrapv_-Qunused-arguments_-fPIC_-fPIE_-gdwarf-4_-Wall2024062620240625
8246529086 0 039904 780 952T:sphlibgcc_-march=native_-mtune=native_-O_-fwrapv_-fPIC_-fPIE_-gdwarf-4_-Wall2024062620240625
8295122547 0 132702 804 888T:generic/opt64clang_-march=native_-Os_-fwrapv_-Qunused-arguments_-fPIC_-fPIE_-gdwarf-4_-Wall2024062620240625
8356520948 0 132080 780 984T:generic/opt64gcc_-march=native_-mtune=native_-O2_-fwrapv_-fPIC_-fPIE_-gdwarf-4_-Wall2024062620240625
8454220759 0 131472 780 984T:generic/opt64gcc_-march=native_-mtune=native_-O_-fwrapv_-fPIC_-fPIE_-gdwarf-4_-Wall2024062620240625
8467710463 0 021704 780 952T:sphlib-smallgcc_-march=native_-mtune=native_-O2_-fwrapv_-fPIC_-fPIE_-gdwarf-4_-Wall2024062620240625
8488819177 0 1631960 812 920T:generic/opt32clang_-march=native_-O3_-fwrapv_-Qunused-arguments_-fPIC_-fPIE_-gdwarf-4_-Wall2024062620240625
8516015685 0 025331 756 920T:ccalik/bitslicedgcc_-march=native_-mtune=native_-Os_-fwrapv_-fPIC_-fPIE_-gdwarf-4_-Wall2024062620240625
8579810238 0 021064 780 952T:sphlib-smallgcc_-march=native_-mtune=native_-O_-fwrapv_-fPIC_-fPIE_-gdwarf-4_-Wall2024062620240625
8621913261 0 026248 812 888T:sphlib-smallclang_-mcpu=native_-O3_-fwrapv_-Qunused-arguments_-fPIC_-fPIE_-gdwarf-4_-Wall2024062620240625
8707916832 0 1627422 804 920T:generic/opt32clang_-march=native_-O_-fwrapv_-Qunused-arguments_-fPIC_-fPIE_-gdwarf-4_-Wall2024062620240625
872378997 0 019446 804 888T:sphlib-smallclang_-march=native_-Os_-fwrapv_-Qunused-arguments_-fPIC_-fPIE_-gdwarf-4_-Wall2024062620240625
8834822484 0 135312 780 984T:generic/opt64gcc_-march=native_-mtune=native_-O3_-fwrapv_-fPIC_-fPIE_-gdwarf-4_-Wall2024062620240625
886179344 0 019131 756 920T:sphlib-smallgcc_-march=native_-mtune=native_-Os_-fwrapv_-fPIC_-fPIE_-gdwarf-4_-Wall2024062620240625
894489641 0 020382 804 888T:sphlib-smallclang_-march=native_-O_-fwrapv_-Qunused-arguments_-fPIC_-fPIE_-gdwarf-4_-Wall2024062620240625
8996222127 0 1635016 812 920T:generic/opt32clang_-mcpu=native_-O3_-fwrapv_-Qunused-arguments_-fPIC_-fPIE_-gdwarf-4_-Wall2024062620240625
9208317758 0 1627451 756 952T:generic/opt32gcc_-march=native_-mtune=native_-Os_-fwrapv_-fPIC_-fPIE_-gdwarf-4_-Wall2024062620240625
9387421124 0 1633968 780 984T:generic/opt32gcc_-march=native_-mtune=native_-O3_-fwrapv_-fPIC_-fPIE_-gdwarf-4_-Wall2024062620240625
9701118782 0 1629504 780 984T:generic/opt32gcc_-march=native_-mtune=native_-O_-fwrapv_-fPIC_-fPIE_-gdwarf-4_-Wall2024062620240625
9803220007 0 1630054 804 920T:generic/opt32clang_-march=native_-Os_-fwrapv_-Qunused-arguments_-fPIC_-fPIE_-gdwarf-4_-Wall2024062620240625
9806027040 0 139928 812 888T:generic/opt64clang_-mcpu=native_-O3_-fwrapv_-Qunused-arguments_-fPIC_-fPIE_-gdwarf-4_-Wall2024062620240625
9833819412 0 1630560 780 984T:generic/opt32gcc_-march=native_-mtune=native_-O2_-fwrapv_-fPIC_-fPIE_-gdwarf-4_-Wall2024062620240625
9900023736 0 134318 804 888T:generic/opt64clang_-march=native_-O_-fwrapv_-Qunused-arguments_-fPIC_-fPIE_-gdwarf-4_-Wall2024062620240625
11117426041 0 1638824 812 920T:powerpc/pp32cv2clang_-march=native_-O3_-fwrapv_-Qunused-arguments_-fPIC_-fPIE_-gdwarf-4_-Wall2024062620240625
11125926016 0 1638680 812 920T:powerpc/pp32cv2clang_-march=native_-O2_-fwrapv_-Qunused-arguments_-fPIC_-fPIE_-gdwarf-4_-Wall2024062620240625
11273728639 0 1641528 812 920T:powerpc/pp32cv2clang_-mcpu=native_-O3_-fwrapv_-Qunused-arguments_-fPIC_-fPIE_-gdwarf-4_-Wall2024062620240625
11274622568 0 135304 812 920T:generic/opt64clang_-march=native_-O3_-fwrapv_-Qunused-arguments_-fPIC_-fPIE_-gdwarf-4_-Wall2024062620240625
11281922624 0 135296 812 920T:generic/opt64clang_-march=native_-O2_-fwrapv_-Qunused-arguments_-fPIC_-fPIE_-gdwarf-4_-Wall2024062620240625
12618725632 0 1635670 804 920T:powerpc/pp32cv2clang_-march=native_-Os_-fwrapv_-Qunused-arguments_-fPIC_-fPIE_-gdwarf-4_-Wall2024062620240625
13244023936 0 1634526 804 920T:powerpc/pp32cv2clang_-march=native_-O_-fwrapv_-Qunused-arguments_-fPIC_-fPIE_-gdwarf-4_-Wall2024062620240625
13438918944 0 1631608 812 920T:powerpc/pp32cv1clang_-march=native_-O2_-fwrapv_-Qunused-arguments_-fPIC_-fPIE_-gdwarf-4_-Wall2024062620240625
13441918969 0 1631752 812 920T:powerpc/pp32cv1clang_-march=native_-O3_-fwrapv_-Qunused-arguments_-fPIC_-fPIE_-gdwarf-4_-Wall2024062620240625
13695221455 0 1634344 812 920T:powerpc/pp32cv1clang_-mcpu=native_-O3_-fwrapv_-Qunused-arguments_-fPIC_-fPIE_-gdwarf-4_-Wall2024062620240625
13730025732 0 1635419 756 952T:powerpc/pp32cv2gcc_-march=native_-mtune=native_-Os_-fwrapv_-fPIC_-fPIE_-gdwarf-4_-Wall2024062620240625
14558228612 0 1639760 780 984T:powerpc/pp32cv2gcc_-march=native_-mtune=native_-O2_-fwrapv_-fPIC_-fPIE_-gdwarf-4_-Wall2024062620240625
14572219588 0 1632432 780 984T:powerpc/pp32cv1gcc_-march=native_-mtune=native_-O3_-fwrapv_-fPIC_-fPIE_-gdwarf-4_-Wall2024062620240625
14687731732 0 1644576 780 984T:powerpc/pp32cv2gcc_-march=native_-mtune=native_-O3_-fwrapv_-fPIC_-fPIE_-gdwarf-4_-Wall2024062620240625
14896327066 0 1637792 780 984T:powerpc/pp32cv2gcc_-march=native_-mtune=native_-O_-fwrapv_-fPIC_-fPIE_-gdwarf-4_-Wall2024062620240625
15003417988 0 1629136 780 984T:powerpc/pp32cv1gcc_-march=native_-mtune=native_-O2_-fwrapv_-fPIC_-fPIE_-gdwarf-4_-Wall2024062620240625
15460719166 0 1629206 804 920T:powerpc/pp32cv1clang_-march=native_-Os_-fwrapv_-Qunused-arguments_-fPIC_-fPIE_-gdwarf-4_-Wall2024062620240625
15857317458 0 1628192 780 984T:powerpc/pp32cv1gcc_-march=native_-mtune=native_-O_-fwrapv_-fPIC_-fPIE_-gdwarf-4_-Wall2024062620240625
16155216575 0 1626267 756 952T:powerpc/pp32cv1gcc_-march=native_-mtune=native_-Os_-fwrapv_-fPIC_-fPIE_-gdwarf-4_-Wall2024062620240625
16347117248 0 1627838 804 920T:powerpc/pp32cv1clang_-march=native_-O_-fwrapv_-Qunused-arguments_-fPIC_-fPIE_-gdwarf-4_-Wall2024062620240625

Compiler output


echo64.S: echo64.S:1064:2: error: '.att_syntax noprefix' is not supported: registers must have a '%' prefix in .att_syntax
echo64.S:  .att_syntax noprefix
echo64.S:  ^
echo64.S: echo64.S:1077:10: error: unknown token in expression
echo64.S:  movabsq $-9187201950435737472, %rax
echo64.S:          ^
echo64.S: echo64.S:1078:10: error: unknown token in expression
echo64.S:  movabsq $-9187201950435737472, %r11
echo64.S:          ^
echo64.S: echo64.S:1079:10: error: unknown token in expression
echo64.S:  movabsq $7599940337074203, %r10
echo64.S:          ^
echo64.S: echo64.S:1080:7: error: unknown token in expression
echo64.S:  movq %rax, MEM_CST+16(%rip)
echo64.S:       ^
echo64.S: echo64.S:1081:10: error: unknown token in expression
echo64.S:  movabsq $7599940337074203, %r9
echo64.S:          ^
echo64.S: echo64.S:1082:10: error: unknown token in expression
echo64.S:  movabsq $-72340172838076674, %rax
echo64.S:          ^
echo64.S: echo64.S:1083:10: error: unknown token in expression
echo64.S:  movabsq $72340172838076673, %r8
echo64.S:          ^
echo64.S: echo64.S:1084:10: error: unknown token in expression
echo64.S: ...

Number of similar (implementation,compiler) pairs: 5, namely:
ImplementationCompiler
T:aes/aes64clang -march=native -O2 -fwrapv -Qunused-arguments -fPIC -fPIE -gdwarf-4 -Wall (Debian_Clang_11.0.1)
T:aes/aes64clang -march=native -O3 -fwrapv -Qunused-arguments -fPIC -fPIE -gdwarf-4 -Wall (Debian_Clang_11.0.1)
T:aes/aes64clang -march=native -O -fwrapv -Qunused-arguments -fPIC -fPIE -gdwarf-4 -Wall (Debian_Clang_11.0.1)
T:aes/aes64clang -march=native -Os -fwrapv -Qunused-arguments -fPIC -fPIE -gdwarf-4 -Wall (Debian_Clang_11.0.1)
T:aes/aes64clang -mcpu=native -O3 -fwrapv -Qunused-arguments -fPIC -fPIE -gdwarf-4 -Wall (Debian_Clang_11.0.1)

Compiler output


try.c: /usr/bin/ld: libcrypto_hash_echo512.a(echo64.o): relocation R_X86_64_32S against symbol `OLDCV' can not be used when making a PIE object; recompile with -fPIE
try.c: collect2: error: ld returned 1 exit status

Number of similar (implementation,compiler) pairs: 4, namely:
ImplementationCompiler
T:aes/aes64gcc -march=native -mtune=native -O2 -fwrapv -fPIC -fPIE -gdwarf-4 -Wall (10.2.1_20210110)
T:aes/aes64gcc -march=native -mtune=native -O3 -fwrapv -fPIC -fPIE -gdwarf-4 -Wall (10.2.1_20210110)
T:aes/aes64gcc -march=native -mtune=native -O -fwrapv -fPIC -fPIE -gdwarf-4 -Wall (10.2.1_20210110)
T:aes/aes64gcc -march=native -mtune=native -Os -fwrapv -fPIC -fPIE -gdwarf-4 -Wall (10.2.1_20210110)

Compiler output


echo64.S: echo64.S:248:2: error: invalid instruction mnemonic 'movzbl'
echo64.S:  movzbl ebp, ah
echo64.S:  ^~~~~~
echo64.S: echo64.S:251:2: error: invalid instruction mnemonic 'movzbl'
echo64.S:  movzbl esi, al
echo64.S:  ^~~~~~
echo64.S: echo64.S:263:2: error: invalid instruction mnemonic 'movzbl'
echo64.S:  movzbl ebp, bl
echo64.S:  ^~~~~~
echo64.S: echo64.S:266:2: error: invalid instruction mnemonic 'movzbl'
echo64.S:  movzbl esi, bh
echo64.S:  ^~~~~~
echo64.S: echo64.S:278:2: error: invalid instruction mnemonic 'movzbl'
echo64.S:  movzbl ebp, al
echo64.S:  ^~~~~~
echo64.S: echo64.S:281:2: error: invalid instruction mnemonic 'movzbl'
echo64.S:  movzbl esi, ah
echo64.S:  ^~~~~~
echo64.S: echo64.S:293:2: error: invalid instruction mnemonic 'movzbl'
echo64.S:  movzbl ebp, bh
echo64.S:  ^~~~~~
echo64.S: echo64.S:296:2: error: invalid instruction mnemonic 'movzbl'
echo64.S:  movzbl esi, bl
echo64.S:  ^~~~~~
echo64.S: echo64.S:308:2: error: invalid instruction mnemonic 'movzbl'
echo64.S: ...

Number of similar (implementation,compiler) pairs: 5, namely:
ImplementationCompiler
T:athlon/athlon64clang -march=native -O2 -fwrapv -Qunused-arguments -fPIC -fPIE -gdwarf-4 -Wall (Debian_Clang_11.0.1)
T:athlon/athlon64clang -march=native -O3 -fwrapv -Qunused-arguments -fPIC -fPIE -gdwarf-4 -Wall (Debian_Clang_11.0.1)
T:athlon/athlon64clang -march=native -O -fwrapv -Qunused-arguments -fPIC -fPIE -gdwarf-4 -Wall (Debian_Clang_11.0.1)
T:athlon/athlon64clang -march=native -Os -fwrapv -Qunused-arguments -fPIC -fPIE -gdwarf-4 -Wall (Debian_Clang_11.0.1)
T:athlon/athlon64clang -mcpu=native -O3 -fwrapv -Qunused-arguments -fPIC -fPIE -gdwarf-4 -Wall (Debian_Clang_11.0.1)

Compiler output


echo64.S: echo64.c: Assembler messages:
echo64.S: echo64.c:519: Error: no such instruction: `movzbl ebp,ah'
echo64.S: echo64.c:519: Error: no such instruction: `movzbl esi,al'
echo64.S: echo64.c:519: Error: no such instruction: `movzbl ebp,bl'
echo64.S: echo64.c:519: Error: no such instruction: `movzbl esi,bh'
echo64.S: echo64.c:519: Error: no such instruction: `movzbl ebp,al'
echo64.S: echo64.c:519: Error: no such instruction: `movzbl esi,ah'
echo64.S: echo64.c:519: Error: no such instruction: `movzbl ebp,bh'
echo64.S: echo64.c:519: Error: no such instruction: `movzbl esi,bl'
echo64.S: echo64.c:519: Error: no such instruction: `movzbl ebp,ah'
echo64.S: echo64.c:519: Error: no such instruction: `movzbl esi,al'
echo64.S: echo64.c:519: Error: no such instruction: `movzbl ebp,bl'
echo64.S: echo64.c:519: Error: no such instruction: `movzbl esi,bh'
echo64.S: echo64.c:519: Error: no such instruction: `movzbl ebp,al'
echo64.S: echo64.c:519: Error: no such instruction: `movzbl esi,ah'
echo64.S: echo64.c:519: Error: no such instruction: `movzbl ebp,bl'
echo64.S: echo64.c:519: Error: no such instruction: `movzbl esi,bh'
echo64.S: echo64.c:519: Error: no such instruction: `movzbl ebp,dl'
echo64.S: echo64.c:519: Error: no such instruction: `movzbl esi,dh'
echo64.S: echo64.c:519: Error: no such instruction: `movzbl ebp,ch'
echo64.S: echo64.c:519: Error: no such instruction: `movzbl esi,cl'
echo64.S: echo64.c:519: Error: no such instruction: `movzbl ebp,cl'
echo64.S: echo64.c:519: Error: no such instruction: `movzbl esi,ch'
echo64.S: echo64.c:519: Error: no such instruction: `movzbl ebp,dh'
echo64.S: echo64.c:519: Error: no such instruction: `movzbl esi,dl'
echo64.S: ...

Number of similar (implementation,compiler) pairs: 4, namely:
ImplementationCompiler
T:athlon/athlon64gcc -march=native -mtune=native -O2 -fwrapv -fPIC -fPIE -gdwarf-4 -Wall (10.2.1_20210110)
T:athlon/athlon64gcc -march=native -mtune=native -O3 -fwrapv -fPIC -fPIE -gdwarf-4 -Wall (10.2.1_20210110)
T:athlon/athlon64gcc -march=native -mtune=native -O -fwrapv -fPIC -fPIE -gdwarf-4 -Wall (10.2.1_20210110)
T:athlon/athlon64gcc -march=native -mtune=native -Os -fwrapv -fPIC -fPIE -gdwarf-4 -Wall (10.2.1_20210110)

Compiler output


hash.c: hash.c:263:4: error: always_inline function '_mm_shuffle_epi8' requires target feature 'ssse3', but would be inlined into function 'Compress' that is compiled without support for 'ssse3'
hash.c:                         TRANSFORM(_state[i][j], _k_ipt, t1, t2);
hash.c:                         ^
hash.c: ./vperm.h:52:7: note: expanded from macro 'TRANSFORM'
hash.c:         t1 = _mm_shuffle_epi8(*((__m128i*)table + 1), t1);\
hash.c:              ^
hash.c: hash.c:263:4: error: always_inline function '_mm_shuffle_epi8' requires target feature 'ssse3', but would be inlined into function 'Compress' that is compiled without support for 'ssse3'
hash.c: ./vperm.h:53:7: note: expanded from macro 'TRANSFORM'
hash.c:         x  = _mm_shuffle_epi8(*((__m128i*)table + 0), x);\
hash.c:              ^
hash.c: hash.c:280:5: error: always_inline function '_mm_shuffle_epi8' requires target feature 'ssse3', but would be inlined into function 'Compress' that is compiled without support for 'ssse3'
hash.c:                                 TRANSFORM(_state[i][j], _k_ipt, t1, t2);
hash.c:                                 ^
hash.c: ./vperm.h:52:7: note: expanded from macro 'TRANSFORM'
hash.c:         t1 = _mm_shuffle_epi8(*((__m128i*)table + 1), t1);\
hash.c:              ^
hash.c: hash.c:280:5: error: always_inline function '_mm_shuffle_epi8' requires target feature 'ssse3', but would be inlined into function 'Compress' that is compiled without support for 'ssse3'
hash.c: ./vperm.h:53:7: note: expanded from macro 'TRANSFORM'
hash.c:         x  = _mm_shuffle_epi8(*((__m128i*)table + 0), x);\
hash.c:              ^
hash.c: hash.c:305:4: error: always_inline function '_mm_shuffle_epi8' requires target feature 'ssse3', but would be inlined into function 'Compress' that is compiled without support for 'ssse3'
hash.c:                         ECHO_SUB_AND_MIX(_state, 0, 0, _state2, 0, 0, 1, 2, 3);
hash.c:                         ^
hash.c: hash.c:124:5: note: expanded from macro 'ECHO_SUB_AND_MIX'
hash.c:                                 AES_ROUND_VPERM_CORE(state[i][j], t1, t2, t3, t4, s1, s2, s3);\
hash.c: ...

Number of similar (implementation,compiler) pairs: 2, namely:
ImplementationCompiler
T:ccalik/aesniclang -mcpu=native -O3 -fwrapv -Qunused-arguments -fPIC -fPIE -gdwarf-4 -Wall (Debian_Clang_11.0.1)
T:ccalik/vpermclang -mcpu=native -O3 -fwrapv -Qunused-arguments -fPIC -fPIE -gdwarf-4 -Wall (Debian_Clang_11.0.1)

Compiler output


hash.c: In file included from hash.c:20:
hash.c: vperm.h:57:2: warning: multi-line comment [-Wcomment]
hash.c:    57 |  //t2 = _mm_shuffle_epi8(table[0], x);\
hash.c:       |  ^

Number of similar (implementation,compiler) pairs: 8, namely:
ImplementationCompiler
T:ccalik/aesnigcc -march=native -mtune=native -O2 -fwrapv -fPIC -fPIE -gdwarf-4 -Wall (10.2.1_20210110)
T:ccalik/aesnigcc -march=native -mtune=native -O3 -fwrapv -fPIC -fPIE -gdwarf-4 -Wall (10.2.1_20210110)
T:ccalik/aesnigcc -march=native -mtune=native -O -fwrapv -fPIC -fPIE -gdwarf-4 -Wall (10.2.1_20210110)
T:ccalik/aesnigcc -march=native -mtune=native -Os -fwrapv -fPIC -fPIE -gdwarf-4 -Wall (10.2.1_20210110)
T:ccalik/vpermgcc -march=native -mtune=native -O2 -fwrapv -fPIC -fPIE -gdwarf-4 -Wall (10.2.1_20210110)
T:ccalik/vpermgcc -march=native -mtune=native -O3 -fwrapv -fPIC -fPIE -gdwarf-4 -Wall (10.2.1_20210110)
T:ccalik/vpermgcc -march=native -mtune=native -O -fwrapv -fPIC -fPIE -gdwarf-4 -Wall (10.2.1_20210110)
T:ccalik/vpermgcc -march=native -mtune=native -Os -fwrapv -fPIC -fPIE -gdwarf-4 -Wall (10.2.1_20210110)

Compiler output


hash.c: hash.c:468:4: error: always_inline function '_mm_shuffle_epi8' requires target feature 'ssse3', but would be inlined into function 'Compress' that is compiled without support for 'ssse3'
hash.c:                         AES_SHIFT_ROWS(_state);
hash.c:                         ^
hash.c: hash.c:141:14: note: expanded from macro 'AES_SHIFT_ROWS'
hash.c:                         s[0][0] = _mm_shuffle_epi8(s[0][0], M128(shiftrowsslice));\
hash.c:                                   ^
hash.c: hash.c:468:4: error: always_inline function '_mm_shuffle_epi8' requires target feature 'ssse3', but would be inlined into function 'Compress' that is compiled without support for 'ssse3'
hash.c: hash.c:142:14: note: expanded from macro 'AES_SHIFT_ROWS'
hash.c:                         s[0][1] = _mm_shuffle_epi8(s[0][1], M128(shiftrowsslice));\
hash.c:                                   ^
hash.c: hash.c:468:4: error: always_inline function '_mm_shuffle_epi8' requires target feature 'ssse3', but would be inlined into function 'Compress' that is compiled without support for 'ssse3'
hash.c: hash.c:143:14: note: expanded from macro 'AES_SHIFT_ROWS'
hash.c:                         s[0][2] = _mm_shuffle_epi8(s[0][2], M128(shiftrowsslice));\
hash.c:                                   ^
hash.c: hash.c:468:4: error: always_inline function '_mm_shuffle_epi8' requires target feature 'ssse3', but would be inlined into function 'Compress' that is compiled without support for 'ssse3'
hash.c: hash.c:144:14: note: expanded from macro 'AES_SHIFT_ROWS'
hash.c:                         s[0][3] = _mm_shuffle_epi8(s[0][3], M128(shiftrowsslice));\
hash.c:                                   ^
hash.c: hash.c:468:4: error: always_inline function '_mm_shuffle_epi8' requires target feature 'ssse3', but would be inlined into function 'Compress' that is compiled without support for 'ssse3'
hash.c: hash.c:145:14: note: expanded from macro 'AES_SHIFT_ROWS'
hash.c:                         s[1][0] = _mm_shuffle_epi8(s[1][0], M128(shiftrowsslice));\
hash.c:                                   ^
hash.c: hash.c:468:4: error: always_inline function '_mm_shuffle_epi8' requires target feature 'ssse3', but would be inlined into function 'Compress' that is compiled without support for 'ssse3'
hash.c: hash.c:146:14: note: expanded from macro 'AES_SHIFT_ROWS'
hash.c:                         s[1][1] = _mm_shuffle_epi8(s[1][1], M128(shiftrowsslice));\
hash.c: ...

Number of similar (implementation,compiler) pairs: 1, namely:
ImplementationCompiler
T:ccalik/bitslicedclang -mcpu=native -O3 -fwrapv -Qunused-arguments -fPIC -fPIE -gdwarf-4 -Wall (Debian_Clang_11.0.1)

Compiler output


echo64.S: echo64.S:224:2: error: invalid instruction mnemonic 'movzbl'
echo64.S:  movzbl ebp, ah
echo64.S:  ^~~~~~
echo64.S: echo64.S:230:2: error: invalid instruction mnemonic 'movzbl'
echo64.S:  movzbl esi, al
echo64.S:  ^~~~~~
echo64.S: echo64.S:239:2: error: invalid instruction mnemonic 'movzbl'
echo64.S:  movzbl ebp, bl
echo64.S:  ^~~~~~
echo64.S: echo64.S:245:2: error: invalid instruction mnemonic 'movzbl'
echo64.S:  movzbl esi, bh
echo64.S:  ^~~~~~
echo64.S: echo64.S:254:2: error: invalid instruction mnemonic 'movzbl'
echo64.S:  movzbl ebp, al
echo64.S:  ^~~~~~
echo64.S: echo64.S:260:2: error: invalid instruction mnemonic 'movzbl'
echo64.S:  movzbl esi, ah
echo64.S:  ^~~~~~
echo64.S: echo64.S:269:2: error: invalid instruction mnemonic 'movzbl'
echo64.S:  movzbl ebp, bh
echo64.S:  ^~~~~~
echo64.S: echo64.S:275:2: error: invalid instruction mnemonic 'movzbl'
echo64.S:  movzbl esi, bl
echo64.S:  ^~~~~~
echo64.S: echo64.S:284:2: error: invalid instruction mnemonic 'movzbl'
echo64.S: ...

Number of similar (implementation,compiler) pairs: 5, namely:
ImplementationCompiler
T:core2/core2v64clang -march=native -O2 -fwrapv -Qunused-arguments -fPIC -fPIE -gdwarf-4 -Wall (Debian_Clang_11.0.1)
T:core2/core2v64clang -march=native -O3 -fwrapv -Qunused-arguments -fPIC -fPIE -gdwarf-4 -Wall (Debian_Clang_11.0.1)
T:core2/core2v64clang -march=native -O -fwrapv -Qunused-arguments -fPIC -fPIE -gdwarf-4 -Wall (Debian_Clang_11.0.1)
T:core2/core2v64clang -march=native -Os -fwrapv -Qunused-arguments -fPIC -fPIE -gdwarf-4 -Wall (Debian_Clang_11.0.1)
T:core2/core2v64clang -mcpu=native -O3 -fwrapv -Qunused-arguments -fPIC -fPIE -gdwarf-4 -Wall (Debian_Clang_11.0.1)

Compiler output


echo64.S: echo64.c: Assembler messages:
echo64.S: echo64.c:473: Error: no such instruction: `movzbl ebp,ah'
echo64.S: echo64.c:473: Error: no such instruction: `movzbl esi,al'
echo64.S: echo64.c:473: Error: no such instruction: `movzbl ebp,bl'
echo64.S: echo64.c:473: Error: no such instruction: `movzbl esi,bh'
echo64.S: echo64.c:473: Error: no such instruction: `movzbl ebp,al'
echo64.S: echo64.c:473: Error: no such instruction: `movzbl esi,ah'
echo64.S: echo64.c:473: Error: no such instruction: `movzbl ebp,bh'
echo64.S: echo64.c:473: Error: no such instruction: `movzbl esi,bl'
echo64.S: echo64.c:473: Error: no such instruction: `movzbl ebp,ah'
echo64.S: echo64.c:473: Error: no such instruction: `movzbl esi,al'
echo64.S: echo64.c:473: Error: no such instruction: `movzbl ebp,bl'
echo64.S: echo64.c:473: Error: no such instruction: `movzbl esi,bh'
echo64.S: echo64.c:473: Error: no such instruction: `movzbl ebp,al'
echo64.S: echo64.c:473: Error: no such instruction: `movzbl esi,ah'
echo64.S: echo64.c:473: Error: no such instruction: `movzbl ebp,bl'
echo64.S: echo64.c:473: Error: no such instruction: `movzbl esi,bh'
echo64.S: echo64.c:473: Error: no such instruction: `movzbl ebp,dl'
echo64.S: echo64.c:473: Error: no such instruction: `movzbl esi,dh'
echo64.S: echo64.c:473: Error: no such instruction: `movzbl ebp,ch'
echo64.S: echo64.c:473: Error: no such instruction: `movzbl esi,cl'
echo64.S: echo64.c:473: Error: no such instruction: `movzbl ebp,cl'
echo64.S: echo64.c:473: Error: no such instruction: `movzbl esi,ch'
echo64.S: echo64.c:473: Error: no such instruction: `movzbl ebp,dh'
echo64.S: echo64.c:473: Error: no such instruction: `movzbl esi,dl'
echo64.S: ...

Number of similar (implementation,compiler) pairs: 4, namely:
ImplementationCompiler
T:core2/core2v64gcc -march=native -mtune=native -O2 -fwrapv -fPIC -fPIE -gdwarf-4 -Wall (10.2.1_20210110)
T:core2/core2v64gcc -march=native -mtune=native -O3 -fwrapv -fPIC -fPIE -gdwarf-4 -Wall (10.2.1_20210110)
T:core2/core2v64gcc -march=native -mtune=native -O -fwrapv -fPIC -fPIE -gdwarf-4 -Wall (10.2.1_20210110)
T:core2/core2v64gcc -march=native -mtune=native -Os -fwrapv -fPIC -fPIE -gdwarf-4 -Wall (10.2.1_20210110)

Compiler output


echo32.c: echo32.c:105:18: warning: unused variable 'j' [-Wunused-variable]
echo32.c:         unsigned int i, j;
echo32.c:                         ^
echo32.c: echo32.c:106:16: warning: unused variable 'endianess' [-Wunused-variable]
echo32.c:         unsigned char endianess;
echo32.c:                       ^
echo32.c: echo32.c:337:15: warning: unused variable 'i' [-Wunused-variable]
echo32.c:         unsigned int i;
echo32.c:                      ^
echo32.c: echo32.c:338:21: warning: unused variable 'c0' [-Wunused-variable]
echo32.c:         unsigned long long c0, c1;
echo32.c:                            ^
echo32.c: echo32.c:338:25: warning: unused variable 'c1' [-Wunused-variable]
echo32.c:         unsigned long long c0, c1;
echo32.c:                                ^
echo32.c: echo32.c:436:21: warning: unused variable 'hashlen' [-Wunused-variable]
echo32.c:         unsigned short int hashlen = 0;
echo32.c:                            ^
echo32.c: echo32.c:437:21: warning: unused variable 'messlen_l' [-Wunused-variable]
echo32.c:         unsigned long long messlen_l = 0;
echo32.c:                            ^
echo32.c: echo32.c:438:21: warning: unused variable 'messlen_h' [-Wunused-variable]
echo32.c:         unsigned long long messlen_h = 0;
echo32.c:                            ^
echo32.c: 8 warnings generated.

Number of similar (implementation,compiler) pairs: 5, namely:
ImplementationCompiler
T:generic/opt32clang -march=native -O2 -fwrapv -Qunused-arguments -fPIC -fPIE -gdwarf-4 -Wall (Debian_Clang_11.0.1)
T:generic/opt32clang -march=native -O3 -fwrapv -Qunused-arguments -fPIC -fPIE -gdwarf-4 -Wall (Debian_Clang_11.0.1)
T:generic/opt32clang -march=native -O -fwrapv -Qunused-arguments -fPIC -fPIE -gdwarf-4 -Wall (Debian_Clang_11.0.1)
T:generic/opt32clang -march=native -Os -fwrapv -Qunused-arguments -fPIC -fPIE -gdwarf-4 -Wall (Debian_Clang_11.0.1)
T:generic/opt32clang -mcpu=native -O3 -fwrapv -Qunused-arguments -fPIC -fPIE -gdwarf-4 -Wall (Debian_Clang_11.0.1)

Compiler output


echo32.c: echo32.c: In function 'Init':
echo32.c: echo32.c:106:16: warning: unused variable 'endianess' [-Wunused-variable]
echo32.c:   106 |  unsigned char endianess;
echo32.c:       |                ^~~~~~~~~
echo32.c: echo32.c:105:18: warning: unused variable 'j' [-Wunused-variable]
echo32.c:   105 |  unsigned int i, j;
echo32.c:       |                  ^
echo32.c: echo32.c: In function 'Compress':
echo32.c: echo32.c:338:25: warning: unused variable 'c1' [-Wunused-variable]
echo32.c:   338 |  unsigned long long c0, c1;
echo32.c:       |                         ^~
echo32.c: echo32.c:338:21: warning: unused variable 'c0' [-Wunused-variable]
echo32.c:   338 |  unsigned long long c0, c1;
echo32.c:       |                     ^~
echo32.c: echo32.c:337:15: warning: unused variable 'i' [-Wunused-variable]
echo32.c:   337 |  unsigned int i;
echo32.c:       |               ^
echo32.c: echo32.c: In function 'Final':
echo32.c: echo32.c:438:21: warning: unused variable 'messlen_h' [-Wunused-variable]
echo32.c:   438 |  unsigned long long messlen_h = 0;
echo32.c:       |                     ^~~~~~~~~
echo32.c: echo32.c:437:21: warning: unused variable 'messlen_l' [-Wunused-variable]
echo32.c:   437 |  unsigned long long messlen_l = 0;
echo32.c:       |                     ^~~~~~~~~
echo32.c: echo32.c:436:21: warning: unused variable 'hashlen' [-Wunused-variable]
echo32.c: ...

Number of similar (implementation,compiler) pairs: 4, namely:
ImplementationCompiler
T:generic/opt32gcc -march=native -mtune=native -O2 -fwrapv -fPIC -fPIE -gdwarf-4 -Wall (10.2.1_20210110)
T:generic/opt32gcc -march=native -mtune=native -O3 -fwrapv -fPIC -fPIE -gdwarf-4 -Wall (10.2.1_20210110)
T:generic/opt32gcc -march=native -mtune=native -O -fwrapv -fPIC -fPIE -gdwarf-4 -Wall (10.2.1_20210110)
T:generic/opt32gcc -march=native -mtune=native -Os -fwrapv -fPIC -fPIE -gdwarf-4 -Wall (10.2.1_20210110)

Compiler output


echo64.c: echo64.c:290:30: warning: unused variable 'WT5' [-Wunused-variable]
echo64.c:     WT0, WT1, WT2, WT3, WT4, WT5;
echo64.c:                              ^
echo64.c: echo64.c:432:16: warning: unused variable 'i' [-Wunused-variable]
echo64.c:   unsigned int i;
echo64.c:                ^
echo64.c: echo64.c:501:29: warning: passing 'const unsigned char *' to parameter of type 'BitSequence *' (aka 'unsigned char *') discards qualifiers [-Wincompatible-pointer-types-discards-qualifiers]
echo64.c:   if (Hash(CRYPTO_BYTES * 8,in,inlen * 8,out) == SUCCESS) return 0;
echo64.c:                             ^~
echo64.c: echo64.c:488:46: note: passing argument to parameter 'data' here
echo64.c: HashReturn Hash(int hashbitlen, BitSequence *data, DataLength databitlen, BitSequence *hashval)
echo64.c:                                              ^
echo64.c: 3 warnings generated.

Number of similar (implementation,compiler) pairs: 5, namely:
ImplementationCompiler
T:generic/opt64clang -march=native -O2 -fwrapv -Qunused-arguments -fPIC -fPIE -gdwarf-4 -Wall (Debian_Clang_11.0.1)
T:generic/opt64clang -march=native -O3 -fwrapv -Qunused-arguments -fPIC -fPIE -gdwarf-4 -Wall (Debian_Clang_11.0.1)
T:generic/opt64clang -march=native -O -fwrapv -Qunused-arguments -fPIC -fPIE -gdwarf-4 -Wall (Debian_Clang_11.0.1)
T:generic/opt64clang -march=native -Os -fwrapv -Qunused-arguments -fPIC -fPIE -gdwarf-4 -Wall (Debian_Clang_11.0.1)
T:generic/opt64clang -mcpu=native -O3 -fwrapv -Qunused-arguments -fPIC -fPIE -gdwarf-4 -Wall (Debian_Clang_11.0.1)

Compiler output


echo64.c: echo64.c: In function 'Compress':
echo64.c: echo64.c:290:30: warning: unused variable 'WT5' [-Wunused-variable]
echo64.c:   290 |     WT0, WT1, WT2, WT3, WT4, WT5;
echo64.c:       |                              ^~~
echo64.c: echo64.c: In function 'Final':
echo64.c: echo64.c:432:16: warning: unused variable 'i' [-Wunused-variable]
echo64.c:   432 |   unsigned int i;
echo64.c:       |                ^
echo64.c: echo64.c: In function 'crypto_hash_echo512_generic_opt64_timingleaks':
echo64.c: echo64.c:501:29: warning: passing argument 2 of 'Hash' discards 'const' qualifier from pointer target type [-Wdiscarded-qualifiers]
echo64.c:   501 |   if (Hash(CRYPTO_BYTES * 8,in,inlen * 8,out) == SUCCESS) return 0;
echo64.c:       |                             ^~
echo64.c: echo64.c:488:46: note: expected 'BitSequence *' {aka 'unsigned char *'} but argument is of type 'const unsigned char *'
echo64.c:   488 | HashReturn Hash(int hashbitlen, BitSequence *data, DataLength databitlen, BitSequence *hashval)
echo64.c:       |                                 ~~~~~~~~~~~~~^~~~

Number of similar (implementation,compiler) pairs: 4, namely:
ImplementationCompiler
T:generic/opt64gcc -march=native -mtune=native -O2 -fwrapv -fPIC -fPIE -gdwarf-4 -Wall (10.2.1_20210110)
T:generic/opt64gcc -march=native -mtune=native -O3 -fwrapv -fPIC -fPIE -gdwarf-4 -Wall (10.2.1_20210110)
T:generic/opt64gcc -march=native -mtune=native -O -fwrapv -fPIC -fPIE -gdwarf-4 -Wall (10.2.1_20210110)
T:generic/opt64gcc -march=native -mtune=native -Os -fwrapv -fPIC -fPIE -gdwarf-4 -Wall (10.2.1_20210110)

Compiler output


echo32.S: echo32.S:323:2: error: invalid instruction mnemonic 'addd'
echo32.S:  addd [SHA3_CNT], 1
echo32.S:  ^~~~
echo32.S: echo32.S:587:2: error: invalid instruction mnemonic 'addd'
echo32.S:  addd [SHA3_CNT], 1
echo32.S:  ^~~~
echo32.S: echo32.S:851:2: error: invalid instruction mnemonic 'addd'
echo32.S:  addd [SHA3_CNT], 1
echo32.S:  ^~~~
echo32.S: echo32.S:1115:2: error: invalid instruction mnemonic 'addd'
echo32.S:  addd [SHA3_CNT], 1
echo32.S:  ^~~~
echo32.S: echo32.S:1379:2: error: invalid instruction mnemonic 'addd'
echo32.S:  addd [SHA3_CNT], 1
echo32.S:  ^~~~
echo32.S: echo32.S:1643:2: error: invalid instruction mnemonic 'addd'
echo32.S:  addd [SHA3_CNT], 1
echo32.S:  ^~~~
echo32.S: echo32.S:1907:2: error: invalid instruction mnemonic 'addd'
echo32.S:  addd [SHA3_CNT], 1
echo32.S:  ^~~~
echo32.S: echo32.S:2171:2: error: invalid instruction mnemonic 'addd'
echo32.S:  addd [SHA3_CNT], 1
echo32.S:  ^~~~
echo32.S: echo32.S:2435:2: error: invalid instruction mnemonic 'addd'
echo32.S: ...

Number of similar (implementation,compiler) pairs: 5, namely:
ImplementationCompiler
T:pentium/pentium4v64v1clang -march=native -O2 -fwrapv -Qunused-arguments -fPIC -fPIE -gdwarf-4 -Wall (Debian_Clang_11.0.1)
T:pentium/pentium4v64v1clang -march=native -O3 -fwrapv -Qunused-arguments -fPIC -fPIE -gdwarf-4 -Wall (Debian_Clang_11.0.1)
T:pentium/pentium4v64v1clang -march=native -O -fwrapv -Qunused-arguments -fPIC -fPIE -gdwarf-4 -Wall (Debian_Clang_11.0.1)
T:pentium/pentium4v64v1clang -march=native -Os -fwrapv -Qunused-arguments -fPIC -fPIE -gdwarf-4 -Wall (Debian_Clang_11.0.1)
T:pentium/pentium4v64v1clang -mcpu=native -O3 -fwrapv -Qunused-arguments -fPIC -fPIE -gdwarf-4 -Wall (Debian_Clang_11.0.1)

Compiler output


try.c: /usr/bin/ld: libcrypto_hash_echo512.a(echo32.o): relocation R_X86_64_32S against symbol `SHA3_R' can not be used when making a PIE object; recompile with -fPIE
try.c: collect2: error: ld returned 1 exit status

Number of similar (implementation,compiler) pairs: 4, namely:
ImplementationCompiler
T:pentium/pentium4v64v1gcc -march=native -mtune=native -O2 -fwrapv -fPIC -fPIE -gdwarf-4 -Wall (10.2.1_20210110)
T:pentium/pentium4v64v1gcc -march=native -mtune=native -O3 -fwrapv -fPIC -fPIE -gdwarf-4 -Wall (10.2.1_20210110)
T:pentium/pentium4v64v1gcc -march=native -mtune=native -O -fwrapv -fPIC -fPIE -gdwarf-4 -Wall (10.2.1_20210110)
T:pentium/pentium4v64v1gcc -march=native -mtune=native -Os -fwrapv -fPIC -fPIE -gdwarf-4 -Wall (10.2.1_20210110)

Compiler output


echo64.S: echo64.S:371:2: error: invalid instruction mnemonic 'addd'
echo64.S:  addd [SHA3_CNT], 1
echo64.S:  ^~~~
echo64.S: echo64.S:635:2: error: invalid instruction mnemonic 'addd'
echo64.S:  addd [SHA3_CNT], 1
echo64.S:  ^~~~
echo64.S: echo64.S:899:2: error: invalid instruction mnemonic 'addd'
echo64.S:  addd [SHA3_CNT], 1
echo64.S:  ^~~~
echo64.S: echo64.S:1163:2: error: invalid instruction mnemonic 'addd'
echo64.S:  addd [SHA3_CNT], 1
echo64.S:  ^~~~
echo64.S: echo64.S:1427:2: error: invalid instruction mnemonic 'addd'
echo64.S:  addd [SHA3_CNT], 1
echo64.S:  ^~~~
echo64.S: echo64.S:1691:2: error: invalid instruction mnemonic 'addd'
echo64.S:  addd [SHA3_CNT], 1
echo64.S:  ^~~~
echo64.S: echo64.S:1955:2: error: invalid instruction mnemonic 'addd'
echo64.S:  addd [SHA3_CNT], 1
echo64.S:  ^~~~
echo64.S: echo64.S:2219:2: error: invalid instruction mnemonic 'addd'
echo64.S:  addd [SHA3_CNT], 1
echo64.S:  ^~~~
echo64.S: echo64.S:2483:2: error: invalid instruction mnemonic 'addd'
echo64.S: ...

Number of similar (implementation,compiler) pairs: 5, namely:
ImplementationCompiler
T:pentium/pentium4v64v2clang -march=native -O2 -fwrapv -Qunused-arguments -fPIC -fPIE -gdwarf-4 -Wall (Debian_Clang_11.0.1)
T:pentium/pentium4v64v2clang -march=native -O3 -fwrapv -Qunused-arguments -fPIC -fPIE -gdwarf-4 -Wall (Debian_Clang_11.0.1)
T:pentium/pentium4v64v2clang -march=native -O -fwrapv -Qunused-arguments -fPIC -fPIE -gdwarf-4 -Wall (Debian_Clang_11.0.1)
T:pentium/pentium4v64v2clang -march=native -Os -fwrapv -Qunused-arguments -fPIC -fPIE -gdwarf-4 -Wall (Debian_Clang_11.0.1)
T:pentium/pentium4v64v2clang -mcpu=native -O3 -fwrapv -Qunused-arguments -fPIC -fPIE -gdwarf-4 -Wall (Debian_Clang_11.0.1)

Compiler output


try.c: /usr/bin/ld: libcrypto_hash_echo512.a(echo64.o): relocation R_X86_64_32S against symbol `SHA3_R' can not be used when making a PIE object; recompile with -fPIE
try.c: collect2: error: ld returned 1 exit status

Number of similar (implementation,compiler) pairs: 4, namely:
ImplementationCompiler
T:pentium/pentium4v64v2gcc -march=native -mtune=native -O2 -fwrapv -fPIC -fPIE -gdwarf-4 -Wall (10.2.1_20210110)
T:pentium/pentium4v64v2gcc -march=native -mtune=native -O3 -fwrapv -fPIC -fPIE -gdwarf-4 -Wall (10.2.1_20210110)
T:pentium/pentium4v64v2gcc -march=native -mtune=native -O -fwrapv -fPIC -fPIE -gdwarf-4 -Wall (10.2.1_20210110)
T:pentium/pentium4v64v2gcc -march=native -mtune=native -Os -fwrapv -fPIC -fPIE -gdwarf-4 -Wall (10.2.1_20210110)

Compiler output


echo32.c: echo32.c:106:18: warning: unused variable 'j' [-Wunused-variable]
echo32.c:         unsigned int i, j;
echo32.c:                         ^
echo32.c: echo32.c:107:16: warning: unused variable 'endianess' [-Wunused-variable]
echo32.c:         unsigned char endianess;
echo32.c:                       ^
echo32.c: echo32.c:472:21: warning: unused variable 'c0' [-Wunused-variable]
echo32.c:         unsigned long long c0, c1;
echo32.c:                            ^
echo32.c: echo32.c:472:25: warning: unused variable 'c1' [-Wunused-variable]
echo32.c:         unsigned long long c0, c1;
echo32.c:                                ^
echo32.c: echo32.c:599:21: warning: unused variable 'hashlen' [-Wunused-variable]
echo32.c:         unsigned short int hashlen = 0;
echo32.c:                            ^
echo32.c: echo32.c:600:21: warning: unused variable 'messlen_l' [-Wunused-variable]
echo32.c:         unsigned long long messlen_l = 0;
echo32.c:                            ^
echo32.c: echo32.c:601:21: warning: unused variable 'messlen_h' [-Wunused-variable]
echo32.c:         unsigned long long messlen_h = 0;
echo32.c:                            ^
echo32.c: 7 warnings generated.

Number of similar (implementation,compiler) pairs: 5, namely:
ImplementationCompiler
T:powerpc/pp32cv1clang -march=native -O2 -fwrapv -Qunused-arguments -fPIC -fPIE -gdwarf-4 -Wall (Debian_Clang_11.0.1)
T:powerpc/pp32cv1clang -march=native -O3 -fwrapv -Qunused-arguments -fPIC -fPIE -gdwarf-4 -Wall (Debian_Clang_11.0.1)
T:powerpc/pp32cv1clang -march=native -O -fwrapv -Qunused-arguments -fPIC -fPIE -gdwarf-4 -Wall (Debian_Clang_11.0.1)
T:powerpc/pp32cv1clang -march=native -Os -fwrapv -Qunused-arguments -fPIC -fPIE -gdwarf-4 -Wall (Debian_Clang_11.0.1)
T:powerpc/pp32cv1clang -mcpu=native -O3 -fwrapv -Qunused-arguments -fPIC -fPIE -gdwarf-4 -Wall (Debian_Clang_11.0.1)

Compiler output


echo32.c: echo32.c: In function 'Init':
echo32.c: echo32.c:107:16: warning: unused variable 'endianess' [-Wunused-variable]
echo32.c:   107 |  unsigned char endianess;
echo32.c:       |                ^~~~~~~~~
echo32.c: echo32.c:106:18: warning: unused variable 'j' [-Wunused-variable]
echo32.c:   106 |  unsigned int i, j;
echo32.c:       |                  ^
echo32.c: echo32.c: In function 'Compress':
echo32.c: echo32.c:472:25: warning: unused variable 'c1' [-Wunused-variable]
echo32.c:   472 |  unsigned long long c0, c1;
echo32.c:       |                         ^~
echo32.c: echo32.c:472:21: warning: unused variable 'c0' [-Wunused-variable]
echo32.c:   472 |  unsigned long long c0, c1;
echo32.c:       |                     ^~
echo32.c: echo32.c: In function 'Final':
echo32.c: echo32.c:601:21: warning: unused variable 'messlen_h' [-Wunused-variable]
echo32.c:   601 |  unsigned long long messlen_h = 0;
echo32.c:       |                     ^~~~~~~~~
echo32.c: echo32.c:600:21: warning: unused variable 'messlen_l' [-Wunused-variable]
echo32.c:   600 |  unsigned long long messlen_l = 0;
echo32.c:       |                     ^~~~~~~~~
echo32.c: echo32.c:599:21: warning: unused variable 'hashlen' [-Wunused-variable]
echo32.c:   599 |  unsigned short int hashlen = 0;
echo32.c:       |                     ^~~~~~~

Number of similar (implementation,compiler) pairs: 4, namely:
ImplementationCompiler
T:powerpc/pp32cv1gcc -march=native -mtune=native -O2 -fwrapv -fPIC -fPIE -gdwarf-4 -Wall (10.2.1_20210110)
T:powerpc/pp32cv1gcc -march=native -mtune=native -O3 -fwrapv -fPIC -fPIE -gdwarf-4 -Wall (10.2.1_20210110)
T:powerpc/pp32cv1gcc -march=native -mtune=native -O -fwrapv -fPIC -fPIE -gdwarf-4 -Wall (10.2.1_20210110)
T:powerpc/pp32cv1gcc -march=native -mtune=native -Os -fwrapv -fPIC -fPIE -gdwarf-4 -Wall (10.2.1_20210110)

Compiler output


echo32.c: echo32.c:106:18: warning: unused variable 'j' [-Wunused-variable]
echo32.c:         unsigned int i, j;
echo32.c:                         ^
echo32.c: echo32.c:107:16: warning: unused variable 'endianess' [-Wunused-variable]
echo32.c:         unsigned char endianess;
echo32.c:                       ^
echo32.c: echo32.c:440:21: warning: unused variable 'c0' [-Wunused-variable]
echo32.c:         unsigned long long c0, c1;
echo32.c:                            ^
echo32.c: echo32.c:440:25: warning: unused variable 'c1' [-Wunused-variable]
echo32.c:         unsigned long long c0, c1;
echo32.c:                                ^
echo32.c: echo32.c:567:21: warning: unused variable 'hashlen' [-Wunused-variable]
echo32.c:         unsigned short int hashlen = 0;
echo32.c:                            ^
echo32.c: echo32.c:568:21: warning: unused variable 'messlen_l' [-Wunused-variable]
echo32.c:         unsigned long long messlen_l = 0;
echo32.c:                            ^
echo32.c: echo32.c:569:21: warning: unused variable 'messlen_h' [-Wunused-variable]
echo32.c:         unsigned long long messlen_h = 0;
echo32.c:                            ^
echo32.c: 7 warnings generated.

Number of similar (implementation,compiler) pairs: 5, namely:
ImplementationCompiler
T:powerpc/pp32cv2clang -march=native -O2 -fwrapv -Qunused-arguments -fPIC -fPIE -gdwarf-4 -Wall (Debian_Clang_11.0.1)
T:powerpc/pp32cv2clang -march=native -O3 -fwrapv -Qunused-arguments -fPIC -fPIE -gdwarf-4 -Wall (Debian_Clang_11.0.1)
T:powerpc/pp32cv2clang -march=native -O -fwrapv -Qunused-arguments -fPIC -fPIE -gdwarf-4 -Wall (Debian_Clang_11.0.1)
T:powerpc/pp32cv2clang -march=native -Os -fwrapv -Qunused-arguments -fPIC -fPIE -gdwarf-4 -Wall (Debian_Clang_11.0.1)
T:powerpc/pp32cv2clang -mcpu=native -O3 -fwrapv -Qunused-arguments -fPIC -fPIE -gdwarf-4 -Wall (Debian_Clang_11.0.1)

Compiler output


echo32.c: echo32.c: In function 'Init':
echo32.c: echo32.c:107:16: warning: unused variable 'endianess' [-Wunused-variable]
echo32.c:   107 |  unsigned char endianess;
echo32.c:       |                ^~~~~~~~~
echo32.c: echo32.c:106:18: warning: unused variable 'j' [-Wunused-variable]
echo32.c:   106 |  unsigned int i, j;
echo32.c:       |                  ^
echo32.c: echo32.c: In function 'Compress':
echo32.c: echo32.c:440:25: warning: unused variable 'c1' [-Wunused-variable]
echo32.c:   440 |  unsigned long long c0, c1;
echo32.c:       |                         ^~
echo32.c: echo32.c:440:21: warning: unused variable 'c0' [-Wunused-variable]
echo32.c:   440 |  unsigned long long c0, c1;
echo32.c:       |                     ^~
echo32.c: echo32.c: In function 'Final':
echo32.c: echo32.c:569:21: warning: unused variable 'messlen_h' [-Wunused-variable]
echo32.c:   569 |  unsigned long long messlen_h = 0;
echo32.c:       |                     ^~~~~~~~~
echo32.c: echo32.c:568:21: warning: unused variable 'messlen_l' [-Wunused-variable]
echo32.c:   568 |  unsigned long long messlen_l = 0;
echo32.c:       |                     ^~~~~~~~~
echo32.c: echo32.c:567:21: warning: unused variable 'hashlen' [-Wunused-variable]
echo32.c:   567 |  unsigned short int hashlen = 0;
echo32.c:       |                     ^~~~~~~

Number of similar (implementation,compiler) pairs: 4, namely:
ImplementationCompiler
T:powerpc/pp32cv2gcc -march=native -mtune=native -O2 -fwrapv -fPIC -fPIE -gdwarf-4 -Wall (10.2.1_20210110)
T:powerpc/pp32cv2gcc -march=native -mtune=native -O3 -fwrapv -fPIC -fPIE -gdwarf-4 -Wall (10.2.1_20210110)
T:powerpc/pp32cv2gcc -march=native -mtune=native -O -fwrapv -fPIC -fPIE -gdwarf-4 -Wall (10.2.1_20210110)
T:powerpc/pp32cv2gcc -march=native -mtune=native -Os -fwrapv -fPIC -fPIE -gdwarf-4 -Wall (10.2.1_20210110)