Test results for amd64, know, crypto_aead/omdsha256k128n96tau64v1
[Page version: 20250322 15:59:23]
Measurements for amd64, know, crypto_aead
Test results for amd64, know, crypto_aead
Test results for crypto_aead/omdsha256k128n96tau64v1
Computer: know
Microarchitecture: amd64; Comet Lake (806ec)
Architecture: amd64
CPU ID: GenuineIntel-000806ec-bfebfbff
SUPERCOP version: 20250307
Operation: crypto_aead
Primitive: omdsha256k128n96tau64v1
Time | Object size | Test size | Implementation | Compiler | Benchmark date | SUPERCOP version |
166050 | 17038 0 0 | 39804 780 1088 | T:ref | gcc -march=native -mtune=native -O3 -fwrapv -fPIC -fPIE -gdwarf-4 -Wall | 20250313 | 20250307 |
175423 | 11685 0 0 | 35313 852 1056 | T:ref | clang -march=native -O2 -fwrapv -Qunused-arguments -fPIC -fPIE -gdwarf-4 -Wall | 20250313 | 20250307 |
180098 | 10811 0 0 | 34657 852 1088 | T:ref | clang -march=native -O3 -fwrapv -Qunused-arguments -fPIC -fPIE -gdwarf-4 -Wall | 20250313 | 20250307 |
180608 | 6220 0 0 | 27044 780 1088 | T:ref | gcc -march=native -mtune=native -O2 -fwrapv -fPIC -fPIE -gdwarf-4 -Wall | 20250313 | 20250307 |
199283 | 4553 0 0 | 25359 844 1088 | T:ref | clang -march=native -Os -fwrapv -Qunused-arguments -fPIC -fPIE -gdwarf-4 -Wall | 20250313 | 20250307 |
206754 | 12097 0 0 | 34409 852 1024 | T:ref | clang -mcpu=native -O3 -fwrapv -Qunused-arguments -fPIC -fPIE -gdwarf-4 -Wall | 20250313 | 20250307 |
206756 | 5701 0 0 | 25859 772 1088 | T:ref | gcc -march=native -mtune=native -O -fwrapv -fPIC -fPIE -gdwarf-4 -Wall | 20250313 | 20250307 |
209814 | 5679 0 0 | 25609 852 1024 | T:ref | clang -march=native -O -fwrapv -Qunused-arguments -fPIC -fPIE -gdwarf-4 -Wall | 20250313 | 20250307 |
232589 | 4083 0 0 | 22607 756 1056 | T:ref | gcc -march=native -mtune=native -Os -fwrapv -fPIC -fPIE -gdwarf-4 -Wall | 20250313 | 20250307 |
Compiler output
try.c: /usr/bin/ld: libcrypto_aead_omdsha256k128n96tau64v1.a(omdsha256.o):.../supercop-data/know/amd64/try/c/clang_-march=native_-O2_-fwrapv_-Qunused-arguments_-fPIC_-fPIE_-gdwarf-4_-Wall/timingleaks/crypto_aead/omdsha256k128n96tau64v1/avx1/work/./omdsha256.h:137: multiple definition of `Hash'; libcrypto_aead_omdsha256k128n96tau64v1.a(encrypt.o):.../supercop-data/know/amd64/try/c/clang_-march=native_-O2_-fwrapv_-Qunused-arguments_-fPIC_-fPIE_-gdwarf-4_-Wall/timingleaks/crypto_aead/omdsha256k128n96tau64v1/avx1/work/./omdsha256.h:137: first defined here
try.c: clang: error: linker command failed with exit code 1 (use -v to see invocation)
Number of similar (implementation,compiler) pairs: 1, namely:
Implementation | Compiler |
T:avx1 | clang -march=native -O2 -fwrapv -Qunused-arguments -fPIC -fPIE -gdwarf-4 -Wall (Debian_Clang_14.0.6) |
Compiler output
try.c: /usr/bin/ld: libcrypto_aead_omdsha256k128n96tau64v1.a(omdsha256.o):.../supercop-data/know/amd64/try/c/clang_-march=native_-O3_-fwrapv_-Qunused-arguments_-fPIC_-fPIE_-gdwarf-4_-Wall/timingleaks/crypto_aead/omdsha256k128n96tau64v1/avx1/work/./omdsha256.h:137: multiple definition of `Hash'; libcrypto_aead_omdsha256k128n96tau64v1.a(encrypt.o):.../supercop-data/know/amd64/try/c/clang_-march=native_-O3_-fwrapv_-Qunused-arguments_-fPIC_-fPIE_-gdwarf-4_-Wall/timingleaks/crypto_aead/omdsha256k128n96tau64v1/avx1/work/./omdsha256.h:137: first defined here
try.c: clang: error: linker command failed with exit code 1 (use -v to see invocation)
Number of similar (implementation,compiler) pairs: 1, namely:
Implementation | Compiler |
T:avx1 | clang -march=native -O3 -fwrapv -Qunused-arguments -fPIC -fPIE -gdwarf-4 -Wall (Debian_Clang_14.0.6) |
Compiler output
try.c: /usr/bin/ld: libcrypto_aead_omdsha256k128n96tau64v1.a(omdsha256.o):.../supercop-data/know/amd64/try/c/clang_-march=native_-O_-fwrapv_-Qunused-arguments_-fPIC_-fPIE_-gdwarf-4_-Wall/timingleaks/crypto_aead/omdsha256k128n96tau64v1/avx1/work/./omdsha256.h:137: multiple definition of `Hash'; libcrypto_aead_omdsha256k128n96tau64v1.a(encrypt.o):.../supercop-data/know/amd64/try/c/clang_-march=native_-O_-fwrapv_-Qunused-arguments_-fPIC_-fPIE_-gdwarf-4_-Wall/timingleaks/crypto_aead/omdsha256k128n96tau64v1/avx1/work/./omdsha256.h:137: first defined here
try.c: clang: error: linker command failed with exit code 1 (use -v to see invocation)
Number of similar (implementation,compiler) pairs: 1, namely:
Implementation | Compiler |
T:avx1 | clang -march=native -O -fwrapv -Qunused-arguments -fPIC -fPIE -gdwarf-4 -Wall (Debian_Clang_14.0.6) |
Compiler output
try.c: /usr/bin/ld: libcrypto_aead_omdsha256k128n96tau64v1.a(omdsha256.o):.../supercop-data/know/amd64/try/c/clang_-march=native_-Os_-fwrapv_-Qunused-arguments_-fPIC_-fPIE_-gdwarf-4_-Wall/timingleaks/crypto_aead/omdsha256k128n96tau64v1/avx1/work/./omdsha256.h:137: multiple definition of `Hash'; libcrypto_aead_omdsha256k128n96tau64v1.a(encrypt.o):.../supercop-data/know/amd64/try/c/clang_-march=native_-Os_-fwrapv_-Qunused-arguments_-fPIC_-fPIE_-gdwarf-4_-Wall/timingleaks/crypto_aead/omdsha256k128n96tau64v1/avx1/work/./omdsha256.h:137: first defined here
try.c: clang: error: linker command failed with exit code 1 (use -v to see invocation)
Number of similar (implementation,compiler) pairs: 1, namely:
Implementation | Compiler |
T:avx1 | clang -march=native -Os -fwrapv -Qunused-arguments -fPIC -fPIE -gdwarf-4 -Wall (Debian_Clang_14.0.6) |
Compiler output
try.c: /usr/bin/ld: libcrypto_aead_omdsha256k128n96tau64v1.a(omdsha256.o):.../supercop-data/know/amd64/try/c/clang_-mcpu=native_-O3_-fwrapv_-Qunused-arguments_-fPIC_-fPIE_-gdwarf-4_-Wall/timingleaks/crypto_aead/omdsha256k128n96tau64v1/avx1/work/./omdsha256.h:137: multiple definition of `Hash'; libcrypto_aead_omdsha256k128n96tau64v1.a(encrypt.o):.../supercop-data/know/amd64/try/c/clang_-mcpu=native_-O3_-fwrapv_-Qunused-arguments_-fPIC_-fPIE_-gdwarf-4_-Wall/timingleaks/crypto_aead/omdsha256k128n96tau64v1/avx1/work/./omdsha256.h:137: first defined here
try.c: clang: error: linker command failed with exit code 1 (use -v to see invocation)
Number of similar (implementation,compiler) pairs: 1, namely:
Implementation | Compiler |
T:avx1 | clang -mcpu=native -O3 -fwrapv -Qunused-arguments -fPIC -fPIE -gdwarf-4 -Wall (Debian_Clang_14.0.6) |
Compiler output
encrypt.c: /tmp/ccuYQShB.s: Assembler messages:
encrypt.c: /tmp/ccuYQShB.s:922: Warning: dwarf line number information for .data ignored
encrypt.c: /tmp/ccuYQShB.s:924: Warning: dwarf line number information for .data ignored
encrypt.c: /tmp/ccuYQShB.s:925: Warning: dwarf line number information for .data ignored
encrypt.c: /tmp/ccuYQShB.s:926: Warning: dwarf line number information for .data ignored
encrypt.c: /tmp/ccuYQShB.s:937: Warning: dwarf line number information for .data ignored
encrypt.c: /tmp/ccuYQShB.s:944: Warning: dwarf line number information for .data ignored
encrypt.c: /tmp/ccuYQShB.s:947: Warning: dwarf line number information for .data ignored
encrypt.c: /tmp/ccuYQShB.s:948: Warning: dwarf line number information for .data ignored
encrypt.c: /tmp/ccuYQShB.s:955: Warning: dwarf line number information for .data ignored
encrypt.c: /tmp/ccuYQShB.s:956: Warning: dwarf line number information for .data ignored
encrypt.c: /tmp/ccuYQShB.s:959: Warning: dwarf line number information for .data ignored
encrypt.c: /tmp/ccuYQShB.s:961: Warning: dwarf line number information for .data ignored
encrypt.c: /tmp/ccuYQShB.s:964: Warning: dwarf line number information for .data ignored
encrypt.c: /tmp/ccuYQShB.s:972: Warning: dwarf line number information for .data ignored
encrypt.c: /tmp/ccuYQShB.s:983: Warning: dwarf line number information for .data ignored
encrypt.c: /tmp/ccuYQShB.s:985: Warning: dwarf line number information for .data ignored
encrypt.c: /tmp/ccuYQShB.s:986: Warning: dwarf line number information for .data ignored
encrypt.c: /tmp/ccuYQShB.s:987: Warning: dwarf line number information for .data ignored
encrypt.c: /tmp/ccuYQShB.s:994: Warning: dwarf line number information for .data ignored
encrypt.c: /tmp/ccuYQShB.s:1001: Warning: dwarf line number information for .data ignored
encrypt.c: /tmp/ccuYQShB.s:1004: Warning: dwarf line number information for .data ignored
encrypt.c: /tmp/ccuYQShB.s:1009: Warning: dwarf line number information for .data ignored
encrypt.c: /tmp/ccuYQShB.s:1014: Warning: dwarf line number information for .data ignored
encrypt.c: /tmp/ccuYQShB.s:1017: Warning: dwarf line number information for .data ignored
encrypt.c: ...
Number of similar (implementation,compiler) pairs: 1, namely:
Implementation | Compiler |
T:avx1 | gcc -march=native -mtune=native -O2 -fwrapv -fPIC -fPIE -gdwarf-4 -Wall (12.2.0) |
Compiler output
encrypt.c: /tmp/cc8s5A30.s: Assembler messages:
encrypt.c: /tmp/cc8s5A30.s:922: Warning: dwarf line number information for .data ignored
encrypt.c: /tmp/cc8s5A30.s:924: Warning: dwarf line number information for .data ignored
encrypt.c: /tmp/cc8s5A30.s:925: Warning: dwarf line number information for .data ignored
encrypt.c: /tmp/cc8s5A30.s:926: Warning: dwarf line number information for .data ignored
encrypt.c: /tmp/cc8s5A30.s:937: Warning: dwarf line number information for .data ignored
encrypt.c: /tmp/cc8s5A30.s:944: Warning: dwarf line number information for .data ignored
encrypt.c: /tmp/cc8s5A30.s:947: Warning: dwarf line number information for .data ignored
encrypt.c: /tmp/cc8s5A30.s:948: Warning: dwarf line number information for .data ignored
encrypt.c: /tmp/cc8s5A30.s:955: Warning: dwarf line number information for .data ignored
encrypt.c: /tmp/cc8s5A30.s:956: Warning: dwarf line number information for .data ignored
encrypt.c: /tmp/cc8s5A30.s:959: Warning: dwarf line number information for .data ignored
encrypt.c: /tmp/cc8s5A30.s:961: Warning: dwarf line number information for .data ignored
encrypt.c: /tmp/cc8s5A30.s:964: Warning: dwarf line number information for .data ignored
encrypt.c: /tmp/cc8s5A30.s:972: Warning: dwarf line number information for .data ignored
encrypt.c: /tmp/cc8s5A30.s:983: Warning: dwarf line number information for .data ignored
encrypt.c: /tmp/cc8s5A30.s:985: Warning: dwarf line number information for .data ignored
encrypt.c: /tmp/cc8s5A30.s:986: Warning: dwarf line number information for .data ignored
encrypt.c: /tmp/cc8s5A30.s:987: Warning: dwarf line number information for .data ignored
encrypt.c: /tmp/cc8s5A30.s:994: Warning: dwarf line number information for .data ignored
encrypt.c: /tmp/cc8s5A30.s:1001: Warning: dwarf line number information for .data ignored
encrypt.c: /tmp/cc8s5A30.s:1004: Warning: dwarf line number information for .data ignored
encrypt.c: /tmp/cc8s5A30.s:1009: Warning: dwarf line number information for .data ignored
encrypt.c: /tmp/cc8s5A30.s:1014: Warning: dwarf line number information for .data ignored
encrypt.c: /tmp/cc8s5A30.s:1017: Warning: dwarf line number information for .data ignored
encrypt.c: ...
Number of similar (implementation,compiler) pairs: 1, namely:
Implementation | Compiler |
T:avx1 | gcc -march=native -mtune=native -O3 -fwrapv -fPIC -fPIE -gdwarf-4 -Wall (12.2.0) |
Compiler output
encrypt.c: /tmp/ccJDDlon.s: Assembler messages:
encrypt.c: /tmp/ccJDDlon.s:921: Warning: dwarf line number information for .data ignored
encrypt.c: /tmp/ccJDDlon.s:923: Warning: dwarf line number information for .data ignored
encrypt.c: /tmp/ccJDDlon.s:934: Warning: dwarf line number information for .data ignored
encrypt.c: /tmp/ccJDDlon.s:935: Warning: dwarf line number information for .data ignored
encrypt.c: /tmp/ccJDDlon.s:936: Warning: dwarf line number information for .data ignored
encrypt.c: /tmp/ccJDDlon.s:943: Warning: dwarf line number information for .data ignored
encrypt.c: /tmp/ccJDDlon.s:946: Warning: dwarf line number information for .data ignored
encrypt.c: /tmp/ccJDDlon.s:947: Warning: dwarf line number information for .data ignored
encrypt.c: /tmp/ccJDDlon.s:952: Warning: dwarf line number information for .data ignored
encrypt.c: /tmp/ccJDDlon.s:953: Warning: dwarf line number information for .data ignored
encrypt.c: /tmp/ccJDDlon.s:956: Warning: dwarf line number information for .data ignored
encrypt.c: /tmp/ccJDDlon.s:958: Warning: dwarf line number information for .data ignored
encrypt.c: /tmp/ccJDDlon.s:961: Warning: dwarf line number information for .data ignored
encrypt.c: /tmp/ccJDDlon.s:969: Warning: dwarf line number information for .data ignored
encrypt.c: /tmp/ccJDDlon.s:979: Warning: dwarf line number information for .data ignored
encrypt.c: /tmp/ccJDDlon.s:981: Warning: dwarf line number information for .data ignored
encrypt.c: /tmp/ccJDDlon.s:993: Warning: dwarf line number information for .data ignored
encrypt.c: /tmp/ccJDDlon.s:997: Warning: dwarf line number information for .data ignored
encrypt.c: /tmp/ccJDDlon.s:998: Warning: dwarf line number information for .data ignored
encrypt.c: /tmp/ccJDDlon.s:999: Warning: dwarf line number information for .data ignored
encrypt.c: /tmp/ccJDDlon.s:1006: Warning: dwarf line number information for .data ignored
encrypt.c: /tmp/ccJDDlon.s:1009: Warning: dwarf line number information for .data ignored
encrypt.c: /tmp/ccJDDlon.s:1012: Warning: dwarf line number information for .data ignored
encrypt.c: /tmp/ccJDDlon.s:1015: Warning: dwarf line number information for .data ignored
encrypt.c: ...
Number of similar (implementation,compiler) pairs: 1, namely:
Implementation | Compiler |
T:avx1 | gcc -march=native -mtune=native -O -fwrapv -fPIC -fPIE -gdwarf-4 -Wall (12.2.0) |
Compiler output
encrypt.c: /tmp/ccmwU1h0.s: Assembler messages:
encrypt.c: /tmp/ccmwU1h0.s:921: Warning: dwarf line number information for .data ignored
encrypt.c: /tmp/ccmwU1h0.s:923: Warning: dwarf line number information for .data ignored
encrypt.c: /tmp/ccmwU1h0.s:924: Warning: dwarf line number information for .data ignored
encrypt.c: /tmp/ccmwU1h0.s:925: Warning: dwarf line number information for .data ignored
encrypt.c: /tmp/ccmwU1h0.s:936: Warning: dwarf line number information for .data ignored
encrypt.c: /tmp/ccmwU1h0.s:943: Warning: dwarf line number information for .data ignored
encrypt.c: /tmp/ccmwU1h0.s:946: Warning: dwarf line number information for .data ignored
encrypt.c: /tmp/ccmwU1h0.s:947: Warning: dwarf line number information for .data ignored
encrypt.c: /tmp/ccmwU1h0.s:954: Warning: dwarf line number information for .data ignored
encrypt.c: /tmp/ccmwU1h0.s:955: Warning: dwarf line number information for .data ignored
encrypt.c: /tmp/ccmwU1h0.s:958: Warning: dwarf line number information for .data ignored
encrypt.c: /tmp/ccmwU1h0.s:960: Warning: dwarf line number information for .data ignored
encrypt.c: /tmp/ccmwU1h0.s:963: Warning: dwarf line number information for .data ignored
encrypt.c: /tmp/ccmwU1h0.s:971: Warning: dwarf line number information for .data ignored
encrypt.c: /tmp/ccmwU1h0.s:981: Warning: dwarf line number information for .data ignored
encrypt.c: /tmp/ccmwU1h0.s:983: Warning: dwarf line number information for .data ignored
encrypt.c: /tmp/ccmwU1h0.s:984: Warning: dwarf line number information for .data ignored
encrypt.c: /tmp/ccmwU1h0.s:985: Warning: dwarf line number information for .data ignored
encrypt.c: /tmp/ccmwU1h0.s:992: Warning: dwarf line number information for .data ignored
encrypt.c: /tmp/ccmwU1h0.s:999: Warning: dwarf line number information for .data ignored
encrypt.c: /tmp/ccmwU1h0.s:1002: Warning: dwarf line number information for .data ignored
encrypt.c: /tmp/ccmwU1h0.s:1005: Warning: dwarf line number information for .data ignored
encrypt.c: /tmp/ccmwU1h0.s:1012: Warning: dwarf line number information for .data ignored
encrypt.c: /tmp/ccmwU1h0.s:1015: Warning: dwarf line number information for .data ignored
encrypt.c: ...
Number of similar (implementation,compiler) pairs: 1, namely:
Implementation | Compiler |
T:avx1 | gcc -march=native -mtune=native -Os -fwrapv -fPIC -fPIE -gdwarf-4 -Wall (12.2.0) |
Compiler output
try.c: /usr/bin/ld: libcrypto_aead_omdsha256k128n96tau64v1.a(omdsha256.o):.../supercop-data/know/amd64/try/c/clang_-march=native_-O2_-fwrapv_-Qunused-arguments_-fPIC_-fPIE_-gdwarf-4_-Wall/timingleaks/crypto_aead/omdsha256k128n96tau64v1/sse4/work/./omdsha256.h:137: multiple definition of `Hash'; libcrypto_aead_omdsha256k128n96tau64v1.a(encrypt.o):.../supercop-data/know/amd64/try/c/clang_-march=native_-O2_-fwrapv_-Qunused-arguments_-fPIC_-fPIE_-gdwarf-4_-Wall/timingleaks/crypto_aead/omdsha256k128n96tau64v1/sse4/work/./omdsha256.h:137: first defined here
try.c: clang: error: linker command failed with exit code 1 (use -v to see invocation)
Number of similar (implementation,compiler) pairs: 1, namely:
Implementation | Compiler |
T:sse4 | clang -march=native -O2 -fwrapv -Qunused-arguments -fPIC -fPIE -gdwarf-4 -Wall (Debian_Clang_14.0.6) |
Compiler output
try.c: /usr/bin/ld: libcrypto_aead_omdsha256k128n96tau64v1.a(omdsha256.o):.../supercop-data/know/amd64/try/c/clang_-march=native_-O3_-fwrapv_-Qunused-arguments_-fPIC_-fPIE_-gdwarf-4_-Wall/timingleaks/crypto_aead/omdsha256k128n96tau64v1/sse4/work/./omdsha256.h:137: multiple definition of `Hash'; libcrypto_aead_omdsha256k128n96tau64v1.a(encrypt.o):.../supercop-data/know/amd64/try/c/clang_-march=native_-O3_-fwrapv_-Qunused-arguments_-fPIC_-fPIE_-gdwarf-4_-Wall/timingleaks/crypto_aead/omdsha256k128n96tau64v1/sse4/work/./omdsha256.h:137: first defined here
try.c: clang: error: linker command failed with exit code 1 (use -v to see invocation)
Number of similar (implementation,compiler) pairs: 1, namely:
Implementation | Compiler |
T:sse4 | clang -march=native -O3 -fwrapv -Qunused-arguments -fPIC -fPIE -gdwarf-4 -Wall (Debian_Clang_14.0.6) |
Compiler output
try.c: /usr/bin/ld: libcrypto_aead_omdsha256k128n96tau64v1.a(omdsha256.o):.../supercop-data/know/amd64/try/c/clang_-march=native_-O_-fwrapv_-Qunused-arguments_-fPIC_-fPIE_-gdwarf-4_-Wall/timingleaks/crypto_aead/omdsha256k128n96tau64v1/sse4/work/./omdsha256.h:137: multiple definition of `Hash'; libcrypto_aead_omdsha256k128n96tau64v1.a(encrypt.o):.../supercop-data/know/amd64/try/c/clang_-march=native_-O_-fwrapv_-Qunused-arguments_-fPIC_-fPIE_-gdwarf-4_-Wall/timingleaks/crypto_aead/omdsha256k128n96tau64v1/sse4/work/./omdsha256.h:137: first defined here
try.c: clang: error: linker command failed with exit code 1 (use -v to see invocation)
Number of similar (implementation,compiler) pairs: 1, namely:
Implementation | Compiler |
T:sse4 | clang -march=native -O -fwrapv -Qunused-arguments -fPIC -fPIE -gdwarf-4 -Wall (Debian_Clang_14.0.6) |
Compiler output
try.c: /usr/bin/ld: libcrypto_aead_omdsha256k128n96tau64v1.a(omdsha256.o):.../supercop-data/know/amd64/try/c/clang_-march=native_-Os_-fwrapv_-Qunused-arguments_-fPIC_-fPIE_-gdwarf-4_-Wall/timingleaks/crypto_aead/omdsha256k128n96tau64v1/sse4/work/./omdsha256.h:137: multiple definition of `Hash'; libcrypto_aead_omdsha256k128n96tau64v1.a(encrypt.o):.../supercop-data/know/amd64/try/c/clang_-march=native_-Os_-fwrapv_-Qunused-arguments_-fPIC_-fPIE_-gdwarf-4_-Wall/timingleaks/crypto_aead/omdsha256k128n96tau64v1/sse4/work/./omdsha256.h:137: first defined here
try.c: clang: error: linker command failed with exit code 1 (use -v to see invocation)
Number of similar (implementation,compiler) pairs: 1, namely:
Implementation | Compiler |
T:sse4 | clang -march=native -Os -fwrapv -Qunused-arguments -fPIC -fPIE -gdwarf-4 -Wall (Debian_Clang_14.0.6) |
Compiler output
try.c: /usr/bin/ld: libcrypto_aead_omdsha256k128n96tau64v1.a(omdsha256.o):.../supercop-data/know/amd64/try/c/clang_-mcpu=native_-O3_-fwrapv_-Qunused-arguments_-fPIC_-fPIE_-gdwarf-4_-Wall/timingleaks/crypto_aead/omdsha256k128n96tau64v1/sse4/work/./omdsha256.h:137: multiple definition of `Hash'; libcrypto_aead_omdsha256k128n96tau64v1.a(encrypt.o):.../supercop-data/know/amd64/try/c/clang_-mcpu=native_-O3_-fwrapv_-Qunused-arguments_-fPIC_-fPIE_-gdwarf-4_-Wall/timingleaks/crypto_aead/omdsha256k128n96tau64v1/sse4/work/./omdsha256.h:137: first defined here
try.c: clang: error: linker command failed with exit code 1 (use -v to see invocation)
Number of similar (implementation,compiler) pairs: 1, namely:
Implementation | Compiler |
T:sse4 | clang -mcpu=native -O3 -fwrapv -Qunused-arguments -fPIC -fPIE -gdwarf-4 -Wall (Debian_Clang_14.0.6) |
Compiler output
encrypt.c: /tmp/ccC7kedf.s: Assembler messages:
encrypt.c: /tmp/ccC7kedf.s:961: Warning: dwarf line number information for .data ignored
encrypt.c: /tmp/ccC7kedf.s:963: Warning: dwarf line number information for .data ignored
encrypt.c: /tmp/ccC7kedf.s:964: Warning: dwarf line number information for .data ignored
encrypt.c: /tmp/ccC7kedf.s:965: Warning: dwarf line number information for .data ignored
encrypt.c: /tmp/ccC7kedf.s:976: Warning: dwarf line number information for .data ignored
encrypt.c: /tmp/ccC7kedf.s:983: Warning: dwarf line number information for .data ignored
encrypt.c: /tmp/ccC7kedf.s:986: Warning: dwarf line number information for .data ignored
encrypt.c: /tmp/ccC7kedf.s:987: Warning: dwarf line number information for .data ignored
encrypt.c: /tmp/ccC7kedf.s:994: Warning: dwarf line number information for .data ignored
encrypt.c: /tmp/ccC7kedf.s:995: Warning: dwarf line number information for .data ignored
encrypt.c: /tmp/ccC7kedf.s:998: Warning: dwarf line number information for .data ignored
encrypt.c: /tmp/ccC7kedf.s:1000: Warning: dwarf line number information for .data ignored
encrypt.c: /tmp/ccC7kedf.s:1003: Warning: dwarf line number information for .data ignored
encrypt.c: /tmp/ccC7kedf.s:1011: Warning: dwarf line number information for .data ignored
encrypt.c: /tmp/ccC7kedf.s:1022: Warning: dwarf line number information for .data ignored
encrypt.c: /tmp/ccC7kedf.s:1024: Warning: dwarf line number information for .data ignored
encrypt.c: /tmp/ccC7kedf.s:1025: Warning: dwarf line number information for .data ignored
encrypt.c: /tmp/ccC7kedf.s:1026: Warning: dwarf line number information for .data ignored
encrypt.c: /tmp/ccC7kedf.s:1033: Warning: dwarf line number information for .data ignored
encrypt.c: /tmp/ccC7kedf.s:1040: Warning: dwarf line number information for .data ignored
encrypt.c: /tmp/ccC7kedf.s:1043: Warning: dwarf line number information for .data ignored
encrypt.c: /tmp/ccC7kedf.s:1048: Warning: dwarf line number information for .data ignored
encrypt.c: /tmp/ccC7kedf.s:1053: Warning: dwarf line number information for .data ignored
encrypt.c: /tmp/ccC7kedf.s:1056: Warning: dwarf line number information for .data ignored
encrypt.c: ...
Number of similar (implementation,compiler) pairs: 1, namely:
Implementation | Compiler |
T:sse4 | gcc -march=native -mtune=native -O2 -fwrapv -fPIC -fPIE -gdwarf-4 -Wall (12.2.0) |
Compiler output
encrypt.c: /tmp/ccIEzsBH.s: Assembler messages:
encrypt.c: /tmp/ccIEzsBH.s:961: Warning: dwarf line number information for .data ignored
encrypt.c: /tmp/ccIEzsBH.s:963: Warning: dwarf line number information for .data ignored
encrypt.c: /tmp/ccIEzsBH.s:964: Warning: dwarf line number information for .data ignored
encrypt.c: /tmp/ccIEzsBH.s:965: Warning: dwarf line number information for .data ignored
encrypt.c: /tmp/ccIEzsBH.s:976: Warning: dwarf line number information for .data ignored
encrypt.c: /tmp/ccIEzsBH.s:983: Warning: dwarf line number information for .data ignored
encrypt.c: /tmp/ccIEzsBH.s:986: Warning: dwarf line number information for .data ignored
encrypt.c: /tmp/ccIEzsBH.s:987: Warning: dwarf line number information for .data ignored
encrypt.c: /tmp/ccIEzsBH.s:994: Warning: dwarf line number information for .data ignored
encrypt.c: /tmp/ccIEzsBH.s:995: Warning: dwarf line number information for .data ignored
encrypt.c: /tmp/ccIEzsBH.s:998: Warning: dwarf line number information for .data ignored
encrypt.c: /tmp/ccIEzsBH.s:1000: Warning: dwarf line number information for .data ignored
encrypt.c: /tmp/ccIEzsBH.s:1003: Warning: dwarf line number information for .data ignored
encrypt.c: /tmp/ccIEzsBH.s:1011: Warning: dwarf line number information for .data ignored
encrypt.c: /tmp/ccIEzsBH.s:1022: Warning: dwarf line number information for .data ignored
encrypt.c: /tmp/ccIEzsBH.s:1024: Warning: dwarf line number information for .data ignored
encrypt.c: /tmp/ccIEzsBH.s:1025: Warning: dwarf line number information for .data ignored
encrypt.c: /tmp/ccIEzsBH.s:1026: Warning: dwarf line number information for .data ignored
encrypt.c: /tmp/ccIEzsBH.s:1033: Warning: dwarf line number information for .data ignored
encrypt.c: /tmp/ccIEzsBH.s:1040: Warning: dwarf line number information for .data ignored
encrypt.c: /tmp/ccIEzsBH.s:1043: Warning: dwarf line number information for .data ignored
encrypt.c: /tmp/ccIEzsBH.s:1048: Warning: dwarf line number information for .data ignored
encrypt.c: /tmp/ccIEzsBH.s:1053: Warning: dwarf line number information for .data ignored
encrypt.c: /tmp/ccIEzsBH.s:1056: Warning: dwarf line number information for .data ignored
encrypt.c: ...
Number of similar (implementation,compiler) pairs: 1, namely:
Implementation | Compiler |
T:sse4 | gcc -march=native -mtune=native -O3 -fwrapv -fPIC -fPIE -gdwarf-4 -Wall (12.2.0) |
Compiler output
encrypt.c: /tmp/ccei05BR.s: Assembler messages:
encrypt.c: /tmp/ccei05BR.s:960: Warning: dwarf line number information for .data ignored
encrypt.c: /tmp/ccei05BR.s:962: Warning: dwarf line number information for .data ignored
encrypt.c: /tmp/ccei05BR.s:973: Warning: dwarf line number information for .data ignored
encrypt.c: /tmp/ccei05BR.s:974: Warning: dwarf line number information for .data ignored
encrypt.c: /tmp/ccei05BR.s:975: Warning: dwarf line number information for .data ignored
encrypt.c: /tmp/ccei05BR.s:982: Warning: dwarf line number information for .data ignored
encrypt.c: /tmp/ccei05BR.s:985: Warning: dwarf line number information for .data ignored
encrypt.c: /tmp/ccei05BR.s:986: Warning: dwarf line number information for .data ignored
encrypt.c: /tmp/ccei05BR.s:991: Warning: dwarf line number information for .data ignored
encrypt.c: /tmp/ccei05BR.s:992: Warning: dwarf line number information for .data ignored
encrypt.c: /tmp/ccei05BR.s:995: Warning: dwarf line number information for .data ignored
encrypt.c: /tmp/ccei05BR.s:997: Warning: dwarf line number information for .data ignored
encrypt.c: /tmp/ccei05BR.s:1000: Warning: dwarf line number information for .data ignored
encrypt.c: /tmp/ccei05BR.s:1008: Warning: dwarf line number information for .data ignored
encrypt.c: /tmp/ccei05BR.s:1018: Warning: dwarf line number information for .data ignored
encrypt.c: /tmp/ccei05BR.s:1020: Warning: dwarf line number information for .data ignored
encrypt.c: /tmp/ccei05BR.s:1032: Warning: dwarf line number information for .data ignored
encrypt.c: /tmp/ccei05BR.s:1036: Warning: dwarf line number information for .data ignored
encrypt.c: /tmp/ccei05BR.s:1037: Warning: dwarf line number information for .data ignored
encrypt.c: /tmp/ccei05BR.s:1038: Warning: dwarf line number information for .data ignored
encrypt.c: /tmp/ccei05BR.s:1045: Warning: dwarf line number information for .data ignored
encrypt.c: /tmp/ccei05BR.s:1048: Warning: dwarf line number information for .data ignored
encrypt.c: /tmp/ccei05BR.s:1051: Warning: dwarf line number information for .data ignored
encrypt.c: /tmp/ccei05BR.s:1054: Warning: dwarf line number information for .data ignored
encrypt.c: ...
Number of similar (implementation,compiler) pairs: 1, namely:
Implementation | Compiler |
T:sse4 | gcc -march=native -mtune=native -O -fwrapv -fPIC -fPIE -gdwarf-4 -Wall (12.2.0) |
Compiler output
encrypt.c: /tmp/ccY7pAgG.s: Assembler messages:
encrypt.c: /tmp/ccY7pAgG.s:960: Warning: dwarf line number information for .data ignored
encrypt.c: /tmp/ccY7pAgG.s:962: Warning: dwarf line number information for .data ignored
encrypt.c: /tmp/ccY7pAgG.s:963: Warning: dwarf line number information for .data ignored
encrypt.c: /tmp/ccY7pAgG.s:964: Warning: dwarf line number information for .data ignored
encrypt.c: /tmp/ccY7pAgG.s:975: Warning: dwarf line number information for .data ignored
encrypt.c: /tmp/ccY7pAgG.s:982: Warning: dwarf line number information for .data ignored
encrypt.c: /tmp/ccY7pAgG.s:985: Warning: dwarf line number information for .data ignored
encrypt.c: /tmp/ccY7pAgG.s:986: Warning: dwarf line number information for .data ignored
encrypt.c: /tmp/ccY7pAgG.s:993: Warning: dwarf line number information for .data ignored
encrypt.c: /tmp/ccY7pAgG.s:994: Warning: dwarf line number information for .data ignored
encrypt.c: /tmp/ccY7pAgG.s:997: Warning: dwarf line number information for .data ignored
encrypt.c: /tmp/ccY7pAgG.s:999: Warning: dwarf line number information for .data ignored
encrypt.c: /tmp/ccY7pAgG.s:1002: Warning: dwarf line number information for .data ignored
encrypt.c: /tmp/ccY7pAgG.s:1010: Warning: dwarf line number information for .data ignored
encrypt.c: /tmp/ccY7pAgG.s:1020: Warning: dwarf line number information for .data ignored
encrypt.c: /tmp/ccY7pAgG.s:1022: Warning: dwarf line number information for .data ignored
encrypt.c: /tmp/ccY7pAgG.s:1023: Warning: dwarf line number information for .data ignored
encrypt.c: /tmp/ccY7pAgG.s:1024: Warning: dwarf line number information for .data ignored
encrypt.c: /tmp/ccY7pAgG.s:1031: Warning: dwarf line number information for .data ignored
encrypt.c: /tmp/ccY7pAgG.s:1038: Warning: dwarf line number information for .data ignored
encrypt.c: /tmp/ccY7pAgG.s:1041: Warning: dwarf line number information for .data ignored
encrypt.c: /tmp/ccY7pAgG.s:1044: Warning: dwarf line number information for .data ignored
encrypt.c: /tmp/ccY7pAgG.s:1051: Warning: dwarf line number information for .data ignored
encrypt.c: /tmp/ccY7pAgG.s:1054: Warning: dwarf line number information for .data ignored
encrypt.c: ...
Number of similar (implementation,compiler) pairs: 1, namely:
Implementation | Compiler |
T:sse4 | gcc -march=native -mtune=native -Os -fwrapv -fPIC -fPIE -gdwarf-4 -Wall (12.2.0) |
Namespace violations
omdsha256.o calc_L_i T
omdsha256.o double_block T
omdsha256.o final_masking_associated_data T
omdsha256.o final_masking_message T
omdsha256.o hash T
omdsha256.o increment_masking_associated_data T
omdsha256.o increment_masking_message T
omdsha256.o key_func T
omdsha256.o l2b T
omdsha256.o ntz T
omdsha256.o omdsha256_process T
omdsha256.o triple_block T
omdsha256.o xor_block T
sha256.o sha256_comp T
Number of similar (implementation,compiler) pairs: 9, namely:
Implementation | Compiler |
T:ref | clang -march=native -O2 -fwrapv -Qunused-arguments -fPIC -fPIE -gdwarf-4 -Wall (Debian_Clang_14.0.6) |
T:ref | clang -march=native -O3 -fwrapv -Qunused-arguments -fPIC -fPIE -gdwarf-4 -Wall (Debian_Clang_14.0.6) |
T:ref | clang -march=native -O -fwrapv -Qunused-arguments -fPIC -fPIE -gdwarf-4 -Wall (Debian_Clang_14.0.6) |
T:ref | clang -march=native -Os -fwrapv -Qunused-arguments -fPIC -fPIE -gdwarf-4 -Wall (Debian_Clang_14.0.6) |
T:ref | clang -mcpu=native -O3 -fwrapv -Qunused-arguments -fPIC -fPIE -gdwarf-4 -Wall (Debian_Clang_14.0.6) |
T:ref | gcc -march=native -mtune=native -O2 -fwrapv -fPIC -fPIE -gdwarf-4 -Wall (12.2.0) |
T:ref | gcc -march=native -mtune=native -O3 -fwrapv -fPIC -fPIE -gdwarf-4 -Wall (12.2.0) |
T:ref | gcc -march=native -mtune=native -O -fwrapv -fPIC -fPIE -gdwarf-4 -Wall (12.2.0) |
T:ref | gcc -march=native -mtune=native -Os -fwrapv -fPIC -fPIE -gdwarf-4 -Wall (12.2.0) |